zookeeper-dev mailing list archives

Site index · List index
Message view « Date » · « Thread »
Top « Date » · « Thread »
From Apache Jenkins Server <jenk...@builds.apache.org>
Subject ZooKeeper_branch35_openjdk7 - Build # 556 - Failure
Date Thu, 08 Jun 2017 16:59:44 GMT
See https://builds.apache.org/job/ZooKeeper_branch35_openjdk7/556/

###################################################################################
########################## LAST 60 LINES OF THE CONSOLE ###########################
[...truncated 62.35 MB...]
    [junit] 	at org.apache.zookeeper.ClientCnxn$SendThread.run(ClientCnxn.java:1214)
    [junit] 2017-06-08 16:59:36,783 [myid:127.0.0.1:19547] - INFO  [main-SendThread(127.0.0.1:19547):ClientCnxn$SendThread@1113]
- Opening socket connection to server 127.0.0.1/127.0.0.1:19547. Will not attempt to authenticate
using SASL (unknown error)
    [junit] 2017-06-08 16:59:36,783 [myid:127.0.0.1:19547] - INFO  [main-SendThread(127.0.0.1:19547):ClientCnxn$SendThread@946]
- Socket connection established, initiating session, client: /127.0.0.1:51824, server: 127.0.0.1/127.0.0.1:19547
    [junit] 2017-06-08 16:59:36,784 [myid:] - INFO  [New I/O worker #9949:ZooKeeperServer@1025]
- Client attempting to renew session 0x104b3994f320000 at /127.0.0.1:51824
    [junit] 2017-06-08 16:59:36,784 [myid:] - INFO  [New I/O worker #9949:ZooKeeperServer@727]
- Established session 0x104b3994f320000 with negotiated timeout 6000 for client /127.0.0.1:51824
    [junit] 2017-06-08 16:59:36,784 [myid:127.0.0.1:19547] - INFO  [main-SendThread(127.0.0.1:19547):ClientCnxn$SendThread@1381]
- Session establishment complete on server 127.0.0.1/127.0.0.1:19547, sessionid = 0x104b3994f320000,
negotiated timeout = 6000
    [junit] 2017-06-08 16:59:36,787 [myid:] - INFO  [SyncThread:0:FileTxnLog@206] - Creating
new log file: log.7
    [junit] 2017-06-08 16:59:37,567 [myid:127.0.0.1:19427] - INFO  [main-SendThread(127.0.0.1:19427):ClientCnxn$SendThread@1113]
- Opening socket connection to server 127.0.0.1/127.0.0.1:19427. Will not attempt to authenticate
using SASL (unknown error)
    [junit] 2017-06-08 16:59:37,567 [myid:127.0.0.1:19427] - WARN  [main-SendThread(127.0.0.1:19427):ClientCnxn$SendThread@1235]
- Session 0x204b395f3120000 for server 127.0.0.1/127.0.0.1:19427, unexpected error, closing
socket connection and attempting reconnect
    [junit] java.net.ConnectException: Connection refused
    [junit] 	at sun.nio.ch.SocketChannelImpl.checkConnect(Native Method)
    [junit] 	at sun.nio.ch.SocketChannelImpl.finishConnect(SocketChannelImpl.java:739)
    [junit] 	at org.apache.zookeeper.ClientCnxnSocketNIO.doTransport(ClientCnxnSocketNIO.java:357)
    [junit] 	at org.apache.zookeeper.ClientCnxn$SendThread.run(ClientCnxn.java:1214)
    [junit] 2017-06-08 16:59:37,800 [myid:] - INFO  [ProcessThread(sid:0 cport:19547)::PrepRequestProcessor@613]
- Processed session termination for sessionid: 0x104b3994f320000
    [junit] 2017-06-08 16:59:37,801 [myid:] - INFO  [SyncThread:0:MBeanRegistry@128] - Unregister
MBean [org.apache.ZooKeeperService:name0=StandaloneServer_port19547,name1=Connections,name2=127.0.0.1,name3=0x104b3994f320000]
    [junit] 2017-06-08 16:59:37,801 [myid:] - INFO  [main:ZooKeeper@1331] - Session: 0x104b3994f320000
closed
    [junit] 2017-06-08 16:59:37,802 [myid:] - INFO  [main-EventThread:ClientCnxn$EventThread@513]
- EventThread shut down for session: 0x104b3994f320000
    [junit] 2017-06-08 16:59:37,803 [myid:] - INFO  [main:JUnit4ZKTestRunner$LoggedInvokeMethod@82]
- Memory used 229900
    [junit] 2017-06-08 16:59:37,804 [myid:] - INFO  [main:JUnit4ZKTestRunner$LoggedInvokeMethod@87]
- Number of threads 2427
    [junit] 2017-06-08 16:59:37,804 [myid:] - INFO  [main:JUnit4ZKTestRunner$LoggedInvokeMethod@102]
- FINISHED TEST METHOD testWatcherAutoResetWithLocal
    [junit] 2017-06-08 16:59:37,804 [myid:] - INFO  [main:ClientBase@586] - tearDown starting
    [junit] 2017-06-08 16:59:37,804 [myid:] - INFO  [main:ClientBase@556] - STOPPING server
    [junit] 2017-06-08 16:59:37,804 [myid:] - INFO  [main:NettyServerCnxnFactory@464] - shutdown
called 0.0.0.0/0.0.0.0:19547
    [junit] 2017-06-08 16:59:37,811 [myid:] - INFO  [main:ZooKeeperServer@541] - shutting
down
    [junit] 2017-06-08 16:59:37,811 [myid:] - ERROR [main:ZooKeeperServer@505] - ZKShutdownHandler
is not registered, so ZooKeeper server won't take any action on ERROR or SHUTDOWN server state
changes
    [junit] 2017-06-08 16:59:37,811 [myid:] - INFO  [main:SessionTrackerImpl@232] - Shutting
down
    [junit] 2017-06-08 16:59:37,812 [myid:] - INFO  [main:PrepRequestProcessor@1010] - Shutting
down
    [junit] 2017-06-08 16:59:37,812 [myid:] - INFO  [main:SyncRequestProcessor@191] - Shutting
down
    [junit] 2017-06-08 16:59:37,812 [myid:] - INFO  [ProcessThread(sid:0 cport:19547)::PrepRequestProcessor@156]
- PrepRequestProcessor exited loop!
    [junit] 2017-06-08 16:59:37,813 [myid:] - INFO  [SyncThread:0:SyncRequestProcessor@169]
- SyncRequestProcessor exited!
    [junit] 2017-06-08 16:59:37,813 [myid:] - INFO  [main:FinalRequestProcessor@481] - shutdown
of request processor complete
    [junit] 2017-06-08 16:59:37,813 [myid:] - INFO  [main:MBeanRegistry@128] - Unregister
MBean [org.apache.ZooKeeperService:name0=StandaloneServer_port19547,name1=InMemoryDataTree]
    [junit] 2017-06-08 16:59:37,813 [myid:] - INFO  [main:MBeanRegistry@128] - Unregister
MBean [org.apache.ZooKeeperService:name0=StandaloneServer_port19547]
    [junit] 2017-06-08 16:59:37,814 [myid:] - INFO  [main:FourLetterWordMain@85] - connecting
to 127.0.0.1 19547
    [junit] 2017-06-08 16:59:37,814 [myid:] - INFO  [main:JMXEnv@146] - ensureOnly:[]
    [junit] 2017-06-08 16:59:37,817 [myid:127.0.0.1:19430] - INFO  [main-SendThread(127.0.0.1:19430):ClientCnxn$SendThread@1113]
- Opening socket connection to server 127.0.0.1/127.0.0.1:19430. Will not attempt to authenticate
using SASL (unknown error)
    [junit] 2017-06-08 16:59:37,818 [myid:127.0.0.1:19430] - WARN  [main-SendThread(127.0.0.1:19430):ClientCnxn$SendThread@1235]
- Session 0x304b395ef340000 for server 127.0.0.1/127.0.0.1:19430, unexpected error, closing
socket connection and attempting reconnect
    [junit] java.net.ConnectException: Connection refused
    [junit] 	at sun.nio.ch.SocketChannelImpl.checkConnect(Native Method)
    [junit] 	at sun.nio.ch.SocketChannelImpl.finishConnect(SocketChannelImpl.java:739)
    [junit] 	at org.apache.zookeeper.ClientCnxnSocketNIO.doTransport(ClientCnxnSocketNIO.java:357)
    [junit] 	at org.apache.zookeeper.ClientCnxn$SendThread.run(ClientCnxn.java:1214)
    [junit] 2017-06-08 16:59:37,823 [myid:] - INFO  [main:ClientBase@611] - fdcount after
test is: 7148 at start it was 7148
    [junit] 2017-06-08 16:59:37,823 [myid:] - INFO  [main:ZKTestCase$1@68] - SUCCEEDED testWatcherAutoResetWithLocal
    [junit] 2017-06-08 16:59:37,823 [myid:] - INFO  [main:ZKTestCase$1@63] - FINISHED testWatcherAutoResetWithLocal
    [junit] Tests run: 103, Failures: 0, Errors: 0, Skipped: 0, Time elapsed: 471.817 sec,
Thread: 4, Class: org.apache.zookeeper.test.NioNettySuiteTest

fail.build.on.test.failure:

BUILD FAILED
/home/jenkins/jenkins-slave/workspace/ZooKeeper_branch35_openjdk7/build.xml:1219: The following
error occurred while executing this line:
/home/jenkins/jenkins-slave/workspace/ZooKeeper_branch35_openjdk7/build.xml:1223: Tests failed!

Total time: 11 minutes 2 seconds
Build step 'Invoke Ant' marked build as failure
Recording test results
Email was triggered for: Failure - Any
Sending email for trigger: Failure - Any



###################################################################################
############################## FAILED TESTS (if any) ##############################
1 tests failed.
FAILED:  org.apache.zookeeper.server.quorum.ReconfigDuringLeaderSyncTest.testDuringLeaderSync

Error Message:
zoo.cfg.dynamic.next is not deleted.

Stack Trace:
junit.framework.AssertionFailedError: zoo.cfg.dynamic.next is not deleted.
	at org.apache.zookeeper.server.quorum.ReconfigDuringLeaderSyncTest.testDuringLeaderSync(ReconfigDuringLeaderSyncTest.java:165)
	at org.apache.zookeeper.JUnit4ZKTestRunner$LoggedInvokeMethod.evaluate(JUnit4ZKTestRunner.java:79)
Mime
  • Unnamed multipart/mixed (inline, None, 0 bytes)
View raw message