zookeeper-dev mailing list archives

Site index · List index
Message view « Date » · « Thread »
Top « Date » · « Thread »
From Apache Jenkins Server <jenk...@builds.apache.org>
Subject ZooKeeper-trunk-jdk8 - Build # 1084 - Still Failing
Date Sun, 11 Jun 2017 11:56:52 GMT
See https://builds.apache.org/job/ZooKeeper-trunk-jdk8/1084/

###################################################################################
########################## LAST 60 LINES OF THE CONSOLE ###########################
[...truncated 61.83 MB...]
    [junit] 2017-06-11 11:56:18,166 [myid:127.0.0.1:19301] - WARN  [main-SendThread(127.0.0.1:19301):ClientCnxn$SendThread@1235]
- Session 0x104106d46480000 for server 127.0.0.1/127.0.0.1:19301, unexpected error, closing
socket connection and attempting reconnect
    [junit] java.net.ConnectException: Connection refused
    [junit] 	at sun.nio.ch.SocketChannelImpl.checkConnect(Native Method)
    [junit] 	at sun.nio.ch.SocketChannelImpl.finishConnect(SocketChannelImpl.java:717)
    [junit] 	at org.apache.zookeeper.ClientCnxnSocketNIO.doTransport(ClientCnxnSocketNIO.java:357)
    [junit] 	at org.apache.zookeeper.ClientCnxn$SendThread.run(ClientCnxn.java:1214)
    [junit] 2017-06-11 11:56:18,755 [myid:127.0.0.1:19430] - INFO  [main-SendThread(127.0.0.1:19430):ClientCnxn$SendThread@1113]
- Opening socket connection to server 127.0.0.1/127.0.0.1:19430. Will not attempt to authenticate
using SASL (unknown error)
    [junit] 2017-06-11 11:56:18,755 [myid:127.0.0.1:19430] - WARN  [main-SendThread(127.0.0.1:19430):ClientCnxn$SendThread@1235]
- Session 0x30410712b2b0000 for server 127.0.0.1/127.0.0.1:19430, unexpected error, closing
socket connection and attempting reconnect
    [junit] java.net.ConnectException: Connection refused
    [junit] 	at sun.nio.ch.SocketChannelImpl.checkConnect(Native Method)
    [junit] 	at sun.nio.ch.SocketChannelImpl.finishConnect(SocketChannelImpl.java:717)
    [junit] 	at org.apache.zookeeper.ClientCnxnSocketNIO.doTransport(ClientCnxnSocketNIO.java:357)
    [junit] 	at org.apache.zookeeper.ClientCnxn$SendThread.run(ClientCnxn.java:1214)
    [junit] 2017-06-11 11:56:18,828 [myid:] - INFO  [ProcessThread(sid:0 cport:19547)::PrepRequestProcessor@617]
- Processed session termination for sessionid: 0x104107482280000
    [junit] 2017-06-11 11:56:18,831 [myid:] - INFO  [main:ZooKeeper@1329] - Session: 0x104107482280000
closed
    [junit] 2017-06-11 11:56:18,831 [myid:] - INFO  [main-EventThread:ClientCnxn$EventThread@513]
- EventThread shut down for session: 0x104107482280000
    [junit] 2017-06-11 11:56:18,831 [myid:] - INFO  [SyncThread:0:MBeanRegistry@128] - Unregister
MBean [org.apache.ZooKeeperService:name0=StandaloneServer_port19547,name1=Connections,name2=127.0.0.1,name3=0x104107482280000]
    [junit] 2017-06-11 11:56:18,831 [myid:] - INFO  [main:JUnit4ZKTestRunner$LoggedInvokeMethod@82]
- Memory used 106511
    [junit] 2017-06-11 11:56:18,832 [myid:] - INFO  [main:JUnit4ZKTestRunner$LoggedInvokeMethod@87]
- Number of threads 859
    [junit] 2017-06-11 11:56:18,832 [myid:] - INFO  [main:JUnit4ZKTestRunner$LoggedInvokeMethod@102]
- FINISHED TEST METHOD testWatcherAutoResetWithLocal
    [junit] 2017-06-11 11:56:18,832 [myid:] - INFO  [main:ClientBase@601] - tearDown starting
    [junit] 2017-06-11 11:56:18,832 [myid:] - INFO  [main:ClientBase@571] - STOPPING server
    [junit] 2017-06-11 11:56:18,832 [myid:] - INFO  [main:NettyServerCnxnFactory@464] - shutdown
called 0.0.0.0/0.0.0.0:19547
    [junit] 2017-06-11 11:56:18,834 [myid:] - INFO  [main:ZooKeeperServer@542] - shutting
down
    [junit] 2017-06-11 11:56:18,834 [myid:] - ERROR [main:ZooKeeperServer@506] - ZKShutdownHandler
is not registered, so ZooKeeper server won't take any action on ERROR or SHUTDOWN server state
changes
    [junit] 2017-06-11 11:56:18,834 [myid:] - INFO  [main:SessionTrackerImpl@232] - Shutting
down
    [junit] 2017-06-11 11:56:18,834 [myid:] - INFO  [main:PrepRequestProcessor@1014] - Shutting
down
    [junit] 2017-06-11 11:56:18,835 [myid:] - INFO  [main:SyncRequestProcessor@191] - Shutting
down
    [junit] 2017-06-11 11:56:18,835 [myid:] - INFO  [ProcessThread(sid:0 cport:19547)::PrepRequestProcessor@157]
- PrepRequestProcessor exited loop!
    [junit] 2017-06-11 11:56:18,835 [myid:] - INFO  [SyncThread:0:SyncRequestProcessor@169]
- SyncRequestProcessor exited!
    [junit] 2017-06-11 11:56:18,835 [myid:] - INFO  [main:FinalRequestProcessor@481] - shutdown
of request processor complete
    [junit] 2017-06-11 11:56:18,835 [myid:] - INFO  [main:MBeanRegistry@128] - Unregister
MBean [org.apache.ZooKeeperService:name0=StandaloneServer_port19547,name1=InMemoryDataTree]
    [junit] 2017-06-11 11:56:18,835 [myid:] - INFO  [main:MBeanRegistry@128] - Unregister
MBean [org.apache.ZooKeeperService:name0=StandaloneServer_port19547]
    [junit] 2017-06-11 11:56:18,836 [myid:] - INFO  [main:FourLetterWordMain@85] - connecting
to 127.0.0.1 19547
    [junit] 2017-06-11 11:56:18,836 [myid:] - INFO  [main:JMXEnv@146] - ensureOnly:[]
    [junit] 2017-06-11 11:56:18,840 [myid:] - INFO  [main:ClientBase@626] - fdcount after
test is: 2541 at start it was 2541
    [junit] 2017-06-11 11:56:18,841 [myid:] - INFO  [main:ZKTestCase$1@68] - SUCCEEDED testWatcherAutoResetWithLocal
    [junit] 2017-06-11 11:56:18,841 [myid:] - INFO  [main:ZKTestCase$1@63] - FINISHED testWatcherAutoResetWithLocal
    [junit] Tests run: 103, Failures: 0, Errors: 0, Skipped: 0, Time elapsed: 480.91 sec,
Thread: 4, Class: org.apache.zookeeper.test.NioNettySuiteTest
    [junit] 2017-06-11 11:56:18,904 [myid:127.0.0.1:19424] - INFO  [main-SendThread(127.0.0.1:19424):ClientCnxn$SendThread@1113]
- Opening socket connection to server 127.0.0.1/127.0.0.1:19424. Will not attempt to authenticate
using SASL (unknown error)
    [junit] 2017-06-11 11:56:18,905 [myid:127.0.0.1:19424] - WARN  [main-SendThread(127.0.0.1:19424):ClientCnxn$SendThread@1235]
- Session 0x10410712eba0000 for server 127.0.0.1/127.0.0.1:19424, unexpected error, closing
socket connection and attempting reconnect
    [junit] java.net.ConnectException: Connection refused
    [junit] 	at sun.nio.ch.SocketChannelImpl.checkConnect(Native Method)
    [junit] 	at sun.nio.ch.SocketChannelImpl.finishConnect(SocketChannelImpl.java:717)
    [junit] 	at org.apache.zookeeper.ClientCnxnSocketNIO.doTransport(ClientCnxnSocketNIO.java:357)
    [junit] 	at org.apache.zookeeper.ClientCnxn$SendThread.run(ClientCnxn.java:1214)

fail.build.on.test.failure:

BUILD FAILED
/home/jenkins/jenkins-slave/workspace/ZooKeeper-trunk-jdk8/build.xml:1219: The following error
occurred while executing this line:
/home/jenkins/jenkins-slave/workspace/ZooKeeper-trunk-jdk8/build.xml:1223: Tests failed!

Total time: 12 minutes 11 seconds
Build step 'Invoke Ant' marked build as failure
[WARNINGS] Skipping publisher since build result is FAILURE
Recording test results
Email was triggered for: Failure - Any
Sending email for trigger: Failure - Any



###################################################################################
############################## FAILED TESTS (if any) ##############################
1 tests failed.
FAILED:  org.apache.zookeeper.server.quorum.ReconfigDuringLeaderSyncTest.testDuringLeaderSync

Error Message:
zoo.cfg.dynamic.next is not deleted.

Stack Trace:
junit.framework.AssertionFailedError: zoo.cfg.dynamic.next is not deleted.
	at org.apache.zookeeper.server.quorum.ReconfigDuringLeaderSyncTest.testDuringLeaderSync(ReconfigDuringLeaderSyncTest.java:165)
	at org.apache.zookeeper.JUnit4ZKTestRunner$LoggedInvokeMethod.evaluate(JUnit4ZKTestRunner.java:79)
Mime
  • Unnamed multipart/mixed (inline, None, 0 bytes)
View raw message