zookeeper-dev mailing list archives

Site index · List index
Message view « Date » · « Thread »
Top « Date » · « Thread »
From Apache Jenkins Server <jenk...@builds.apache.org>
Subject ZooKeeper-trunk-jdk8 - Build # 1074 - Failure
Date Sun, 04 Jun 2017 11:57:07 GMT
See https://builds.apache.org/job/ZooKeeper-trunk-jdk8/1074/

###################################################################################
########################## LAST 60 LINES OF THE CONSOLE ###########################
[...truncated 62.40 MB...]
    [junit] 	at java.lang.Thread.run(Thread.java:745)
    [junit] 2017-06-04 11:56:26,305 [myid:] - WARN  [New I/O boss #34:ClientCnxnSocketNetty$ZKClientHandler@439]
- Exception caught: [id: 0xbfc0a397] EXCEPTION: java.net.ConnectException: Connection refused:
127.0.0.1/127.0.0.1:19301
    [junit] java.net.ConnectException: Connection refused: 127.0.0.1/127.0.0.1:19301
    [junit] 	at sun.nio.ch.SocketChannelImpl.checkConnect(Native Method)
    [junit] 	at sun.nio.ch.SocketChannelImpl.finishConnect(SocketChannelImpl.java:717)
    [junit] 	at org.jboss.netty.channel.socket.nio.NioClientBoss.connect(NioClientBoss.java:152)
    [junit] 	at org.jboss.netty.channel.socket.nio.NioClientBoss.processSelectedKeys(NioClientBoss.java:105)
    [junit] 	at org.jboss.netty.channel.socket.nio.NioClientBoss.process(NioClientBoss.java:79)
    [junit] 	at org.jboss.netty.channel.socket.nio.AbstractNioSelector.run(AbstractNioSelector.java:337)
    [junit] 	at org.jboss.netty.channel.socket.nio.NioClientBoss.run(NioClientBoss.java:42)
    [junit] 	at org.jboss.netty.util.ThreadRenamingRunnable.run(ThreadRenamingRunnable.java:108)
    [junit] 	at org.jboss.netty.util.internal.DeadLockProofWorker$1.run(DeadLockProofWorker.java:42)
    [junit] 	at java.util.concurrent.ThreadPoolExecutor.runWorker(ThreadPoolExecutor.java:1142)
    [junit] 	at java.util.concurrent.ThreadPoolExecutor$Worker.run(ThreadPoolExecutor.java:617)
    [junit] 	at java.lang.Thread.run(Thread.java:745)
    [junit] 2017-06-04 11:56:26,306 [myid:] - INFO  [New I/O boss #34:ClientCnxnSocketNetty@208]
- channel is told closing
    [junit] 2017-06-04 11:56:26,306 [myid:127.0.0.1:19301] - INFO  [main-SendThread(127.0.0.1:19301):ClientCnxn$SendThread@1229]
- channel for sessionid 0x103ec60c2f40000 is lost, closing socket connection and attempting
reconnect
    [junit] 2017-06-04 11:56:26,450 [myid:] - INFO  [ProcessThread(sid:0 cport:19547)::PrepRequestProcessor@617]
- Processed session termination for sessionid: 0x103ec681af00000
    [junit] 2017-06-04 11:56:26,453 [myid:] - INFO  [main:ClientCnxnSocketNetty@208] - channel
is told closing
    [junit] 2017-06-04 11:56:26,453 [myid:] - INFO  [main:ZooKeeper@1329] - Session: 0x103ec681af00000
closed
    [junit] 2017-06-04 11:56:26,453 [myid:] - INFO  [SyncThread:0:MBeanRegistry@128] - Unregister
MBean [org.apache.ZooKeeperService:name0=StandaloneServer_port19547,name1=Connections,name2=127.0.0.1,name3=0x103ec681af00000]
    [junit] 2017-06-04 11:56:26,453 [myid:] - INFO  [New I/O worker #8334:ClientCnxnSocketNetty$ZKClientHandler@384]
- channel is disconnected: [id: 0x47b89358, /127.0.0.1:40996 :> 127.0.0.1/127.0.0.1:19547]
    [junit] 2017-06-04 11:56:26,454 [myid:] - INFO  [New I/O worker #8334:ClientCnxnSocketNetty@208]
- channel is told closing
    [junit] 2017-06-04 11:56:26,453 [myid:] - INFO  [main-EventThread:ClientCnxn$EventThread@513]
- EventThread shut down for session: 0x103ec681af00000
    [junit] 2017-06-04 11:56:26,453 [myid:] - INFO  [main:JUnit4ZKTestRunner$LoggedInvokeMethod@82]
- Memory used 147041
    [junit] 2017-06-04 11:56:26,454 [myid:] - INFO  [main:JUnit4ZKTestRunner$LoggedInvokeMethod@87]
- Number of threads 948
    [junit] 2017-06-04 11:56:26,455 [myid:] - INFO  [main:JUnit4ZKTestRunner$LoggedInvokeMethod@102]
- FINISHED TEST METHOD testWatcherAutoResetWithLocal
    [junit] 2017-06-04 11:56:26,456 [myid:] - INFO  [main:ClientBase@582] - tearDown starting
    [junit] 2017-06-04 11:56:26,456 [myid:] - INFO  [main:ClientBase@552] - STOPPING server
    [junit] 2017-06-04 11:56:26,456 [myid:] - INFO  [main:NettyServerCnxnFactory@464] - shutdown
called 0.0.0.0/0.0.0.0:19547
    [junit] 2017-06-04 11:56:26,457 [myid:] - INFO  [main:ZooKeeperServer@542] - shutting
down
    [junit] 2017-06-04 11:56:26,458 [myid:] - ERROR [main:ZooKeeperServer@506] - ZKShutdownHandler
is not registered, so ZooKeeper server won't take any action on ERROR or SHUTDOWN server state
changes
    [junit] 2017-06-04 11:56:26,458 [myid:] - INFO  [main:SessionTrackerImpl@232] - Shutting
down
    [junit] 2017-06-04 11:56:26,458 [myid:] - INFO  [main:PrepRequestProcessor@1014] - Shutting
down
    [junit] 2017-06-04 11:56:26,458 [myid:] - INFO  [main:SyncRequestProcessor@191] - Shutting
down
    [junit] 2017-06-04 11:56:26,458 [myid:] - INFO  [ProcessThread(sid:0 cport:19547)::PrepRequestProcessor@157]
- PrepRequestProcessor exited loop!
    [junit] 2017-06-04 11:56:26,458 [myid:] - INFO  [SyncThread:0:SyncRequestProcessor@169]
- SyncRequestProcessor exited!
    [junit] 2017-06-04 11:56:26,458 [myid:] - INFO  [main:FinalRequestProcessor@481] - shutdown
of request processor complete
    [junit] 2017-06-04 11:56:26,459 [myid:] - INFO  [main:MBeanRegistry@128] - Unregister
MBean [org.apache.ZooKeeperService:name0=StandaloneServer_port19547,name1=InMemoryDataTree]
    [junit] 2017-06-04 11:56:26,459 [myid:] - INFO  [main:MBeanRegistry@128] - Unregister
MBean [org.apache.ZooKeeperService:name0=StandaloneServer_port19547]
    [junit] 2017-06-04 11:56:26,459 [myid:] - INFO  [main:FourLetterWordMain@85] - connecting
to 127.0.0.1 19547
    [junit] 2017-06-04 11:56:26,460 [myid:] - INFO  [main:JMXEnv@146] - ensureOnly:[]
    [junit] 2017-06-04 11:56:26,464 [myid:] - INFO  [main:ClientBase@607] - fdcount after
test is: 2718 at start it was 2718
    [junit] 2017-06-04 11:56:26,465 [myid:] - INFO  [main:ZKTestCase$1@68] - SUCCEEDED testWatcherAutoResetWithLocal
    [junit] 2017-06-04 11:56:26,465 [myid:] - INFO  [main:ZKTestCase$1@63] - FINISHED testWatcherAutoResetWithLocal
    [junit] Tests run: 103, Failures: 0, Errors: 0, Skipped: 0, Time elapsed: 488.153 sec,
Thread: 4, Class: org.apache.zookeeper.test.NettyNettySuiteTest

fail.build.on.test.failure:

BUILD FAILED
/home/jenkins/jenkins-slave/workspace/ZooKeeper-trunk-jdk8/build.xml:1219: The following error
occurred while executing this line:
/home/jenkins/jenkins-slave/workspace/ZooKeeper-trunk-jdk8/build.xml:1223: Tests failed!

Total time: 12 minutes 17 seconds
Build step 'Invoke Ant' marked build as failure
[WARNINGS] Skipping publisher since build result is FAILURE
Recording test results
Email was triggered for: Failure - Any
Sending email for trigger: Failure - Any



###################################################################################
############################## FAILED TESTS (if any) ##############################
1 tests failed.
FAILED:  org.apache.zookeeper.test.WatchEventWhenAutoResetTest.testNodeDataChanged

Error Message:
expected:<NodeDataChanged> but was:<NodeDeleted>

Stack Trace:
junit.framework.AssertionFailedError: expected:<NodeDataChanged> but was:<NodeDeleted>
	at org.apache.zookeeper.test.WatchEventWhenAutoResetTest$EventsWatcher.assertEvent(WatchEventWhenAutoResetTest.java:67)
	at org.apache.zookeeper.test.WatchEventWhenAutoResetTest.testNodeDataChanged(WatchEventWhenAutoResetTest.java:117)
	at org.apache.zookeeper.JUnit4ZKTestRunner$LoggedInvokeMethod.evaluate(JUnit4ZKTestRunner.java:79)
Mime
  • Unnamed multipart/mixed (inline, None, 0 bytes)
View raw message