zookeeper-dev mailing list archives

Site index · List index
Message view « Date » · « Thread »
Top « Date » · « Thread »
From Apache Jenkins Server <jenk...@builds.apache.org>
Subject Failed: ZOOKEEPER- PreCommit Build #772
Date Tue, 06 Jun 2017 18:57:20 GMT
Build: https://builds.apache.org/job/PreCommit-ZOOKEEPER-github-pr-build/772/

###################################################################################
########################## LAST 60 LINES OF THE CONSOLE ###########################
[...truncated 70.65 MB...]
     [exec]     +1 tests included.  The patch appears to include 43 new or modified tests.
     [exec] 
     [exec]     +1 javadoc.  The javadoc tool did not generate any warning messages.
     [exec] 
     [exec]     +1 javac.  The applied patch does not increase the total number of javac compiler
warnings.
     [exec] 
     [exec]     +1 findbugs.  The patch does not introduce any new Findbugs (version 3.0.1)
warnings.
     [exec] 
     [exec]     +1 release audit.  The applied patch does not increase the total number of
release audit warnings.
     [exec] 
     [exec]     -1 core tests.  The patch failed core unit tests.
     [exec] 
     [exec]     +1 contrib tests.  The patch passed contrib unit tests.
     [exec] 
     [exec] Test results: https://builds.apache.org/job/PreCommit-ZOOKEEPER-github-pr-build/772//testReport/
     [exec] Findbugs warnings: https://builds.apache.org/job/PreCommit-ZOOKEEPER-github-pr-build/772//artifact/trunk/build/test/findbugs/newPatchFindbugsWarnings.html
     [exec] Console output: https://builds.apache.org/job/PreCommit-ZOOKEEPER-github-pr-build/772//console
     [exec] 
     [exec] This message is automatically generated.
     [exec] 
     [exec] 
     [exec] ======================================================================
     [exec] ======================================================================
     [exec]     Adding comment to Jira.
     [exec] ======================================================================
     [exec] ======================================================================
     [exec] 
     [exec] 
     [exec] Comment added.
     [exec] b675753ecccd8a13ca033f0efdd5aff3c7ce98e1 logged out
     [exec] 
     [exec] 
     [exec] ======================================================================
     [exec] ======================================================================
     [exec]     Finished build.
     [exec] ======================================================================
     [exec] ======================================================================
     [exec] 
     [exec] 
     [exec] mv: '/home/jenkins/jenkins-slave/workspace/PreCommit-ZOOKEEPER-github-pr-build/patchprocess'
and '/home/jenkins/jenkins-slave/workspace/PreCommit-ZOOKEEPER-github-pr-build/patchprocess'
are the same file

BUILD FAILED
/home/jenkins/jenkins-slave/workspace/PreCommit-ZOOKEEPER-github-pr-build/build.xml:1642:
exec returned: 1

Total time: 16 minutes 25 seconds
Build step 'Execute shell' marked build as failure
Archiving artifacts
Setting JDK_1_7_LATEST__HOME=/home/jenkins/tools/java/latest1.7
Recording test results
Setting JDK_1_7_LATEST__HOME=/home/jenkins/tools/java/latest1.7
Setting JDK_1_7_LATEST__HOME=/home/jenkins/tools/java/latest1.7
[description-setter] Description set: ZOOKEEPER-236
Putting comment on the pull request
Setting JDK_1_7_LATEST__HOME=/home/jenkins/tools/java/latest1.7
Email was triggered for: Failure - Any
Sending email for trigger: Failure - Any
Setting JDK_1_7_LATEST__HOME=/home/jenkins/tools/java/latest1.7
Setting JDK_1_7_LATEST__HOME=/home/jenkins/tools/java/latest1.7
Setting JDK_1_7_LATEST__HOME=/home/jenkins/tools/java/latest1.7



###################################################################################
############################## FAILED TESTS (if any) ##############################
1 tests failed.
FAILED:  org.apache.zookeeper.common.X509UtilTest.testCreateSSLServerSocketWithPort

Error Message:
test timed out after 1000 milliseconds

Stack Trace:
org.junit.runners.model.TestTimedOutException: test timed out after 1000 milliseconds
	at java.util.HashMap.inflateTable(HashMap.java:316)
	at java.util.HashMap.<init>(HashMap.java:296)
	at java.util.jar.Attributes.<init>(Attributes.java:84)
	at java.util.jar.Attributes.clone(Attributes.java:291)
	at sun.net.www.protocol.jar.URLJarFile.getManifest(URLJarFile.java:155)
	at javax.crypto.JarVerifier.verifySingleJar(JarVerifier.java:441)
	at javax.crypto.JarVerifier.verifyJars(JarVerifier.java:322)
	at javax.crypto.JarVerifier.verify(JarVerifier.java:250)
	at javax.crypto.JceSecurity.verifyProviderJar(JceSecurity.java:161)
	at javax.crypto.JceSecurity.getVerificationResult(JceSecurity.java:187)
	at javax.crypto.JceSecurity.canUseProvider(JceSecurity.java:201)
	at javax.crypto.Cipher.chooseProvider(Cipher.java:837)
	at javax.crypto.Cipher.init(Cipher.java:1374)
	at sun.security.ssl.CipherBox.<init>(CipherBox.java:175)
	at sun.security.ssl.CipherBox.newCipherBox(CipherBox.java:208)
	at sun.security.ssl.CipherSuite$BulkCipher.newCipher(CipherSuite.java:471)
	at sun.security.ssl.CipherSuite$BulkCipher.isAvailable(CipherSuite.java:511)
	at sun.security.ssl.CipherSuite$BulkCipher.isAvailable(CipherSuite.java:489)
	at sun.security.ssl.CipherSuite.isAvailable(CipherSuite.java:194)
	at sun.security.ssl.SSLContextImpl.getApplicableCipherSuiteList(SSLContextImpl.java:338)
	at sun.security.ssl.SSLContextImpl.getDefaultCipherSuiteList(SSLContextImpl.java:289)
	at sun.security.ssl.SSLServerSocketImpl.initServer(SSLServerSocketImpl.java:156)
	at sun.security.ssl.SSLServerSocketImpl.<init>(SSLServerSocketImpl.java:108)
	at sun.security.ssl.SSLServerSocketFactoryImpl.createServerSocket(SSLServerSocketFactoryImpl.java:77)
	at org.apache.zookeeper.common.X509Util.createSSLServerSocket(X509Util.java:315)
	at org.apache.zookeeper.common.X509UtilTest.testCreateSSLServerSocketWithPort(X509UtilTest.java:253)
	at org.apache.zookeeper.JUnit4ZKTestRunner$LoggedInvokeMethod.evaluate(JUnit4ZKTestRunner.java:79)
	at java.util.concurrent.FutureTask.run(FutureTask.java:262)
	at java.lang.Thread.run(Thread.java:745)
Mime
  • Unnamed multipart/mixed (inline, None, 0 bytes)
View raw message