zookeeper-dev mailing list archives

Site index · List index
Message view « Date » · « Thread »
Top « Date » · « Thread »
From Apache Jenkins Server <jenk...@builds.apache.org>
Subject ZooKeeper_branch35_jdk8 - Build # 579 - Still Failing
Date Mon, 26 Jun 2017 06:07:04 GMT
See https://builds.apache.org/job/ZooKeeper_branch35_jdk8/579/

###################################################################################
########################## LAST 60 LINES OF THE CONSOLE ###########################
[...truncated 62.86 MB...]
    [junit] 	at org.apache.zookeeper.ClientCnxn$SendThread.run(ClientCnxn.java:1214)
    [junit] 2017-06-26 06:06:51,107 [myid:127.0.0.1:22240] - INFO  [main-SendThread(127.0.0.1:22240):ClientCnxn$SendThread@1113]
- Opening socket connection to server 127.0.0.1/127.0.0.1:22240. Will not attempt to authenticate
using SASL (unknown error)
    [junit] 2017-06-26 06:06:51,107 [myid:127.0.0.1:22240] - INFO  [main-SendThread(127.0.0.1:22240):ClientCnxn$SendThread@946]
- Socket connection established, initiating session, client: /127.0.0.1:40344, server: 127.0.0.1/127.0.0.1:22240
    [junit] 2017-06-26 06:06:51,107 [myid:] - INFO  [New I/O worker #6701:ZooKeeperServer@1025]
- Client attempting to renew session 0x1013a67e1040000 at /127.0.0.1:40344
    [junit] 2017-06-26 06:06:51,108 [myid:] - INFO  [New I/O worker #6701:ZooKeeperServer@727]
- Established session 0x1013a67e1040000 with negotiated timeout 6000 for client /127.0.0.1:40344
    [junit] 2017-06-26 06:06:51,108 [myid:127.0.0.1:22240] - INFO  [main-SendThread(127.0.0.1:22240):ClientCnxn$SendThread@1381]
- Session establishment complete on server 127.0.0.1/127.0.0.1:22240, sessionid = 0x1013a67e1040000,
negotiated timeout = 6000
    [junit] 2017-06-26 06:06:51,120 [myid:] - INFO  [SyncThread:0:FileTxnLog@205] - Creating
new log file: log.7
    [junit] 2017-06-26 06:06:51,336 [myid:127.0.0.1:22120] - INFO  [main-SendThread(127.0.0.1:22120):ClientCnxn$SendThread@1113]
- Opening socket connection to server 127.0.0.1/127.0.0.1:22120. Will not attempt to authenticate
using SASL (unknown error)
    [junit] 2017-06-26 06:06:51,336 [myid:127.0.0.1:22120] - WARN  [main-SendThread(127.0.0.1:22120):ClientCnxn$SendThread@1235]
- Session 0x2013a64a5d20000 for server 127.0.0.1/127.0.0.1:22120, unexpected error, closing
socket connection and attempting reconnect
    [junit] java.net.ConnectException: Connection refused
    [junit] 	at sun.nio.ch.SocketChannelImpl.checkConnect(Native Method)
    [junit] 	at sun.nio.ch.SocketChannelImpl.finishConnect(SocketChannelImpl.java:717)
    [junit] 	at org.apache.zookeeper.ClientCnxnSocketNIO.doTransport(ClientCnxnSocketNIO.java:357)
    [junit] 	at org.apache.zookeeper.ClientCnxn$SendThread.run(ClientCnxn.java:1214)
    [junit] 2017-06-26 06:06:52,161 [myid:] - INFO  [ProcessThread(sid:0 cport:22240)::PrepRequestProcessor@611]
- Processed session termination for sessionid: 0x1013a67e1040000
    [junit] 2017-06-26 06:06:52,180 [myid:] - INFO  [SyncThread:0:MBeanRegistry@128] - Unregister
MBean [org.apache.ZooKeeperService:name0=StandaloneServer_port22240,name1=Connections,name2=127.0.0.1,name3=0x1013a67e1040000]
    [junit] 2017-06-26 06:06:52,180 [myid:] - INFO  [main:ZooKeeper@1331] - Session: 0x1013a67e1040000
closed
    [junit] 2017-06-26 06:06:52,180 [myid:] - INFO  [main-EventThread:ClientCnxn$EventThread@513]
- EventThread shut down for session: 0x1013a67e1040000
    [junit] 2017-06-26 06:06:52,180 [myid:] - INFO  [main:JUnit4ZKTestRunner$LoggedInvokeMethod@82]
- Memory used 174729
    [junit] 2017-06-26 06:06:52,181 [myid:] - INFO  [main:JUnit4ZKTestRunner$LoggedInvokeMethod@87]
- Number of threads 1643
    [junit] 2017-06-26 06:06:52,181 [myid:] - INFO  [main:JUnit4ZKTestRunner$LoggedInvokeMethod@102]
- FINISHED TEST METHOD testWatcherAutoResetWithLocal
    [junit] 2017-06-26 06:06:52,181 [myid:] - INFO  [main:ClientBase@586] - tearDown starting
    [junit] 2017-06-26 06:06:52,181 [myid:] - INFO  [main:ClientBase@556] - STOPPING server
    [junit] 2017-06-26 06:06:52,181 [myid:] - INFO  [main:NettyServerCnxnFactory@464] - shutdown
called 0.0.0.0/0.0.0.0:22240
    [junit] 2017-06-26 06:06:52,187 [myid:] - INFO  [main:ZooKeeperServer@541] - shutting
down
    [junit] 2017-06-26 06:06:52,188 [myid:] - ERROR [main:ZooKeeperServer@505] - ZKShutdownHandler
is not registered, so ZooKeeper server won't take any action on ERROR or SHUTDOWN server state
changes
    [junit] 2017-06-26 06:06:52,188 [myid:] - INFO  [main:SessionTrackerImpl@232] - Shutting
down
    [junit] 2017-06-26 06:06:52,188 [myid:] - INFO  [main:PrepRequestProcessor@1005] - Shutting
down
    [junit] 2017-06-26 06:06:52,188 [myid:] - INFO  [main:SyncRequestProcessor@191] - Shutting
down
    [junit] 2017-06-26 06:06:52,188 [myid:] - INFO  [ProcessThread(sid:0 cport:22240)::PrepRequestProcessor@155]
- PrepRequestProcessor exited loop!
    [junit] 2017-06-26 06:06:52,188 [myid:] - INFO  [SyncThread:0:SyncRequestProcessor@169]
- SyncRequestProcessor exited!
    [junit] 2017-06-26 06:06:52,188 [myid:] - INFO  [main:FinalRequestProcessor@481] - shutdown
of request processor complete
    [junit] 2017-06-26 06:06:52,189 [myid:] - INFO  [main:MBeanRegistry@128] - Unregister
MBean [org.apache.ZooKeeperService:name0=StandaloneServer_port22240,name1=InMemoryDataTree]
    [junit] 2017-06-26 06:06:52,189 [myid:] - INFO  [main:MBeanRegistry@128] - Unregister
MBean [org.apache.ZooKeeperService:name0=StandaloneServer_port22240]
    [junit] 2017-06-26 06:06:52,189 [myid:] - INFO  [main:FourLetterWordMain@85] - connecting
to 127.0.0.1 22240
    [junit] 2017-06-26 06:06:52,190 [myid:] - INFO  [main:JMXEnv@146] - ensureOnly:[]
    [junit] 2017-06-26 06:06:52,195 [myid:] - INFO  [main:ClientBase@611] - fdcount after
test is: 4839 at start it was 4839
    [junit] 2017-06-26 06:06:52,195 [myid:] - INFO  [main:ZKTestCase$1@68] - SUCCEEDED testWatcherAutoResetWithLocal
    [junit] 2017-06-26 06:06:52,195 [myid:] - INFO  [main:ZKTestCase$1@63] - FINISHED testWatcherAutoResetWithLocal
    [junit] Tests run: 103, Failures: 0, Errors: 0, Skipped: 0, Time elapsed: 470.822 sec,
Thread: 5, Class: org.apache.zookeeper.test.NioNettySuiteTest
    [junit] 2017-06-26 06:06:52,520 [myid:127.0.0.1:22123] - INFO  [main-SendThread(127.0.0.1:22123):ClientCnxn$SendThread@1113]
- Opening socket connection to server 127.0.0.1/127.0.0.1:22123. Will not attempt to authenticate
using SASL (unknown error)
    [junit] 2017-06-26 06:06:52,521 [myid:127.0.0.1:22123] - WARN  [main-SendThread(127.0.0.1:22123):ClientCnxn$SendThread@1235]
- Session 0x3013a64a27c0000 for server 127.0.0.1/127.0.0.1:22123, unexpected error, closing
socket connection and attempting reconnect
    [junit] java.net.ConnectException: Connection refused
    [junit] 	at sun.nio.ch.SocketChannelImpl.checkConnect(Native Method)
    [junit] 	at sun.nio.ch.SocketChannelImpl.finishConnect(SocketChannelImpl.java:717)
    [junit] 	at org.apache.zookeeper.ClientCnxnSocketNIO.doTransport(ClientCnxnSocketNIO.java:357)
    [junit] 	at org.apache.zookeeper.ClientCnxn$SendThread.run(ClientCnxn.java:1214)

fail.build.on.test.failure:

BUILD FAILED
/home/jenkins/jenkins-slave/workspace/ZooKeeper_branch35_jdk8/build.xml:1219: The following
error occurred while executing this line:
/home/jenkins/jenkins-slave/workspace/ZooKeeper_branch35_jdk8/build.xml:1223: Tests failed!

Total time: 12 minutes 10 seconds
Build step 'Invoke Ant' marked build as failure
Recording test results
Email was triggered for: Failure - Any
Sending email for trigger: Failure - Any



###################################################################################
############################## FAILED TESTS (if any) ##############################
1 tests failed.
FAILED:  org.apache.zookeeper.server.quorum.ReconfigDuringLeaderSyncTest.testDuringLeaderSync

Error Message:
zoo.cfg.dynamic.next is not deleted.

Stack Trace:
junit.framework.AssertionFailedError: zoo.cfg.dynamic.next is not deleted.
	at org.apache.zookeeper.server.quorum.ReconfigDuringLeaderSyncTest.testDuringLeaderSync(ReconfigDuringLeaderSyncTest.java:165)
	at org.apache.zookeeper.JUnit4ZKTestRunner$LoggedInvokeMethod.evaluate(JUnit4ZKTestRunner.java:79)
Mime
  • Unnamed multipart/mixed (inline, None, 0 bytes)
View raw message