zookeeper-dev mailing list archives

Site index · List index
Message view « Date » · « Thread »
Top « Date » · « Thread »
From Apache Jenkins Server <jenk...@builds.apache.org>
Subject ZooKeeper_branch34_jdk8 - Build # 1020 - Failure
Date Thu, 08 Jun 2017 23:08:11 GMT
See https://builds.apache.org/job/ZooKeeper_branch34_jdk8/1020/

###################################################################################
########################## LAST 60 LINES OF THE CONSOLE ###########################
[...truncated 18.36 MB...]
    [junit] 	at org.junit.runners.ParentRunner.access$000(ParentRunner.java:42)
    [junit] 	at org.junit.runners.ParentRunner$2.evaluate(ParentRunner.java:184)
    [junit] 	at org.junit.runners.ParentRunner.run(ParentRunner.java:236)
    [junit] 	at junit.framework.JUnit4TestAdapter.run(JUnit4TestAdapter.java:39)
    [junit] 	at org.apache.tools.ant.taskdefs.optional.junit.JUnitTestRunner.run(JUnitTestRunner.java:535)
    [junit] 	at org.apache.tools.ant.taskdefs.optional.junit.JUnitTestRunner.launch(JUnitTestRunner.java:1182)
    [junit] 	at org.apache.tools.ant.taskdefs.optional.junit.JUnitTestRunner.main(JUnitTestRunner.java:1033)
    [junit] 2017-06-08 22:53:20,034 [myid:] - INFO  [main:ZKTestCase$1@64] - FINISHED testSessionMoved
    [junit] 2017-06-08 22:53:20,035 [myid:] - INFO  [main:PortAssignment@32] - assigning port
11341
    [junit] 2017-06-08 22:53:20,035 [myid:] - INFO  [main:PortAssignment@32] - assigning port
11342
    [junit] 2017-06-08 22:53:20,035 [myid:] - INFO  [main:ZKTestCase$1@59] - STARTING testDeleteWithChildren
    [junit] 2017-06-08 22:53:20,035 [myid:] - INFO  [main:QuorumBase@69] - QuorumBase.setup
null
    [junit] 2017-06-08 22:53:20,040 [myid:] - INFO  [main:PortAssignment@32] - assigning port
11343
    [junit] 2017-06-08 22:53:20,040 [myid:] - INFO  [main:PortAssignment@32] - assigning port
11344
    [junit] 2017-06-08 22:53:20,040 [myid:] - INFO  [main:PortAssignment@32] - assigning port
11345
    [junit] 2017-06-08 22:53:20,041 [myid:] - INFO  [main:PortAssignment@32] - assigning port
11346
    [junit] 2017-06-08 22:53:20,041 [myid:] - INFO  [main:PortAssignment@32] - assigning port
11347
    [junit] 2017-06-08 22:53:20,041 [myid:] - INFO  [main:PortAssignment@32] - assigning port
11348
    [junit] 2017-06-08 22:53:20,041 [myid:] - INFO  [main:PortAssignment@32] - assigning port
11349
    [junit] 2017-06-08 22:53:20,041 [myid:] - INFO  [main:PortAssignment@32] - assigning port
11350
    [junit] 2017-06-08 22:53:20,041 [myid:] - INFO  [main:PortAssignment@32] - assigning port
11351
    [junit] 2017-06-08 22:53:20,041 [myid:] - INFO  [main:PortAssignment@32] - assigning port
11352
    [junit] 2017-06-08 22:53:20,041 [myid:] - INFO  [main:QuorumBase@93] - Ports are: 127.0.0.1:11343,127.0.0.1:11344,127.0.0.1:11345,127.0.0.1:11346,127.0.0.1:11347
    [junit] 2017-06-08 22:53:20,041 [myid:] - INFO  [main:QuorumBase@277] - TearDown started
    [junit] 2017-06-08 22:53:20,042 [myid:] - INFO  [main:QuorumBase@281] - fdcount after
test is: 102
    [junit] 2017-06-08 22:53:20,042 [myid:] - INFO  [main:ZKTestCase$1@74] - FAILED testDeleteWithChildren
    [junit] org.junit.internal.runners.model.MultipleFailureException
    [junit] 	at org.junit.internal.runners.model.MultipleFailureException.assertEmpty(MultipleFailureException.java:23)
    [junit] 	at org.junit.internal.runners.statements.RunAfters.evaluate(RunAfters.java:42)
    [junit] 	at org.junit.rules.TestWatchman$1.evaluate(TestWatchman.java:48)
    [junit] 	at org.junit.runners.BlockJUnit4ClassRunner.runChild(BlockJUnit4ClassRunner.java:76)
    [junit] 	at org.junit.runners.BlockJUnit4ClassRunner.runChild(BlockJUnit4ClassRunner.java:50)
    [junit] 	at org.junit.runners.ParentRunner$3.run(ParentRunner.java:193)
    [junit] 	at org.junit.runners.ParentRunner$1.schedule(ParentRunner.java:52)
    [junit] 	at org.junit.runners.ParentRunner.runChildren(ParentRunner.java:191)
    [junit] 	at org.junit.runners.ParentRunner.access$000(ParentRunner.java:42)
    [junit] 	at org.junit.runners.ParentRunner$2.evaluate(ParentRunner.java:184)
    [junit] 	at org.junit.runners.ParentRunner.run(ParentRunner.java:236)
    [junit] 	at junit.framework.JUnit4TestAdapter.run(JUnit4TestAdapter.java:39)
    [junit] 	at org.apache.tools.ant.taskdefs.optional.junit.JUnitTestRunner.run(JUnitTestRunner.java:535)
    [junit] 	at org.apache.tools.ant.taskdefs.optional.junit.JUnitTestRunner.launch(JUnitTestRunner.java:1182)
    [junit] 	at org.apache.tools.ant.taskdefs.optional.junit.JUnitTestRunner.main(JUnitTestRunner.java:1033)
    [junit] 2017-06-08 22:53:20,042 [myid:] - INFO  [main:ZKTestCase$1@64] - FINISHED testDeleteWithChildren
    [junit] Tests run: 12, Failures: 8, Errors: 9, Skipped: 1, Time elapsed: 11.358 sec
    [junit] 2017-06-08 22:53:20,122 [myid:] - INFO  [SessionTracker:SessionTrackerImpl@163]
- SessionTrackerImpl exited loop!
    [junit] 2017-06-08 22:53:20,895 [myid:] - INFO  [/127.0.0.1:12244:QuorumCnxManager$Listener@773]
- Leaving listener
    [junit] 2017-06-08 22:53:20,940 [myid:] - INFO  [/127.0.0.1:12252:QuorumCnxManager$Listener@773]
- Leaving listener
    [junit] 2017-06-08 22:53:22,648 [myid:] - INFO  [WorkerSender[myid=5]:FastLeaderElection$Messenger$WorkerSender@440]
- WorkerSender is down
    [junit] 2017-06-08 22:53:22,659 [myid:] - INFO  [WorkerReceiver[myid=5]:FastLeaderElection$Messenger$WorkerReceiver@409]
- WorkerReceiver is down
    [junit] 2017-06-08 22:53:22,934 [myid:] - INFO  [WorkerReceiver[myid=1]:FastLeaderElection$Messenger$WorkerReceiver@409]
- WorkerReceiver is down

BUILD FAILED
/home/jenkins/jenkins-slave/workspace/ZooKeeper_branch34_jdk8/build.xml:1299: Unable to write
log file

Total time: 38 minutes 56 seconds
Build step 'Invoke Ant' marked build as failure
Recording test results
Email was triggered for: Failure - Any
Sending email for trigger: Failure - Any



###################################################################################
############################## FAILED TESTS (if any) ##############################
1 tests failed.
FAILED:  TEST-org.apache.zookeeper.test.QuorumTest.xml.[empty]

Error Message:


Stack Trace:
Test report file /home/jenkins/jenkins-slave/workspace/ZooKeeper_branch34_jdk8/build/test/logs/TEST-org.apache.zookeeper.test.QuorumTest.xml
was length 0
Mime
  • Unnamed multipart/mixed (inline, None, 0 bytes)
View raw message