zookeeper-dev mailing list archives

Site index · List index
Message view « Date » · « Thread »
Top « Date » · « Thread »
From Apache Jenkins Server <jenk...@builds.apache.org>
Subject ZooKeeper-trunk - Build # 3421 - Failure
Date Fri, 09 Jun 2017 17:15:31 GMT
See https://builds.apache.org/job/ZooKeeper-trunk/3421/

###################################################################################
########################## LAST 60 LINES OF THE CONSOLE ###########################
[...truncated 15.59 KB...]
     [exec] Processing /home/jenkins/jenkins-slave/workspace/ZooKeeper-trunk/src/docs/build/tmp/input.xmap
to /home/jenkins/jenkins-slave/workspace/ZooKeeper-trunk/src/docs/build/tmp/input.xmap.new
     [exec] Loading stylesheet /home/jenkins/tools/forrest/latest/main/var/pluginMountSnippet.xsl
     [exec] Moving 1 file to /home/jenkins/jenkins-slave/workspace/ZooKeeper-trunk/src/docs/build/tmp
     [exec] Processing /home/jenkins/jenkins-slave/workspace/ZooKeeper-trunk/src/docs/build/tmp/resources.xmap
to /home/jenkins/jenkins-slave/workspace/ZooKeeper-trunk/src/docs/build/tmp/resources.xmap.new
     [exec] Loading stylesheet /home/jenkins/tools/forrest/latest/main/var/pluginMountSnippet.xsl
     [exec] Moving 1 file to /home/jenkins/jenkins-slave/workspace/ZooKeeper-trunk/src/docs/build/tmp
     [exec] 
     [exec] configure-plugin-locationmap:
     [exec] Mounting plugin locationmap for org.apache.forrest.plugin.input.simplifiedDocbook
     [exec] Processing /home/jenkins/jenkins-slave/workspace/ZooKeeper-trunk/src/docs/build/tmp/locationmap.xml
to /home/jenkins/jenkins-slave/workspace/ZooKeeper-trunk/src/docs/build/tmp/locationmap.xml.new
     [exec] Loading stylesheet /home/jenkins/tools/forrest/latest/main/var/pluginLmMountSnippet.xsl
     [exec] Moving 1 file to /home/jenkins/jenkins-slave/workspace/ZooKeeper-trunk/src/docs/build/tmp
     [exec] 
     [exec] init:
     [exec] 
     [exec] -prepare-classpath:
     [exec] 
     [exec] check-contentdir:
     [exec] 
     [exec] examine-proj:
     [exec] 
     [exec] validation-props:
     [exec] Using these catalog descriptors: /home/jenkins/tools/forrest/latest/main/webapp/resources/schema/catalog.xcat:/home/jenkins/tools/forrest/latest/build/plugins/catalog.xcat:/home/jenkins/jenkins-slave/workspace/ZooKeeper-trunk/src/docs/src/documentation/resources/schema/catalog.xcat
     [exec] 
     [exec] validate-xdocs:
     [exec] /home/jenkins/jenkins-slave/workspace/ZooKeeper-trunk/src/docs/src/documentation/content/xdocs/zookeeperAdmin.xml:1194:67:
The end-tag for element type "emphasis" must end with a '>' delimiter.
     [exec] 
     [exec] BUILD FAILED
     [exec] /home/jenkins/tools/forrest/latest/main/targets/validate.xml:135: Could not validate
document /home/jenkins/jenkins-slave/workspace/ZooKeeper-trunk/src/docs/src/documentation/content/xdocs/zookeeperAdmin.xml
     [exec] 
     [exec] Total time: 3 seconds

BUILD FAILED
/home/jenkins/jenkins-slave/workspace/ZooKeeper-trunk/build.xml:477: exec returned: 1

Total time: 4 seconds
mv: cannot stat 'build/*.tar.gz': No such file or directory
mv: cannot stat 'build/*.jar': No such file or directory
mv: cannot stat 'build/test/findbugs': No such file or directory
mv: cannot stat 'build/docs/api': No such file or directory
Build Failed
Build step 'Execute shell' marked build as failure
[FINDBUGS] Skipping publisher since build result is FAILURE
[WARNINGS] Skipping publisher since build result is FAILURE
Archiving artifacts
Setting JDK_1_7_LATEST__HOME=/home/jenkins/tools/java/latest1.7
Recording fingerprints
Setting JDK_1_7_LATEST__HOME=/home/jenkins/tools/java/latest1.7
[JIRA] Updating issue ZOOKEEPER-1748
Recording test results
Setting JDK_1_7_LATEST__HOME=/home/jenkins/tools/java/latest1.7
ERROR: Step ?Publish JUnit test result report? failed: No test report files were found. Configuration
error?
Publishing Javadoc
Setting JDK_1_7_LATEST__HOME=/home/jenkins/tools/java/latest1.7
Setting JDK_1_7_LATEST__HOME=/home/jenkins/tools/java/latest1.7
Email was triggered for: Failure - Any
Sending email for trigger: Failure - Any
Setting JDK_1_7_LATEST__HOME=/home/jenkins/tools/java/latest1.7
Setting JDK_1_7_LATEST__HOME=/home/jenkins/tools/java/latest1.7



###################################################################################
############################## FAILED TESTS (if any) ##############################
No tests ran.
Mime
  • Unnamed multipart/mixed (inline, None, 0 bytes)
View raw message