zookeeper-dev mailing list archives

Site index · List index
Message view « Date » · « Thread »
Top « Date » · « Thread »
From Apache Jenkins Server <jenk...@builds.apache.org>
Subject Failed: ZOOKEEPER- PreCommit Build #792
Date Fri, 16 Jun 2017 10:44:17 GMT
Build: https://builds.apache.org/job/PreCommit-ZOOKEEPER-github-pr-build/792/

###################################################################################
########################## LAST 60 LINES OF THE CONSOLE ###########################
[...truncated 168.69 MB...]
     [exec]     +0 tests included.  The patch appears to be a documentation patch that doesn't require tests.
     [exec] 
     [exec]     +1 javadoc.  The javadoc tool did not generate any warning messages.
     [exec] 
     [exec]     +1 javac.  The applied patch does not increase the total number of javac compiler warnings.
     [exec] 
     [exec]     +1 findbugs.  The patch does not introduce any new Findbugs (version 3.0.1) warnings.
     [exec] 
     [exec]     +1 release audit.  The applied patch does not increase the total number of release audit warnings.
     [exec] 
     [exec]     -1 core tests.  The patch failed core unit tests.
     [exec] 
     [exec]     +1 contrib tests.  The patch passed contrib unit tests.
     [exec] 
     [exec] Test results: https://builds.apache.org/job/PreCommit-ZOOKEEPER-github-pr-build/792//testReport/
     [exec] Findbugs warnings: https://builds.apache.org/job/PreCommit-ZOOKEEPER-github-pr-build/792//artifact/trunk/build/test/findbugs/newPatchFindbugsWarnings.html
     [exec] Console output: https://builds.apache.org/job/PreCommit-ZOOKEEPER-github-pr-build/792//console
     [exec] 
     [exec] This message is automatically generated.
     [exec] 
     [exec] 
     [exec] ======================================================================
     [exec] ======================================================================
     [exec]     Adding comment to Jira.
     [exec] ======================================================================
     [exec] ======================================================================
     [exec] 
     [exec] 
     [exec] Error: No value specified for option "issue"
     [exec] 81b6824a0c6a4a0a152d6ab1989957c069267740 logged out
     [exec] 
     [exec] 
     [exec] ======================================================================
     [exec] ======================================================================
     [exec]     Finished build.
     [exec] ======================================================================
     [exec] ======================================================================
     [exec] 
     [exec] 
     [exec] mv: '/home/jenkins/jenkins-slave/workspace/PreCommit-ZOOKEEPER-github-pr-build/patchprocess' and '/home/jenkins/jenkins-slave/workspace/PreCommit-ZOOKEEPER-github-pr-build/patchprocess' are the same file

BUILD FAILED
/home/jenkins/jenkins-slave/workspace/PreCommit-ZOOKEEPER-github-pr-build/build.xml:1642: exec returned: 1

Total time: 29 minutes 28 seconds
Build step 'Execute shell' marked build as failure
Archiving artifacts
Setting JDK_1_7_LATEST__HOME=/home/jenkins/tools/java/latest1.7
Compressed 577.13 KB of artifacts by 38.8% relative to #788
Recording test results
Setting JDK_1_7_LATEST__HOME=/home/jenkins/tools/java/latest1.7
[description-setter] Could not determine description.
Putting comment on the pull request
Setting JDK_1_7_LATEST__HOME=/home/jenkins/tools/java/latest1.7
Email was triggered for: Failure - Any
Sending email for trigger: Failure - Any
Setting JDK_1_7_LATEST__HOME=/home/jenkins/tools/java/latest1.7
Setting JDK_1_7_LATEST__HOME=/home/jenkins/tools/java/latest1.7
Setting JDK_1_7_LATEST__HOME=/home/jenkins/tools/java/latest1.7



###################################################################################
############################## FAILED TESTS (if any) ##############################
352 tests failed.
FAILED:  org.apache.zookeeper.test.AsyncHammerTest.testObserversHammer

Error Message:
thread HammerThread-0 still alive after join

Stack Trace:
junit.framework.AssertionFailedError: thread HammerThread-0 still alive after join
	at org.apache.zookeeper.test.ClientBase.verifyThreadTerminated(ClientBase.java:366)
	at org.apache.zookeeper.test.AsyncHammerTest.testObserversHammer(AsyncHammerTest.java:213)
	at org.apache.zookeeper.JUnit4ZKTestRunner$LoggedInvokeMethod.evaluate(JUnit4ZKTestRunner.java:79)


FAILED:  org.apache.zookeeper.test.NettyNettySuiteTest.testFourLetterWords

Error Message:
Timeout occurred. Please note the time in the report does not reflect the time until the timeout.

Stack Trace:
junit.framework.AssertionFailedError: Timeout occurred. Please note the time in the report does not reflect the time until the timeout.
	at java.lang.Thread.run(Thread.java:745)


FAILED:  org.apache.zookeeper.RemoveWatchesTest.testRemoveWatcherWhenNoConnection[1]

Error Message:
Timeout occurred. Please note the time in the report does not reflect the time until the timeout.

Stack Trace:
junit.framework.AssertionFailedError: Timeout occurred. Please note the time in the report does not reflect the time until the timeout.
	at java.lang.Thread.run(Thread.java:745)


FAILED:  org.apache.zookeeper.test.AsyncHammerTest.testHammer

Error Message:
null

Stack Trace:
junit.framework.AssertionFailedError
	at org.apache.zookeeper.test.AsyncHammerTest.testHammer(AsyncHammerTest.java:185)
	at org.apache.zookeeper.JUnit4ZKTestRunner$LoggedInvokeMethod.evaluate(JUnit4ZKTestRunner.java:79)


FAILED:  org.apache.zookeeper.test.NioNettySuiteTest.testDeleteWithChildren

Error Message:
Timeout occurred. Please note the time in the report does not reflect the time until the timeout.

Stack Trace:
junit.framework.AssertionFailedError: Timeout occurred. Please note the time in the report does not reflect the time until the timeout.
	at java.lang.Thread.run(Thread.java:745)


FAILED:  org.apache.zookeeper.server.quorum.ReconfigFailureCasesTest.testLeaderTimesoutOnNewQuorum

Error Message:
expected:<lead[erelection]> but was:<lead[ing]>

Stack Trace:
junit.framework.AssertionFailedError: expected:<lead[erelection]> but was:<lead[ing]>
	at org.apache.zookeeper.server.quorum.ReconfigFailureCasesTest.testLeaderTimesoutOnNewQuorum(ReconfigFailureCasesTest.java:199)
	at org.apache.zookeeper.JUnit4ZKTestRunner$LoggedInvokeMethod.evaluate(JUnit4ZKTestRunner.java:79)


FAILED:  org.apache.zookeeper.RemoveWatchesCmdTest.testRemoveWatchesLocallyWhenNoServerConnection

Error Message:
KeeperErrorCode = ConnectionLoss for /testnode1

Stack Trace:
org.apache.zookeeper.KeeperException$ConnectionLossException: KeeperErrorCode = ConnectionLoss for /testnode1
	at org.apache.zookeeper.KeeperException.create(KeeperException.java:99)
	at org.apache.zookeeper.KeeperException.create(KeeperException.java:51)
	at org.apache.zookeeper.ZooKeeper.create(ZooKeeper.java:1445)
	at org.apache.zookeeper.RemoveWatchesCmdTest.verifyRemoveAnyWatches(RemoveWatchesCmdTest.java:285)
	at org.apache.zookeeper.RemoveWatchesCmdTest.testRemoveWatchesLocallyWhenNoServerConnection(RemoveWatchesCmdTest.java:248)
	at org.apache.zookeeper.JUnit4ZKTestRunner$LoggedInvokeMethod.evaluate(JUnit4ZKTestRunner.java:79)
	at java.util.concurrent.FutureTask.run(FutureTask.java:262)
	at java.lang.Thread.run(Thread.java:745)


FAILED:  org.apache.zookeeper.RemoveWatchesCmdTest.testRemoveWatchesWithNoPassedOptions

Error Message:
KeeperErrorCode = ConnectionLoss for /testnode1

Stack Trace:
org.apache.zookeeper.KeeperException$ConnectionLossException: KeeperErrorCode = ConnectionLoss for /testnode1
	at org.apache.zookeeper.KeeperException.create(KeeperException.java:99)
	at org.apache.zookeeper.KeeperException.create(KeeperException.java:51)
	at org.apache.zookeeper.ZooKeeper.create(ZooKeeper.java:1445)
	at org.apache.zookeeper.RemoveWatchesCmdTest.testRemoveWatchesWithNoPassedOptions(RemoveWatchesCmdTest.java:71)
	at org.apache.zookeeper.JUnit4ZKTestRunner$LoggedInvokeMethod.evaluate(JUnit4ZKTestRunner.java:79)
	at java.util.concurrent.FutureTask.run(FutureTask.java:262)
	at java.lang.Thread.run(Thread.java:745)


FAILED:  org.apache.zookeeper.RemoveWatchesCmdTest.testRemoveAnyWatches

Error Message:
KeeperErrorCode = ConnectionLoss for /testnode1

Stack Trace:
org.apache.zookeeper.KeeperException$ConnectionLossException: KeeperErrorCode = ConnectionLoss for /testnode1
	at org.apache.zookeeper.KeeperException.create(KeeperException.java:99)
	at org.apache.zookeeper.KeeperException.create(KeeperException.java:51)
	at org.apache.zookeeper.ZooKeeper.create(ZooKeeper.java:1445)
	at org.apache.zookeeper.RemoveWatchesCmdTest.verifyRemoveAnyWatches(RemoveWatchesCmdTest.java:285)
	at org.apache.zookeeper.RemoveWatchesCmdTest.testRemoveAnyWatches(RemoveWatchesCmdTest.java:238)
	at org.apache.zookeeper.JUnit4ZKTestRunner$LoggedInvokeMethod.evaluate(JUnit4ZKTestRunner.java:79)
	at java.util.concurrent.FutureTask.run(FutureTask.java:262)
	at java.lang.Thread.run(Thread.java:745)


FAILED:  org.apache.zookeeper.RemoveWatchesCmdTest.testRemoveNodeDeletedWatches

Error Message:
KeeperErrorCode = ConnectionLoss for /testnode1

Stack Trace:
org.apache.zookeeper.KeeperException$ConnectionLossException: KeeperErrorCode = ConnectionLoss for /testnode1
	at org.apache.zookeeper.KeeperException.create(KeeperException.java:99)
	at org.apache.zookeeper.KeeperException.create(KeeperException.java:51)
	at org.apache.zookeeper.ZooKeeper.create(ZooKeeper.java:1445)
	at org.apache.zookeeper.RemoveWatchesCmdTest.testRemoveNodeDeletedWatches(RemoveWatchesCmdTest.java:206)
	at org.apache.zookeeper.JUnit4ZKTestRunner$LoggedInvokeMethod.evaluate(JUnit4ZKTestRunner.java:79)
	at java.util.concurrent.FutureTask.run(FutureTask.java:262)
	at java.lang.Thread.run(Thread.java:745)


FAILED:  org.apache.zookeeper.RemoveWatchesCmdTest.testRemoveNodeDataChangedWatches

Error Message:
KeeperErrorCode = ConnectionLoss for /testnode1

Stack Trace:
org.apache.zookeeper.KeeperException$ConnectionLossException: KeeperErrorCode = ConnectionLoss for /testnode1
	at org.apache.zookeeper.KeeperException.create(KeeperException.java:99)
	at org.apache.zookeeper.KeeperException.create(KeeperException.java:51)
	at org.apache.zookeeper.ZooKeeper.create(ZooKeeper.java:1445)
	at org.apache.zookeeper.RemoveWatchesCmdTest.testRemoveNodeDataChangedWatches(RemoveWatchesCmdTest.java:110)
	at org.apache.zookeeper.JUnit4ZKTestRunner$LoggedInvokeMethod.evaluate(JUnit4ZKTestRunner.java:79)
	at java.util.concurrent.FutureTask.run(FutureTask.java:262)
	at java.lang.Thread.run(Thread.java:745)


FAILED:  org.apache.zookeeper.RemoveWatchesCmdTest.testRemoveNodeChildrenChangedWatches

Error Message:
KeeperErrorCode = ConnectionLoss for /testnode1

Stack Trace:
org.apache.zookeeper.KeeperException$ConnectionLossException: KeeperErrorCode = ConnectionLoss for /testnode1
	at org.apache.zookeeper.KeeperException.create(KeeperException.java:99)
	at org.apache.zookeeper.KeeperException.create(KeeperException.java:51)
	at org.apache.zookeeper.ZooKeeper.create(ZooKeeper.java:1445)
	at org.apache.zookeeper.RemoveWatchesCmdTest.testRemoveNodeChildrenChangedWatches(RemoveWatchesCmdTest.java:179)
	at org.apache.zookeeper.JUnit4ZKTestRunner$LoggedInvokeMethod.evaluate(JUnit4ZKTestRunner.java:79)
	at java.util.concurrent.FutureTask.run(FutureTask.java:262)
	at java.lang.Thread.run(Thread.java:745)


FAILED:  org.apache.zookeeper.SaslAuthTest.testAuth

Error Message:
KeeperErrorCode = ConnectionLoss for /path1

Stack Trace:
org.apache.zookeeper.KeeperException$ConnectionLossException: KeeperErrorCode = ConnectionLoss for /path1
	at org.apache.zookeeper.KeeperException.create(KeeperException.java:99)
	at org.apache.zookeeper.KeeperException.create(KeeperException.java:51)
	at org.apache.zookeeper.ZooKeeper.create(ZooKeeper.java:1445)
	at org.apache.zookeeper.SaslAuthTest.testAuth(SaslAuthTest.java:117)
	at org.apache.zookeeper.JUnit4ZKTestRunner$LoggedInvokeMethod.evaluate(JUnit4ZKTestRunner.java:79)


FAILED:  org.apache.zookeeper.SaslAuthTest.testZKOperationsAfterClientSaslAuthFailure

Error Message:
ZNode creation is failing continuously after Sasl auth failure.

Stack Trace:
junit.framework.AssertionFailedError: ZNode creation is failing continuously after Sasl auth failure.
	at org.apache.zookeeper.SaslAuthTest.testZKOperationsAfterClientSaslAuthFailure(SaslAuthTest.java:193)
	at org.apache.zookeeper.JUnit4ZKTestRunner$LoggedInvokeMethod.evaluate(JUnit4ZKTestRunner.java:79)


FAILED:  org.apache.zookeeper.SaslAuthTest.testInvalidSaslIds

Error Message:
KeeperErrorCode = ConnectionLoss for /invalid0

Stack Trace:
org.apache.zookeeper.KeeperException$ConnectionLossException: KeeperErrorCode = ConnectionLoss for /invalid0
	at org.apache.zookeeper.KeeperException.create(KeeperException.java:99)
	at org.apache.zookeeper.KeeperException.create(KeeperException.java:51)
	at org.apache.zookeeper.ZooKeeper.create(ZooKeeper.java:1445)
	at org.apache.zookeeper.SaslAuthTest.testInvalidSaslIds(SaslAuthTest.java:158)
	at org.apache.zookeeper.JUnit4ZKTestRunner$LoggedInvokeMethod.evaluate(JUnit4ZKTestRunner.java:79)


FAILED:  org.apache.zookeeper.SaslAuthTest.testValidSaslIds

Error Message:
KeeperErrorCode = ConnectionLoss for /valid0

Stack Trace:
org.apache.zookeeper.KeeperException$ConnectionLossException: KeeperErrorCode = ConnectionLoss for /valid0
	at org.apache.zookeeper.KeeperException.create(KeeperException.java:99)
	at org.apache.zookeeper.KeeperException.create(KeeperException.java:51)
	at org.apache.zookeeper.ZooKeeper.create(ZooKeeper.java:1445)
	at org.apache.zookeeper.SaslAuthTest.testValidSaslIds(SaslAuthTest.java:139)
	at org.apache.zookeeper.JUnit4ZKTestRunner$LoggedInvokeMethod.evaluate(JUnit4ZKTestRunner.java:79)


FAILED:  org.apache.zookeeper.ZooKeeperTest.testSortedLs

Error Message:
KeeperErrorCode = ConnectionLoss for /

Stack Trace:
org.apache.zookeeper.cli.CliWrapperException: KeeperErrorCode = ConnectionLoss for /
	at org.apache.zookeeper.cli.LsCommand.exec(LsCommand.java:114)
	at org.apache.zookeeper.ZooKeeperTest.runCommandExpect(ZooKeeperTest.java:466)
	at org.apache.zookeeper.ZooKeeperTest.testSortedLs(ZooKeeperTest.java:489)
	at org.apache.zookeeper.JUnit4ZKTestRunner$LoggedInvokeMethod.evaluate(JUnit4ZKTestRunner.java:79)
Caused by: org.apache.zookeeper.KeeperException$ConnectionLossException: KeeperErrorCode = ConnectionLoss for /
	at org.apache.zookeeper.KeeperException.create(KeeperException.java:99)
	at org.apache.zookeeper.KeeperException.create(KeeperException.java:51)
	at org.apache.zookeeper.ZooKeeper.getChildren(ZooKeeper.java:2579)
	at org.apache.zookeeper.ZooKeeper.getChildren(ZooKeeper.java:2614)
	at org.apache.zookeeper.cli.LsCommand.exec(LsCommand.java:108)


FAILED:  org.apache.zookeeper.ZooKeeperTest.testCreateNodeWithoutData

Error Message:
KeeperErrorCode = ConnectionLoss for /node

Stack Trace:
org.apache.zookeeper.cli.CliWrapperException: KeeperErrorCode = ConnectionLoss for /node
	at org.apache.zookeeper.cli.CreateCommand.exec(CreateCommand.java:130)
	at org.apache.zookeeper.ZooKeeperMain.processZKCmd(ZooKeeperMain.java:655)
	at org.apache.zookeeper.ZooKeeperTest.testCreateNodeWithoutData(ZooKeeperTest.java:276)
	at org.apache.zookeeper.JUnit4ZKTestRunner$LoggedInvokeMethod.evaluate(JUnit4ZKTestRunner.java:79)
Caused by: org.apache.zookeeper.KeeperException$ConnectionLossException: KeeperErrorCode = ConnectionLoss for /node
	at org.apache.zookeeper.KeeperException.create(KeeperException.java:99)
	at org.apache.zookeeper.KeeperException.create(KeeperException.java:51)
	at org.apache.zookeeper.ZooKeeper.create(ZooKeeper.java:1445)
	at org.apache.zookeeper.cli.CreateCommand.exec(CreateCommand.java:119)


FAILED:  org.apache.zookeeper.ZooKeeperTest.testACLWithExtraAgruments

Error Message:
KeeperErrorCode = ConnectionLoss for /l

Stack Trace:
org.apache.zookeeper.cli.CliWrapperException: KeeperErrorCode = ConnectionLoss for /l
	at org.apache.zookeeper.cli.CreateCommand.exec(CreateCommand.java:130)
	at org.apache.zookeeper.ZooKeeperMain.processZKCmd(ZooKeeperMain.java:655)
	at org.apache.zookeeper.ZooKeeperTest.testACLWithExtraAgruments(ZooKeeperTest.java:309)
	at org.apache.zookeeper.JUnit4ZKTestRunner$LoggedInvokeMethod.evaluate(JUnit4ZKTestRunner.java:79)
Caused by: org.apache.zookeeper.KeeperException$ConnectionLossException: KeeperErrorCode = ConnectionLoss for /l
	at org.apache.zookeeper.KeeperException.create(KeeperException.java:99)
	at org.apache.zookeeper.KeeperException.create(KeeperException.java:51)
	at org.apache.zookeeper.ZooKeeper.create(ZooKeeper.java:1445)
	at org.apache.zookeeper.cli.CreateCommand.exec(CreateCommand.java:119)


FAILED:  org.apache.zookeeper.ZooKeeperTest.testCreatePersistentNode

Error Message:
KeeperErrorCode = ConnectionLoss for /node2

Stack Trace:
org.apache.zookeeper.cli.CliWrapperException: KeeperErrorCode = ConnectionLoss for /node2
	at org.apache.zookeeper.cli.CreateCommand.exec(CreateCommand.java:130)
	at org.apache.zookeeper.ZooKeeperMain.processZKCmd(ZooKeeperMain.java:655)
	at org.apache.zookeeper.ZooKeeperTest.testCreatePersistentNode(ZooKeeperTest.java:320)
	at org.apache.zookeeper.JUnit4ZKTestRunner$LoggedInvokeMethod.evaluate(JUnit4ZKTestRunner.java:79)
Caused by: org.apache.zookeeper.KeeperException$ConnectionLossException: KeeperErrorCode = ConnectionLoss for /node2
	at org.apache.zookeeper.KeeperException.create(KeeperException.java:99)
	at org.apache.zookeeper.KeeperException.create(KeeperException.java:51)
	at org.apache.zookeeper.ZooKeeper.create(ZooKeeper.java:1445)
	at org.apache.zookeeper.cli.CreateCommand.exec(CreateCommand.java:119)


FAILED:  org.apache.zookeeper.ZooKeeperTest.testDeleteRecursiveAsync

Error Message:
KeeperErrorCode = ConnectionLoss for /

Stack Trace:
org.apache.zookeeper.KeeperException$ConnectionLossException: KeeperErrorCode = ConnectionLoss for /
	at org.apache.zookeeper.KeeperException.create(KeeperException.java:99)
	at org.apache.zookeeper.KeeperException.create(KeeperException.java:51)
	at org.apache.zookeeper.ZooKeeper.setData(ZooKeeper.java:2256)
	at org.apache.zookeeper.ZooKeeperTest.testDeleteRecursiveAsync(ZooKeeperTest.java:95)
	at org.apache.zookeeper.JUnit4ZKTestRunner$LoggedInvokeMethod.evaluate(JUnit4ZKTestRunner.java:79)


FAILED:  org.apache.zookeeper.ZooKeeperTest.testStatCommand

Error Message:
KeeperErrorCode = ConnectionLoss for /node3

Stack Trace:
org.apache.zookeeper.cli.CliWrapperException: KeeperErrorCode = ConnectionLoss for /node3
	at org.apache.zookeeper.cli.CreateCommand.exec(CreateCommand.java:130)
	at org.apache.zookeeper.ZooKeeperMain.processZKCmd(ZooKeeperMain.java:655)
	at org.apache.zookeeper.ZooKeeperTest.testStatCommand(ZooKeeperTest.java:352)
	at org.apache.zookeeper.JUnit4ZKTestRunner$LoggedInvokeMethod.evaluate(JUnit4ZKTestRunner.java:79)
Caused by: org.apache.zookeeper.KeeperException$ConnectionLossException: KeeperErrorCode = ConnectionLoss for /node3
	at org.apache.zookeeper.KeeperException.create(KeeperException.java:99)
	at org.apache.zookeeper.KeeperException.create(KeeperException.java:51)
	at org.apache.zookeeper.ZooKeeper.create(ZooKeeper.java:1445)
	at org.apache.zookeeper.cli.CreateCommand.exec(CreateCommand.java:119)


FAILED:  org.apache.zookeeper.ZooKeeperTest.testDelete

Error Message:
KeeperErrorCode = ConnectionLoss for /node2

Stack Trace:
org.apache.zookeeper.cli.CliWrapperException: KeeperErrorCode = ConnectionLoss for /node2
	at org.apache.zookeeper.cli.CreateCommand.exec(CreateCommand.java:130)
	at org.apache.zookeeper.ZooKeeperMain.processZKCmd(ZooKeeperMain.java:655)
	at org.apache.zookeeper.ZooKeeperTest.testDelete(ZooKeeperTest.java:332)
	at org.apache.zookeeper.JUnit4ZKTestRunner$LoggedInvokeMethod.evaluate(JUnit4ZKTestRunner.java:79)
Caused by: org.apache.zookeeper.KeeperException$ConnectionLossException: KeeperErrorCode = ConnectionLoss for /node2
	at org.apache.zookeeper.KeeperException.create(KeeperException.java:99)
	at org.apache.zookeeper.KeeperException.create(KeeperException.java:51)
	at org.apache.zookeeper.ZooKeeper.create(ZooKeeper.java:1445)
	at org.apache.zookeeper.cli.CreateCommand.exec(CreateCommand.java:119)


FAILED:  org.apache.zookeeper.ZooKeeperTest.testLsrLeafCommand

Error Message:
KeeperErrorCode = ConnectionLoss for /b/c

Stack Trace:
org.apache.zookeeper.cli.CliWrapperException: KeeperErrorCode = ConnectionLoss for /b/c
	at org.apache.zookeeper.cli.LsCommand.exec(LsCommand.java:114)
	at org.apache.zookeeper.ZooKeeperTest.runCommandExpect(ZooKeeperTest.java:466)
	at org.apache.zookeeper.ZooKeeperTest.testLsrLeafCommand(ZooKeeperTest.java:547)
	at org.apache.zookeeper.JUnit4ZKTestRunner$LoggedInvokeMethod.evaluate(JUnit4ZKTestRunner.java:79)
Caused by: org.apache.zookeeper.KeeperException$ConnectionLossException: KeeperErrorCode = ConnectionLoss for /b/c
	at org.apache.zookeeper.KeeperException.create(KeeperException.java:99)
	at org.apache.zookeeper.KeeperException.create(KeeperException.java:51)
	at org.apache.zookeeper.ZooKeeper.getData(ZooKeeper.java:2038)
	at org.apache.zookeeper.ZooKeeper.getData(ZooKeeper.java:2067)
	at org.apache.zookeeper.ZKUtil.visitSubTreeDFS(ZKUtil.java:140)
	at org.apache.zookeeper.cli.LsCommand.exec(LsCommand.java:100)


FAILED:  org.apache.zookeeper.ZooKeeperTest.testLsrCommand

Error Message:
KeeperErrorCode = ConnectionLoss for /a

Stack Trace:
org.apache.zookeeper.cli.CliWrapperException: KeeperErrorCode = ConnectionLoss for /a
	at org.apache.zookeeper.cli.LsCommand.exec(LsCommand.java:114)
	at org.apache.zookeeper.ZooKeeperTest.runCommandExpect(ZooKeeperTest.java:466)
	at org.apache.zookeeper.ZooKeeperTest.testLsrCommand(ZooKeeperTest.java:515)
	at org.apache.zookeeper.JUnit4ZKTestRunner$LoggedInvokeMethod.evaluate(JUnit4ZKTestRunner.java:79)
Caused by: org.apache.zookeeper.KeeperException$ConnectionLossException: KeeperErrorCode = ConnectionLoss for /a
	at org.apache.zookeeper.KeeperException.create(KeeperException.java:99)
	at org.apache.zookeeper.KeeperException.create(KeeperException.java:51)
	at org.apache.zookeeper.ZooKeeper.getData(ZooKeeper.java:2038)
	at org.apache.zookeeper.ZooKeeper.getData(ZooKeeper.java:2067)
	at org.apache.zookeeper.ZKUtil.visitSubTreeDFS(ZKUtil.java:140)
	at org.apache.zookeeper.cli.LsCommand.exec(LsCommand.java:100)


FAILED:  org.apache.zookeeper.ZooKeeperTest.testSetData

Error Message:
KeeperErrorCode = ConnectionLoss for /node4

Stack Trace:
org.apache.zookeeper.cli.CliWrapperException: KeeperErrorCode = ConnectionLoss for /node4
	at org.apache.zookeeper.cli.CreateCommand.exec(CreateCommand.java:130)
	at org.apache.zookeeper.ZooKeeperMain.processZKCmd(ZooKeeperMain.java:655)
	at org.apache.zookeeper.ZooKeeperTest.testSetData(ZooKeeperTest.java:384)
	at org.apache.zookeeper.JUnit4ZKTestRunner$LoggedInvokeMethod.evaluate(JUnit4ZKTestRunner.java:79)
Caused by: org.apache.zookeeper.KeeperException$ConnectionLossException: KeeperErrorCode = ConnectionLoss for /node4
	at org.apache.zookeeper.KeeperException.create(KeeperException.java:99)
	at org.apache.zookeeper.KeeperException.create(KeeperException.java:51)
	at org.apache.zookeeper.ZooKeeper.create(ZooKeeper.java:1445)
	at org.apache.zookeeper.cli.CreateCommand.exec(CreateCommand.java:119)


FAILED:  org.apache.zookeeper.ZooKeeperTest.testLsrNonexistantZnodeCommand

Error Message:
expected:<NONODE> but was:<CONNECTIONLOSS>

Stack Trace:
junit.framework.AssertionFailedError: expected:<NONODE> but was:<CONNECTIONLOSS>
	at org.apache.zookeeper.ZooKeeperTest.testLsrNonexistantZnodeCommand(ZooKeeperTest.java:566)
	at org.apache.zookeeper.JUnit4ZKTestRunner$LoggedInvokeMethod.evaluate(JUnit4ZKTestRunner.java:79)


FAILED:  org.apache.zookeeper.ZooKeeperTest.testDeleteRecursive

Error Message:
KeeperErrorCode = ConnectionLoss for /

Stack Trace:
org.apache.zookeeper.KeeperException$ConnectionLossException: KeeperErrorCode = ConnectionLoss for /
	at org.apache.zookeeper.KeeperException.create(KeeperException.java:99)
	at org.apache.zookeeper.KeeperException.create(KeeperException.java:51)
	at org.apache.zookeeper.ZooKeeper.setData(ZooKeeper.java:2256)
	at org.apache.zookeeper.ZooKeeperTest.testDeleteRecursive(ZooKeeperTest.java:51)
	at org.apache.zookeeper.JUnit4ZKTestRunner$LoggedInvokeMethod.evaluate(JUnit4ZKTestRunner.java:79)


FAILED:  org.apache.zookeeper.server.CRCTest.testChecksums

Error Message:
KeeperErrorCode = ConnectionLoss for /crctest- 0

Stack Trace:
org.apache.zookeeper.KeeperException$ConnectionLossException: KeeperErrorCode = ConnectionLoss for /crctest- 0
	at org.apache.zookeeper.KeeperException.create(KeeperException.java:99)
	at org.apache.zookeeper.KeeperException.create(KeeperException.java:51)
	at org.apache.zookeeper.ZooKeeper.create(ZooKeeper.java:1445)
	at org.apache.zookeeper.server.CRCTest.testChecksums(CRCTest.java:121)
	at org.apache.zookeeper.JUnit4ZKTestRunner$LoggedInvokeMethod.evaluate(JUnit4ZKTestRunner.java:79)


FAILED:  org.apache.zookeeper.server.CreateContainerTest.testFalseEmpty

Error Message:
KeeperErrorCode = ConnectionLoss for /foo

Stack Trace:
org.apache.zookeeper.KeeperException$ConnectionLossException: KeeperErrorCode = ConnectionLoss for /foo
	at org.apache.zookeeper.KeeperException.create(KeeperException.java:99)
	at org.apache.zookeeper.KeeperException.create(KeeperException.java:51)
	at org.apache.zookeeper.ZooKeeper.create(ZooKeeper.java:1445)
	at org.apache.zookeeper.server.CreateContainerTest.testFalseEmpty(CreateContainerTest.java:190)
	at org.apache.zookeeper.JUnit4ZKTestRunner$LoggedInvokeMethod.evaluate(JUnit4ZKTestRunner.java:79)
	at java.util.concurrent.FutureTask.run(FutureTask.java:262)
	at java.lang.Thread.run(Thread.java:745)


FAILED:  org.apache.zookeeper.server.CreateContainerTest.testCreateWithStat

Error Message:
KeeperErrorCode = ConnectionLoss for /foo

Stack Trace:
org.apache.zookeeper.KeeperException$ConnectionLossException: KeeperErrorCode = ConnectionLoss for /foo
	at org.apache.zookeeper.KeeperException.create(KeeperException.java:99)
	at org.apache.zookeeper.KeeperException.create(KeeperException.java:51)
	at org.apache.zookeeper.ZooKeeper.create(ZooKeeper.java:1544)
	at org.apache.zookeeper.ZooKeeper.create(ZooKeeper.java:1515)
	at org.apache.zookeeper.server.CreateContainerTest.createWithStatVerifyResult(CreateContainerTest.java:261)
	at org.apache.zookeeper.server.CreateContainerTest.testCreateWithStat(CreateContainerTest.java:58)
	at org.apache.zookeeper.JUnit4ZKTestRunner$LoggedInvokeMethod.evaluate(JUnit4ZKTestRunner.java:79)
	at java.util.concurrent.FutureTask.run(FutureTask.java:262)
	at java.lang.Thread.run(Thread.java:745)


FAILED:  org.apache.zookeeper.server.CreateContainerTest.testSimpleDeletionAsync

Error Message:
null

Stack Trace:
junit.framework.AssertionFailedError
	at org.apache.zookeeper.server.CreateContainerTest.testSimpleDeletionAsync(CreateContainerTest.java:154)
	at org.apache.zookeeper.JUnit4ZKTestRunner$LoggedInvokeMethod.evaluate(JUnit4ZKTestRunner.java:79)
	at java.util.concurrent.FutureTask.run(FutureTask.java:262)
	at java.lang.Thread.run(Thread.java:745)


FAILED:  org.apache.zookeeper.server.CreateContainerTest.testMultiWithContainer

Error Message:
KeeperErrorCode = ConnectionLoss

Stack Trace:
org.apache.zookeeper.KeeperException$ConnectionLossException: KeeperErrorCode = ConnectionLoss
	at org.apache.zookeeper.KeeperException.create(KeeperException.java:99)
	at org.apache.zookeeper.ZooKeeper.multiInternal(ZooKeeper.java:1818)
	at org.apache.zookeeper.ZooKeeper.multi(ZooKeeper.java:1737)
	at org.apache.zookeeper.server.CreateContainerTest.testMultiWithContainer(CreateContainerTest.java:113)
	at org.apache.zookeeper.JUnit4ZKTestRunner$LoggedInvokeMethod.evaluate(JUnit4ZKTestRunner.java:79)
	at java.util.concurrent.FutureTask.run(FutureTask.java:262)
	at java.lang.Thread.run(Thread.java:745)


FAILED:  org.apache.zookeeper.server.CreateContainerTest.testCascadingDeletion

Error Message:
KeeperErrorCode = ConnectionLoss for /foo

Stack Trace:
org.apache.zookeeper.KeeperException$ConnectionLossException: KeeperErrorCode = ConnectionLoss for /foo
	at org.apache.zookeeper.KeeperException.create(KeeperException.java:99)
	at org.apache.zookeeper.KeeperException.create(KeeperException.java:51)
	at org.apache.zookeeper.ZooKeeper.create(ZooKeeper.java:1445)
	at org.apache.zookeeper.server.CreateContainerTest.testCascadingDeletion(CreateContainerTest.java:170)
	at org.apache.zookeeper.JUnit4ZKTestRunner$LoggedInvokeMethod.evaluate(JUnit4ZKTestRunner.java:79)
	at java.util.concurrent.FutureTask.run(FutureTask.java:262)
	at java.lang.Thread.run(Thread.java:745)


FAILED:  org.apache.zookeeper.server.CreateContainerTest.testSimpleDeletion

Error Message:
KeeperErrorCode = ConnectionLoss for /foo

Stack Trace:
org.apache.zookeeper.KeeperException$ConnectionLossException: KeeperErrorCode = ConnectionLoss for /foo
	at org.apache.zookeeper.KeeperException.create(KeeperException.java:99)
	at org.apache.zookeeper.KeeperException.create(KeeperException.java:51)
	at org.apache.zookeeper.ZooKeeper.create(ZooKeeper.java:1445)
	at org.apache.zookeeper.server.CreateContainerTest.testSimpleDeletion(CreateContainerTest.java:82)
	at org.apache.zookeeper.JUnit4ZKTestRunner$LoggedInvokeMethod.evaluate(JUnit4ZKTestRunner.java:79)
	at java.util.concurrent.FutureTask.run(FutureTask.java:262)
	at java.lang.Thread.run(Thread.java:745)


FAILED:  org.apache.zookeeper.server.CreateContainerTest.testMultiWithContainerSimple

Error Message:
KeeperErrorCode = ConnectionLoss

Stack Trace:
org.apache.zookeeper.KeeperException$ConnectionLossException: KeeperErrorCode = ConnectionLoss
	at org.apache.zookeeper.KeeperException.create(KeeperException.java:99)
	at org.apache.zookeeper.ZooKeeper.multiInternal(ZooKeeper.java:1818)
	at org.apache.zookeeper.ZooKeeper.multi(ZooKeeper.java:1737)
	at org.apache.zookeeper.server.CreateContainerTest.testMultiWithContainerSimple(CreateContainerTest.java:100)
	at org.apache.zookeeper.JUnit4ZKTestRunner$LoggedInvokeMethod.evaluate(JUnit4ZKTestRunner.java:79)
	at java.util.concurrent.FutureTask.run(FutureTask.java:262)
	at java.lang.Thread.run(Thread.java:745)


FAILED:  org.apache.zookeeper.server.CreateContainerTest.testCreateWithNullStat

Error Message:
KeeperErrorCode = ConnectionLoss for /foo

Stack Trace:
org.apache.zookeeper.KeeperException$ConnectionLossException: KeeperErrorCode = ConnectionLoss for /foo
	at org.apache.zookeeper.KeeperException.create(KeeperException.java:99)
	at org.apache.zookeeper.KeeperException.create(KeeperException.java:51)
	at org.apache.zookeeper.ZooKeeper.create(ZooKeeper.java:1544)
	at org.apache.zookeeper.ZooKeeper.create(ZooKeeper.java:1515)
	at org.apache.zookeeper.server.CreateContainerTest.testCreateWithNullStat(CreateContainerTest.java:74)
	at org.apache.zookeeper.JUnit4ZKTestRunner$LoggedInvokeMethod.evaluate(JUnit4ZKTestRunner.java:79)
	at java.util.concurrent.FutureTask.run(FutureTask.java:262)
	at java.lang.Thread.run(Thread.java:745)


FAILED:  org.apache.zookeeper.server.CreateContainerTest.testCreate

Error Message:
KeeperErrorCode = ConnectionLoss for /foo

Stack Trace:
org.apache.zookeeper.KeeperException$ConnectionLossException: KeeperErrorCode = ConnectionLoss for /foo
	at org.apache.zookeeper.KeeperException.create(KeeperException.java:99)
	at org.apache.zookeeper.KeeperException.create(KeeperException.java:51)
	at org.apache.zookeeper.ZooKeeper.create(ZooKeeper.java:1445)
	at org.apache.zookeeper.server.CreateContainerTest.createNoStatVerifyResult(CreateContainerTest.java:252)
	at org.apache.zookeeper.server.CreateContainerTest.testCreate(CreateContainerTest.java:51)
	at org.apache.zookeeper.JUnit4ZKTestRunner$LoggedInvokeMethod.evaluate(JUnit4ZKTestRunner.java:79)
	at java.util.concurrent.FutureTask.run(FutureTask.java:262)
	at java.lang.Thread.run(Thread.java:745)


FAILED:  org.apache.zookeeper.server.CreateTTLTest.testModifying

Error Message:
KeeperErrorCode = ConnectionLoss for /foo

Stack Trace:
org.apache.zookeeper.KeeperException$ConnectionLossException: KeeperErrorCode = ConnectionLoss for /foo
	at org.apache.zookeeper.KeeperException.create(KeeperException.java:99)
	at org.apache.zookeeper.KeeperException.create(KeeperException.java:51)
	at org.apache.zookeeper.ZooKeeper.create(ZooKeeper.java:1544)
	at org.apache.zookeeper.server.CreateTTLTest.testModifying(CreateTTLTest.java:134)
	at org.apache.zookeeper.JUnit4ZKTestRunner$LoggedInvokeMethod.evaluate(JUnit4ZKTestRunner.java:79)


FAILED:  org.apache.zookeeper.server.CreateTTLTest.testMulti

Error Message:
KeeperErrorCode = ConnectionLoss

Stack Trace:
org.apache.zookeeper.KeeperException$ConnectionLossException: KeeperErrorCode = ConnectionLoss
	at org.apache.zookeeper.KeeperException.create(KeeperException.java:99)
	at org.apache.zookeeper.ZooKeeper.multiInternal(ZooKeeper.java:1818)
	at org.apache.zookeeper.ZooKeeper.multi(ZooKeeper.java:1737)
	at org.apache.zookeeper.server.CreateTTLTest.testMulti(CreateTTLTest.java:160)
	at org.apache.zookeeper.JUnit4ZKTestRunner$LoggedInvokeMethod.evaluate(JUnit4ZKTestRunner.java:79)


FAILED:  org.apache.zookeeper.server.CreateTTLTest.testCreateAsync

Error Message:
KeeperErrorCode = ConnectionLoss for /foo

Stack Trace:
org.apache.zookeeper.KeeperException$ConnectionLossException: KeeperErrorCode = ConnectionLoss for /foo
	at org.apache.zookeeper.KeeperException.create(KeeperException.java:99)
	at org.apache.zookeeper.KeeperException.create(KeeperException.java:51)
	at org.apache.zookeeper.ZooKeeper.exists(ZooKeeper.java:1928)
	at org.apache.zookeeper.ZooKeeper.exists(ZooKeeper.java:1956)
	at org.apache.zookeeper.server.CreateTTLTest.testCreateAsync(CreateTTLTest.java:123)
	at org.apache.zookeeper.JUnit4ZKTestRunner$LoggedInvokeMethod.evaluate(JUnit4ZKTestRunner.java:79)


FAILED:  org.apache.zookeeper.server.CreateTTLTest.testBadTTLs

Error Message:
An invalid CreateTTLRequest should throw BadArguments expected:<-4> but was:<-8>

Stack Trace:
junit.framework.AssertionFailedError: An invalid CreateTTLRequest should throw BadArguments expected:<-4> but was:<-8>
	at org.apache.zookeeper.server.CreateTTLTest.testBadTTLs(CreateTTLTest.java:86)
	at org.apache.zookeeper.JUnit4ZKTestRunner$LoggedInvokeMethod.evaluate(JUnit4ZKTestRunner.java:79)


FAILED:  org.apache.zookeeper.server.CreateTTLTest.testCreateSequential

Error Message:
KeeperErrorCode = ConnectionLoss for /foo

Stack Trace:
org.apache.zookeeper.KeeperException$ConnectionLossException: KeeperErrorCode = ConnectionLoss for /foo
	at org.apache.zookeeper.KeeperException.create(KeeperException.java:99)
	at org.apache.zookeeper.KeeperException.create(KeeperException.java:51)
	at org.apache.zookeeper.ZooKeeper.create(ZooKeeper.java:1544)
	at org.apache.zookeeper.server.CreateTTLTest.testCreateSequential(CreateTTLTest.java:96)
	at org.apache.zookeeper.JUnit4ZKTestRunner$LoggedInvokeMethod.evaluate(JUnit4ZKTestRunner.java:79)


FAILED:  org.apache.zookeeper.server.CreateTTLTest.testCreate

Error Message:
KeeperErrorCode = ConnectionLoss for /foo

Stack Trace:
org.apache.zookeeper.KeeperException$ConnectionLossException: KeeperErrorCode = ConnectionLoss for /foo
	at org.apache.zookeeper.KeeperException.create(KeeperException.java:99)
	at org.apache.zookeeper.KeeperException.create(KeeperException.java:51)
	at org.apache.zookeeper.ZooKeeper.create(ZooKeeper.java:1544)
	at org.apache.zookeeper.server.CreateTTLTest.testCreate(CreateTTLTest.java:64)
	at org.apache.zookeeper.JUnit4ZKTestRunner$LoggedInvokeMethod.evaluate(JUnit4ZKTestRunner.java:79)


FAILED:  org.apache.zookeeper.server.InvalidSnapshotTest.testInvalidSnapshot

Error Message:
KeeperErrorCode = ConnectionLoss for /invalidsnap-0

Stack Trace:
org.apache.zookeeper.KeeperException$ConnectionLossException: KeeperErrorCode = ConnectionLoss for /invalidsnap-0
	at org.apache.zookeeper.KeeperException.create(KeeperException.java:99)
	at org.apache.zookeeper.KeeperException.create(KeeperException.java:51)
	at org.apache.zookeeper.ZooKeeper.create(ZooKeeper.java:1445)
	at org.apache.zookeeper.server.InvalidSnapshotTest.testInvalidSnapshot(InvalidSnapshotTest.java:56)
	at org.apache.zookeeper.JUnit4ZKTestRunner$LoggedInvokeMethod.evaluate(JUnit4ZKTestRunner.java:79)


FAILED:  org.apache.zookeeper.server.MultiOpSessionUpgradeTest.ephemeralCreateMultiOpTest

Error Message:
KeeperErrorCode = ConnectionLoss

Stack Trace:
org.apache.zookeeper.KeeperException$ConnectionLossException: KeeperErrorCode = ConnectionLoss
	at org.apache.zookeeper.KeeperException.create(KeeperException.java:99)
	at org.apache.zookeeper.ZooKeeper.multiInternal(ZooKeeper.java:1818)
	at org.apache.zookeeper.ZooKeeper.multi(ZooKeeper.java:1737)
	at org.apache.zookeeper.server.MultiOpSessionUpgradeTest.ephemeralCreateMultiOpTest(MultiOpSessionUpgradeTest.java:72)
	at org.apache.zookeeper.JUnit4ZKTestRunner$LoggedInvokeMethod.evaluate(JUnit4ZKTestRunner.java:79)


FAILED:  org.apache.zookeeper.server.NIOServerCnxnTest.testOperationsAfterCnxnClose

Error Message:
KeeperErrorCode = ConnectionLoss for /a

Stack Trace:
org.apache.zookeeper.KeeperException$ConnectionLossException: KeeperErrorCode = ConnectionLoss for /a
	at org.apache.zookeeper.KeeperException.create(KeeperException.java:99)
	at org.apache.zookeeper.KeeperException.create(KeeperException.java:51)
	at org.apache.zookeeper.ZooKeeper.create(ZooKeeper.java:1445)
	at org.apache.zookeeper.server.NIOServerCnxnTest.testOperationsAfterCnxnClose(NIOServerCnxnTest.java:48)
	at org.apache.zookeeper.JUnit4ZKTestRunner$LoggedInvokeMethod.evaluate(JUnit4ZKTestRunner.java:79)
	at java.util.concurrent.FutureTask.run(FutureTask.java:262)
	at java.lang.Thread.run(Thread.java:745)


FAILED:  org.apache.zookeeper.server.NettyServerCnxnTest.testSendCloseSession

Error Message:
KeeperErrorCode = ConnectionLoss for /a

Stack Trace:
org.apache.zookeeper.KeeperException$ConnectionLossException: KeeperErrorCode = ConnectionLoss for /a
	at org.apache.zookeeper.KeeperException.create(KeeperException.java:99)
	at org.apache.zookeeper.KeeperException.create(KeeperException.java:51)
	at org.apache.zookeeper.ZooKeeper.create(ZooKeeper.java:1445)
	at org.apache.zookeeper.server.NettyServerCnxnTest.testSendCloseSession(NettyServerCnxnTest.java:64)
	at org.apache.zookeeper.JUnit4ZKTestRunner$LoggedInvokeMethod.evaluate(JUnit4ZKTestRunner.java:79)
	at java.util.concurrent.FutureTask.run(FutureTask.java:262)
	at java.lang.Thread.run(Thread.java:745)


FAILED:  org.apache.zookeeper.server.PurgeTxnTest.testPurge

Error Message:
KeeperErrorCode = ConnectionLoss for /invalidsnap-0

Stack Trace:
org.apache.zookeeper.KeeperException$ConnectionLossException: KeeperErrorCode = ConnectionLoss for /invalidsnap-0
	at org.apache.zookeeper.KeeperException.create(KeeperException.java:99)
	at org.apache.zookeeper.KeeperException.create(KeeperException.java:51)
	at org.apache.zookeeper.ZooKeeper.create(ZooKeeper.java:1445)
	at org.apache.zookeeper.server.PurgeTxnTest.testPurge(PurgeTxnTest.java:84)
	at org.apache.zookeeper.JUnit4ZKTestRunner$LoggedInvokeMethod.evaluate(JUnit4ZKTestRunner.java:79)


FAILED:  org.apache.zookeeper.server.PurgeTxnTest.testPurgeDoesNotDeleteOverlappingLogFile

Error Message:
Address already in use

Stack Trace:
java.net.BindException: Address already in use
	at sun.nio.ch.Net.bind0(Native Method)
	at sun.nio.ch.Net.bind(Net.java:463)
	at sun.nio.ch.Net.bind(Net.java:455)
	at sun.nio.ch.ServerSocketChannelImpl.bind(ServerSocketChannelImpl.java:223)
	at sun.nio.ch.ServerSocketAdaptor.bind(ServerSocketAdaptor.java:74)
	at sun.nio.ch.ServerSocketAdaptor.bind(ServerSocketAdaptor.java:67)
	at org.apache.zookeeper.server.NIOServerCnxnFactory.configure(NIOServerCnxnFactory.java:687)
	at org.apache.zookeeper.server.ServerCnxnFactory.configure(ServerCnxnFactory.java:76)
	at org.apache.zookeeper.server.ServerCnxnFactory.createFactory(ServerCnxnFactory.java:154)
	at org.apache.zookeeper.server.ServerCnxnFactory.createFactory(ServerCnxnFactory.java:147)
	at org.apache.zookeeper.server.PurgeTxnTest.testPurgeDoesNotDeleteOverlappingLogFile(PurgeTxnTest.java:458)
	at org.apache.zookeeper.JUnit4ZKTestRunner$LoggedInvokeMethod.evaluate(JUnit4ZKTestRunner.java:79)


FAILED:  org.apache.zookeeper.server.PurgeTxnTest.testPurgeWhenLogRollingInProgress

Error Message:
Address already in use

Stack Trace:
java.net.BindException: Address already in use
	at sun.nio.ch.Net.bind0(Native Method)
	at sun.nio.ch.Net.bind(Net.java:463)
	at sun.nio.ch.Net.bind(Net.java:455)
	at sun.nio.ch.ServerSocketChannelImpl.bind(ServerSocketChannelImpl.java:223)
	at sun.nio.ch.ServerSocketAdaptor.bind(ServerSocketAdaptor.java:74)
	at sun.nio.ch.ServerSocketAdaptor.bind(ServerSocketAdaptor.java:67)
	at org.apache.zookeeper.server.NIOServerCnxnFactory.configure(NIOServerCnxnFactory.java:687)
	at org.apache.zookeeper.server.ServerCnxnFactory.configure(ServerCnxnFactory.java:76)
	at org.apache.zookeeper.server.ServerCnxnFactory.createFactory(ServerCnxnFactory.java:154)
	at org.apache.zookeeper.server.ServerCnxnFactory.createFactory(ServerCnxnFactory.java:147)
	at org.apache.zookeeper.server.PurgeTxnTest.testPurgeWhenLogRollingInProgress(PurgeTxnTest.java:124)
	at org.apache.zookeeper.JUnit4ZKTestRunner$LoggedInvokeMethod.evaluate(JUnit4ZKTestRunner.java:79)


FAILED:  org.apache.zookeeper.server.ZooKeeperServerMainTest.testStandalone

Error Message:
KeeperErrorCode = ConnectionLoss for /foo

Stack Trace:
org.apache.zookeeper.KeeperException$ConnectionLossException: KeeperErrorCode = ConnectionLoss for /foo
	at org.apache.zookeeper.KeeperException.create(KeeperException.java:99)
	at org.apache.zookeeper.KeeperException.create(KeeperException.java:51)
	at org.apache.zookeeper.ZooKeeper.create(ZooKeeper.java:1445)
	at org.apache.zookeeper.server.ZooKeeperServerMainTest.testStandalone(ZooKeeperServerMainTest.java:308)
	at org.apache.zookeeper.JUnit4ZKTestRunner$LoggedInvokeMethod.evaluate(JUnit4ZKTestRunner.java:79)


FAILED:  org.apache.zookeeper.server.ZooKeeperServerMainTest.testMinMaxSessionTimeOut

Error Message:
Failed to establish zkclient connection!

Stack Trace:
junit.framework.AssertionFailedError: Failed to establish zkclient connection!
	at org.apache.zookeeper.server.ZooKeeperServerMainTest.verifySessionTimeOut(ZooKeeperServerMainTest.java:420)
	at org.apache.zookeeper.server.ZooKeeperServerMainTest.testMinMaxSessionTimeOut(ZooKeeperServerMainTest.java:403)
	at org.apache.zookeeper.JUnit4ZKTestRunner$LoggedInvokeMethod.evaluate(JUnit4ZKTestRunner.java:79)


FAILED:  org.apache.zookeeper.server.ZooKeeperServerMainTest.testWithOnlyMinSessionTimeout

Error Message:
Failed to establish zkclient connection!

Stack Trace:
junit.framework.AssertionFailedError: Failed to establish zkclient connection!
	at org.apache.zookeeper.server.ZooKeeperServerMainTest.verifySessionTimeOut(ZooKeeperServerMainTest.java:420)
	at org.apache.zookeeper.server.ZooKeeperServerMainTest.testWithOnlyMinSessionTimeout(ZooKeeperServerMainTest.java:370)
	at org.apache.zookeeper.JUnit4ZKTestRunner$LoggedInvokeMethod.evaluate(JUnit4ZKTestRunner.java:79)


FAILED:  org.apache.zookeeper.server.ZooKeeperServerMainTest.testNonRecoverableError

Error Message:
KeeperErrorCode = ConnectionLoss for /foo1

Stack Trace:
org.apache.zookeeper.KeeperException$ConnectionLossException: KeeperErrorCode = ConnectionLoss for /foo1
	at org.apache.zookeeper.KeeperException.create(KeeperException.java:99)
	at org.apache.zookeeper.KeeperException.create(KeeperException.java:51)
	at org.apache.zookeeper.ZooKeeper.create(ZooKeeper.java:1445)
	at org.apache.zookeeper.server.ZooKeeperServerMainTest.testNonRecoverableError(ZooKeeperServerMainTest.java:171)
	at org.apache.zookeeper.JUnit4ZKTestRunner$LoggedInvokeMethod.evaluate(JUnit4ZKTestRunner.java:79)
	at java.util.concurrent.FutureTask.run(FutureTask.java:262)
	at java.lang.Thread.run(Thread.java:745)


FAILED:  org.apache.zookeeper.server.ZxidRolloverTest.testRolloverThenLeaderRestart

Error Message:
Failed to connect to ZooKeeper server.

Stack Trace:
java.util.concurrent.TimeoutException: Failed to connect to ZooKeeper server.
	at org.apache.zookeeper.test.ClientBase$CountdownWatcher.waitForConnected(ClientBase.java:149)
	at org.apache.zookeeper.server.ZxidRolloverTest.waitForClientsConnected(ZxidRolloverTest.java:80)
	at org.apache.zookeeper.server.ZxidRolloverTest.setUp(ZxidRolloverTest.java:75)


FAILED:  org.apache.zookeeper.server.ZxidRolloverTest.testRolloverThenFollowerRestart

Error Message:
Failed to connect to ZooKeeper server.

Stack Trace:
java.util.concurrent.TimeoutException: Failed to connect to ZooKeeper server.
	at org.apache.zookeeper.test.ClientBase$CountdownWatcher.waitForConnected(ClientBase.java:149)
	at org.apache.zookeeper.server.ZxidRolloverTest.waitForClientsConnected(ZxidRolloverTest.java:80)
	at org.apache.zookeeper.server.ZxidRolloverTest.setUp(ZxidRolloverTest.java:75)


FAILED:  org.apache.zookeeper.server.ZxidRolloverTest.testMultipleRollover

Error Message:
Failed to connect to ZooKeeper server.

Stack Trace:
java.util.concurrent.TimeoutException: Failed to connect to ZooKeeper server.
	at org.apache.zookeeper.test.ClientBase$CountdownWatcher.waitForConnected(ClientBase.java:149)
	at org.apache.zookeeper.server.ZxidRolloverTest.waitForClientsConnected(ZxidRolloverTest.java:80)
	at org.apache.zookeeper.server.ZxidRolloverTest.setUp(ZxidRolloverTest.java:75)


FAILED:  org.apache.zookeeper.server.quorum.QuorumPeerMainTest.testEarlyLeaderAbandonment

Error Message:
Waiting too long

Stack Trace:
java.lang.RuntimeException: Waiting too long
	at org.apache.zookeeper.server.quorum.QuorumPeerMainTest.waitForAll(QuorumPeerMainTest.java:354)
	at org.apache.zookeeper.server.quorum.QuorumPeerMainTest.testEarlyLeaderAbandonment(QuorumPeerMainTest.java:160)
	at org.apache.zookeeper.JUnit4ZKTestRunner$LoggedInvokeMethod.evaluate(JUnit4ZKTestRunner.java:79)


FAILED:  org.apache.zookeeper.server.quorum.QuorumPeerMainTest.testHighestZxidJoinLate

Error Message:
Waiting too long

Stack Trace:
java.lang.RuntimeException: Waiting too long
	at org.apache.zookeeper.server.quorum.QuorumPeerMainTest.waitForAll(QuorumPeerMainTest.java:354)
	at org.apache.zookeeper.server.quorum.QuorumPeerMainTest.LaunchServers(QuorumPeerMainTest.java:401)
	at org.apache.zookeeper.server.quorum.QuorumPeerMainTest.testHighestZxidJoinLate(QuorumPeerMainTest.java:248)
	at org.apache.zookeeper.JUnit4ZKTestRunner$LoggedInvokeMethod.evaluate(JUnit4ZKTestRunner.java:79)


FAILED:  org.apache.zookeeper.server.quorum.QuorumPeerMainTest.testBadPackets

Error Message:
KeeperErrorCode = ConnectionLoss for /foo_q1

Stack Trace:
org.apache.zookeeper.KeeperException$ConnectionLossException: KeeperErrorCode = ConnectionLoss for /foo_q1
	at org.apache.zookeeper.KeeperException.create(KeeperException.java:99)
	at org.apache.zookeeper.KeeperException.create(KeeperException.java:51)
	at org.apache.zookeeper.ZooKeeper.create(ZooKeeper.java:1445)
	at org.apache.zookeeper.server.quorum.QuorumPeerMainTest.testBadPackets(QuorumPeerMainTest.java:601)
	at org.apache.zookeeper.JUnit4ZKTestRunner$LoggedInvokeMethod.evaluate(JUnit4ZKTestRunner.java:79)


FAILED:  org.apache.zookeeper.server.quorum.QuorumPeerMainTest.testQuorum

Error Message:
KeeperErrorCode = ConnectionLoss for /foo_q1

Stack Trace:
org.apache.zookeeper.KeeperException$ConnectionLossException: KeeperErrorCode = ConnectionLoss for /foo_q1
	at org.apache.zookeeper.KeeperException.create(KeeperException.java:99)
	at org.apache.zookeeper.KeeperException.create(KeeperException.java:51)
	at org.apache.zookeeper.ZooKeeper.create(ZooKeeper.java:1445)
	at org.apache.zookeeper.server.quorum.QuorumPeerMainTest.testQuorum(QuorumPeerMainTest.java:113)
	at org.apache.zookeeper.JUnit4ZKTestRunner$LoggedInvokeMethod.evaluate(JUnit4ZKTestRunner.java:79)


FAILED:  org.apache.zookeeper.server.quorum.QuorumRequestPipelineTest.testSetAndGetChildren[0]

Error Message:
KeeperErrorCode = ConnectionLoss for /foo

Stack Trace:
org.apache.zookeeper.KeeperException$ConnectionLossException: KeeperErrorCode = ConnectionLoss for /foo
	at org.apache.zookeeper.KeeperException.create(KeeperException.java:99)
	at org.apache.zookeeper.KeeperException.create(KeeperException.java:51)
	at org.apache.zookeeper.ZooKeeper.create(ZooKeeper.java:1544)
	at org.apache.zookeeper.ZooKeeper.create(ZooKeeper.java:1515)
	at org.apache.zookeeper.server.quorum.QuorumRequestPipelineTest.create2EmptyNode(QuorumRequestPipelineTest.java:87)
	at org.apache.zookeeper.server.quorum.QuorumRequestPipelineTest.testSetAndGetChildren(QuorumRequestPipelineTest.java:153)
	at org.apache.zookeeper.JUnit4ZKTestRunner$LoggedInvokeMethod.evaluate(JUnit4ZKTestRunner.java:79)


FAILED:  org.apache.zookeeper.server.quorum.QuorumRequestPipelineTest.testSetAndGetACL[0]

Error Message:
KeeperErrorCode = ConnectionLoss for /foo

Stack Trace:
org.apache.zookeeper.KeeperException$ConnectionLossException: KeeperErrorCode = ConnectionLoss for /foo
	at org.apache.zookeeper.KeeperException.create(KeeperException.java:99)
	at org.apache.zookeeper.KeeperException.create(KeeperException.java:51)
	at org.apache.zookeeper.ZooKeeper.create(ZooKeeper.java:1544)
	at org.apache.zookeeper.ZooKeeper.create(ZooKeeper.java:1515)
	at org.apache.zookeeper.server.quorum.QuorumRequestPipelineTest.create2EmptyNode(QuorumRequestPipelineTest.java:87)
	at org.apache.zookeeper.server.quorum.QuorumRequestPipelineTest.testSetAndGetACL(QuorumRequestPipelineTest.java:139)
	at org.apache.zookeeper.JUnit4ZKTestRunner$LoggedInvokeMethod.evaluate(JUnit4ZKTestRunner.java:79)


FAILED:  org.apache.zookeeper.server.quorum.QuorumRequestPipelineTest.testSync[0]

Error Message:
KeeperErrorCode = ConnectionLoss for /foo

Stack Trace:
org.apache.zookeeper.KeeperException$ConnectionLossException: KeeperErrorCode = ConnectionLoss for /foo
	at org.apache.zookeeper.KeeperException.create(KeeperException.java:99)
	at org.apache.zookeeper.KeeperException.create(KeeperException.java:51)
	at org.apache.zookeeper.ZooKeeper.create(ZooKeeper.java:1544)
	at org.apache.zookeeper.ZooKeeper.create(ZooKeeper.java:1515)
	at org.apache.zookeeper.server.quorum.QuorumRequestPipelineTest.create2EmptyNode(QuorumRequestPipelineTest.java:87)
	at org.apache.zookeeper.server.quorum.QuorumRequestPipelineTest.testSync(QuorumRequestPipelineTest.java:178)
	at org.apache.zookeeper.JUnit4ZKTestRunner$LoggedInvokeMethod.evaluate(JUnit4ZKTestRunner.java:79)


FAILED:  org.apache.zookeeper.server.quorum.QuorumRequestPipelineTest.testSetAndGetData[0]

Error Message:
KeeperErrorCode = ConnectionLoss for /foo

Stack Trace:
org.apache.zookeeper.KeeperException$ConnectionLossException: KeeperErrorCode = ConnectionLoss for /foo
	at org.apache.zookeeper.KeeperException.create(KeeperException.java:99)
	at org.apache.zookeeper.KeeperException.create(KeeperException.java:51)
	at org.apache.zookeeper.ZooKeeper.create(ZooKeeper.java:1544)
	at org.apache.zookeeper.ZooKeeper.create(ZooKeeper.java:1515)
	at org.apache.zookeeper.server.quorum.QuorumRequestPipelineTest.create2EmptyNode(QuorumRequestPipelineTest.java:87)
	at org.apache.zookeeper.server.quorum.QuorumRequestPipelineTest.testSetAndGetData(QuorumRequestPipelineTest.java:129)
	at org.apache.zookeeper.JUnit4ZKTestRunner$LoggedInvokeMethod.evaluate(JUnit4ZKTestRunner.java:79)


FAILED:  org.apache.zookeeper.server.quorum.QuorumRequestPipelineTest.testSetAndGetChildren2[0]

Error Message:
KeeperErrorCode = ConnectionLoss for /foo

Stack Trace:
org.apache.zookeeper.KeeperException$ConnectionLossException: KeeperErrorCode = ConnectionLoss for /foo
	at org.apache.zookeeper.KeeperException.create(KeeperException.java:99)
	at org.apache.zookeeper.KeeperException.create(KeeperException.java:51)
	at org.apache.zookeeper.ZooKeeper.create(ZooKeeper.java:1544)
	at org.apache.zookeeper.ZooKeeper.create(ZooKeeper.java:1515)
	at org.apache.zookeeper.server.quorum.QuorumRequestPipelineTest.create2EmptyNode(QuorumRequestPipelineTest.java:87)
	at org.apache.zookeeper.server.quorum.QuorumRequestPipelineTest.testSetAndGetChildren2(QuorumRequestPipelineTest.java:165)
	at org.apache.zookeeper.JUnit4ZKTestRunner$LoggedInvokeMethod.evaluate(JUnit4ZKTestRunner.java:79)


FAILED:  org.apache.zookeeper.server.quorum.QuorumRequestPipelineTest.testCreate2[0]

Error Message:
KeeperErrorCode = ConnectionLoss for /foo

Stack Trace:
org.apache.zookeeper.KeeperException$ConnectionLossException: KeeperErrorCode = ConnectionLoss for /foo
	at org.apache.zookeeper.KeeperException.create(KeeperException.java:99)
	at org.apache.zookeeper.KeeperException.create(KeeperException.java:51)
	at org.apache.zookeeper.ZooKeeper.create(ZooKeeper.java:1544)
	at org.apache.zookeeper.ZooKeeper.create(ZooKeeper.java:1515)
	at org.apache.zookeeper.server.quorum.QuorumRequestPipelineTest.testCreate2(QuorumRequestPipelineTest.java:102)
	at org.apache.zookeeper.JUnit4ZKTestRunner$LoggedInvokeMethod.evaluate(JUnit4ZKTestRunner.java:79)


FAILED:  org.apache.zookeeper.server.quorum.QuorumRequestPipelineTest.testCreate[0]

Error Message:
KeeperErrorCode = ConnectionLoss for /foo

Stack Trace:
org.apache.zookeeper.KeeperException$ConnectionLossException: KeeperErrorCode = ConnectionLoss for /foo
	at org.apache.zookeeper.KeeperException.create(KeeperException.java:99)
	at org.apache.zookeeper.KeeperException.create(KeeperException.java:51)
	at org.apache.zookeeper.ZooKeeper.create(ZooKeeper.java:1445)
	at org.apache.zookeeper.server.quorum.QuorumRequestPipelineTest.testCreate(QuorumRequestPipelineTest.java:93)
	at org.apache.zookeeper.JUnit4ZKTestRunner$LoggedInvokeMethod.evaluate(JUnit4ZKTestRunner.java:79)


FAILED:  org.apache.zookeeper.server.quorum.QuorumRequestPipelineTest.testDelete[0]

Error Message:
KeeperErrorCode = ConnectionLoss for /foo

Stack Trace:
org.apache.zookeeper.KeeperException$ConnectionLossException: KeeperErrorCode = ConnectionLoss for /foo
	at org.apache.zookeeper.KeeperException.create(KeeperException.java:99)
	at org.apache.zookeeper.KeeperException.create(KeeperException.java:51)
	at org.apache.zookeeper.ZooKeeper.create(ZooKeeper.java:1544)
	at org.apache.zookeeper.ZooKeeper.create(ZooKeeper.java:1515)
	at org.apache.zookeeper.server.quorum.QuorumRequestPipelineTest.create2EmptyNode(QuorumRequestPipelineTest.java:87)
	at org.apache.zookeeper.server.quorum.QuorumRequestPipelineTest.testDelete(QuorumRequestPipelineTest.java:111)
	at org.apache.zookeeper.JUnit4ZKTestRunner$LoggedInvokeMethod.evaluate(JUnit4ZKTestRunner.java:79)


FAILED:  org.apache.zookeeper.server.quorum.QuorumRequestPipelineTest.testExists[0]

Error Message:
KeeperErrorCode = ConnectionLoss for /foo

Stack Trace:
org.apache.zookeeper.KeeperException$ConnectionLossException: KeeperErrorCode = ConnectionLoss for /foo
	at org.apache.zookeeper.KeeperException.create(KeeperException.java:99)
	at org.apache.zookeeper.KeeperException.create(KeeperException.java:51)
	at org.apache.zookeeper.ZooKeeper.create(ZooKeeper.java:1544)
	at org.apache.zookeeper.ZooKeeper.create(ZooKeeper.java:1515)
	at org.apache.zookeeper.server.quorum.QuorumRequestPipelineTest.create2EmptyNode(QuorumRequestPipelineTest.java:87)
	at org.apache.zookeeper.server.quorum.QuorumRequestPipelineTest.testExists(QuorumRequestPipelineTest.java:120)
	at org.apache.zookeeper.JUnit4ZKTestRunner$LoggedInvokeMethod.evaluate(JUnit4ZKTestRunner.java:79)


FAILED:  org.apache.zookeeper.server.quorum.QuorumRequestPipelineTest.testSetAndGetChildren[1]

Error Message:
KeeperErrorCode = ConnectionLoss for /foo

Stack Trace:
org.apache.zookeeper.KeeperException$ConnectionLossException: KeeperErrorCode = ConnectionLoss for /foo
	at org.apache.zookeeper.KeeperException.create(KeeperException.java:99)
	at org.apache.zookeeper.KeeperException.create(KeeperException.java:51)
	at org.apache.zookeeper.ZooKeeper.create(ZooKeeper.java:1544)
	at org.apache.zookeeper.ZooKeeper.create(ZooKeeper.java:1515)
	at org.apache.zookeeper.server.quorum.QuorumRequestPipelineTest.create2EmptyNode(QuorumRequestPipelineTest.java:87)
	at org.apache.zookeeper.server.quorum.QuorumRequestPipelineTest.testSetAndGetChildren(QuorumRequestPipelineTest.java:153)
	at org.apache.zookeeper.JUnit4ZKTestRunner$LoggedInvokeMethod.evaluate(JUnit4ZKTestRunner.java:79)


FAILED:  org.apache.zookeeper.server.quorum.QuorumRequestPipelineTest.testSetAndGetACL[1]

Error Message:
KeeperErrorCode = ConnectionLoss for /foo

Stack Trace:
org.apache.zookeeper.KeeperException$ConnectionLossException: KeeperErrorCode = ConnectionLoss for /foo
	at org.apache.zookeeper.KeeperException.create(KeeperException.java:99)
	at org.apache.zookeeper.KeeperException.create(KeeperException.java:51)
	at org.apache.zookeeper.ZooKeeper.create(ZooKeeper.java:1544)
	at org.apache.zookeeper.ZooKeeper.create(ZooKeeper.java:1515)
	at org.apache.zookeeper.server.quorum.QuorumRequestPipelineTest.create2EmptyNode(QuorumRequestPipelineTest.java:87)
	at org.apache.zookeeper.server.quorum.QuorumRequestPipelineTest.testSetAndGetACL(QuorumRequestPipelineTest.java:139)
	at org.apache.zookeeper.JUnit4ZKTestRunner$LoggedInvokeMethod.evaluate(JUnit4ZKTestRunner.java:79)


FAILED:  org.apache.zookeeper.server.quorum.QuorumRequestPipelineTest.testSync[1]

Error Message:
KeeperErrorCode = ConnectionLoss for /foo

Stack Trace:
org.apache.zookeeper.KeeperException$ConnectionLossException: KeeperErrorCode = ConnectionLoss for /foo
	at org.apache.zookeeper.KeeperException.create(KeeperException.java:99)
	at org.apache.zookeeper.KeeperException.create(KeeperException.java:51)
	at org.apache.zookeeper.ZooKeeper.create(ZooKeeper.java:1544)
	at org.apache.zookeeper.ZooKeeper.create(ZooKeeper.java:1515)
	at org.apache.zookeeper.server.quorum.QuorumRequestPipelineTest.create2EmptyNode(QuorumRequestPipelineTest.java:87)
	at org.apache.zookeeper.server.quorum.QuorumRequestPipelineTest.testSync(QuorumRequestPipelineTest.java:178)
	at org.apache.zookeeper.JUnit4ZKTestRunner$LoggedInvokeMethod.evaluate(JUnit4ZKTestRunner.java:79)


FAILED:  org.apache.zookeeper.server.quorum.QuorumRequestPipelineTest.testSetAndGetData[1]

Error Message:
KeeperErrorCode = ConnectionLoss for /foo

Stack Trace:
org.apache.zookeeper.KeeperException$ConnectionLossException: KeeperErrorCode = ConnectionLoss for /foo
	at org.apache.zookeeper.KeeperException.create(KeeperException.java:99)
	at org.apache.zookeeper.KeeperException.create(KeeperException.java:51)
	at org.apache.zookeeper.ZooKeeper.create(ZooKeeper.java:1544)
	at org.apache.zookeeper.ZooKeeper.create(ZooKeeper.java:1515)
	at org.apache.zookeeper.server.quorum.QuorumRequestPipelineTest.create2EmptyNode(QuorumRequestPipelineTest.java:87)
	at org.apache.zookeeper.server.quorum.QuorumRequestPipelineTest.testSetAndGetData(QuorumRequestPipelineTest.java:129)
	at org.apache.zookeeper.JUnit4ZKTestRunner$LoggedInvokeMethod.evaluate(JUnit4ZKTestRunner.java:79)


FAILED:  org.apache.zookeeper.server.quorum.QuorumRequestPipelineTest.testSetAndGetChildren2[1]

Error Message:
KeeperErrorCode = ConnectionLoss for /foo

Stack Trace:
org.apache.zookeeper.KeeperException$ConnectionLossException: KeeperErrorCode = ConnectionLoss for /foo
	at org.apache.zookeeper.KeeperException.create(KeeperException.java:99)
	at org.apache.zookeeper.KeeperException.create(KeeperException.java:51)
	at org.apache.zookeeper.ZooKeeper.create(ZooKeeper.java:1544)
	at org.apache.zookeeper.ZooKeeper.create(ZooKeeper.java:1515)
	at org.apache.zookeeper.server.quorum.QuorumRequestPipelineTest.create2EmptyNode(QuorumRequestPipelineTest.java:87)
	at org.apache.zookeeper.server.quorum.QuorumRequestPipelineTest.testSetAndGetChildren2(QuorumRequestPipelineTest.java:165)
	at org.apache.zookeeper.JUnit4ZKTestRunner$LoggedInvokeMethod.evaluate(JUnit4ZKTestRunner.java:79)


FAILED:  org.apache.zookeeper.server.quorum.QuorumRequestPipelineTest.testCreate2[1]

Error Message:
KeeperErrorCode = ConnectionLoss for /foo

Stack Trace:
org.apache.zookeeper.KeeperException$ConnectionLossException: KeeperErrorCode = ConnectionLoss for /foo
	at org.apache.zookeeper.KeeperException.create(KeeperException.java:99)
	at org.apache.zookeeper.KeeperException.create(KeeperException.java:51)
	at org.apache.zookeeper.ZooKeeper.create(ZooKeeper.java:1544)
	at org.apache.zookeeper.ZooKeeper.create(ZooKeeper.java:1515)
	at org.apache.zookeeper.server.quorum.QuorumRequestPipelineTest.testCreate2(QuorumRequestPipelineTest.java:102)
	at org.apache.zookeeper.JUnit4ZKTestRunner$LoggedInvokeMethod.evaluate(JUnit4ZKTestRunner.java:79)


FAILED:  org.apache.zookeeper.server.quorum.QuorumRequestPipelineTest.testCreate[1]

Error Message:
KeeperErrorCode = ConnectionLoss for /foo

Stack Trace:
org.apache.zookeeper.KeeperException$ConnectionLossException: KeeperErrorCode = ConnectionLoss for /foo
	at org.apache.zookeeper.KeeperException.create(KeeperException.java:99)
	at org.apache.zookeeper.KeeperException.create(KeeperException.java:51)
	at org.apache.zookeeper.ZooKeeper.create(ZooKeeper.java:1445)
	at org.apache.zookeeper.server.quorum.QuorumRequestPipelineTest.testCreate(QuorumRequestPipelineTest.java:93)
	at org.apache.zookeeper.JUnit4ZKTestRunner$LoggedInvokeMethod.evaluate(JUnit4ZKTestRunner.java:79)


FAILED:  org.apache.zookeeper.server.quorum.QuorumRequestPipelineTest.testDelete[1]

Error Message:
KeeperErrorCode = ConnectionLoss for /foo

Stack Trace:
org.apache.zookeeper.KeeperException$ConnectionLossException: KeeperErrorCode = ConnectionLoss for /foo
	at org.apache.zookeeper.KeeperException.create(KeeperException.java:99)
	at org.apache.zookeeper.KeeperException.create(KeeperException.java:51)
	at org.apache.zookeeper.ZooKeeper.create(ZooKeeper.java:1544)
	at org.apache.zookeeper.ZooKeeper.create(ZooKeeper.java:1515)
	at org.apache.zookeeper.server.quorum.QuorumRequestPipelineTest.create2EmptyNode(QuorumRequestPipelineTest.java:87)
	at org.apache.zookeeper.server.quorum.QuorumRequestPipelineTest.testDelete(QuorumRequestPipelineTest.java:111)
	at org.apache.zookeeper.JUnit4ZKTestRunner$LoggedInvokeMethod.evaluate(JUnit4ZKTestRunner.java:79)


FAILED:  org.apache.zookeeper.server.quorum.QuorumRequestPipelineTest.testExists[1]

Error Message:
KeeperErrorCode = ConnectionLoss for /foo

Stack Trace:
org.apache.zookeeper.KeeperException$ConnectionLossException: KeeperErrorCode = ConnectionLoss for /foo
	at org.apache.zookeeper.KeeperException.create(KeeperException.java:99)
	at org.apache.zookeeper.KeeperException.create(KeeperException.java:51)
	at org.apache.zookeeper.ZooKeeper.create(ZooKeeper.java:1544)
	at org.apache.zookeeper.ZooKeeper.create(ZooKeeper.java:1515)
	at org.apache.zookeeper.server.quorum.QuorumRequestPipelineTest.create2EmptyNode(QuorumRequestPipelineTest.java:87)
	at org.apache.zookeeper.server.quorum.QuorumRequestPipelineTest.testExists(QuorumRequestPipelineTest.java:120)
	at org.apache.zookeeper.JUnit4ZKTestRunner$LoggedInvokeMethod.evaluate(JUnit4ZKTestRunner.java:79)


FAILED:  org.apache.zookeeper.server.quorum.QuorumRequestPipelineTest.testSetAndGetChildren[2]

Error Message:
KeeperErrorCode = ConnectionLoss for /foo

Stack Trace:
org.apache.zookeeper.KeeperException$ConnectionLossException: KeeperErrorCode = ConnectionLoss for /foo
	at org.apache.zookeeper.KeeperException.create(KeeperException.java:99)
	at org.apache.zookeeper.KeeperException.create(KeeperException.java:51)
	at org.apache.zookeeper.ZooKeeper.create(ZooKeeper.java:1544)
	at org.apache.zookeeper.ZooKeeper.create(ZooKeeper.java:1515)
	at org.apache.zookeeper.server.quorum.QuorumRequestPipelineTest.create2EmptyNode(QuorumRequestPipelineTest.java:87)
	at org.apache.zookeeper.server.quorum.QuorumRequestPipelineTest.testSetAndGetChildren(QuorumRequestPipelineTest.java:153)
	at org.apache.zookeeper.JUnit4ZKTestRunner$LoggedInvokeMethod.evaluate(JUnit4ZKTestRunner.java:79)


FAILED:  org.apache.zookeeper.server.quorum.QuorumRequestPipelineTest.testSetAndGetACL[2]

Error Message:
KeeperErrorCode = ConnectionLoss for /foo

Stack Trace:
org.apache.zookeeper.KeeperException$ConnectionLossException: KeeperErrorCode = ConnectionLoss for /foo
	at org.apache.zookeeper.KeeperException.create(KeeperException.java:99)
	at org.apache.zookeeper.KeeperException.create(KeeperException.java:51)
	at org.apache.zookeeper.ZooKeeper.create(ZooKeeper.java:1544)
	at org.apache.zookeeper.ZooKeeper.create(ZooKeeper.java:1515)
	at org.apache.zookeeper.server.quorum.QuorumRequestPipelineTest.create2EmptyNode(QuorumRequestPipelineTest.java:87)
	at org.apache.zookeeper.server.quorum.QuorumRequestPipelineTest.testSetAndGetACL(QuorumRequestPipelineTest.java:139)
	at org.apache.zookeeper.JUnit4ZKTestRunner$LoggedInvokeMethod.evaluate(JUnit4ZKTestRunner.java:79)


FAILED:  org.apache.zookeeper.server.quorum.QuorumRequestPipelineTest.testSync[2]

Error Message:
KeeperErrorCode = ConnectionLoss for /foo

Stack Trace:
org.apache.zookeeper.KeeperException$ConnectionLossException: KeeperErrorCode = ConnectionLoss for /foo
	at org.apache.zookeeper.KeeperException.create(KeeperException.java:99)
	at org.apache.zookeeper.KeeperException.create(KeeperException.java:51)
	at org.apache.zookeeper.ZooKeeper.create(ZooKeeper.java:1544)
	at org.apache.zookeeper.ZooKeeper.create(ZooKeeper.java:1515)
	at org.apache.zookeeper.server.quorum.QuorumRequestPipelineTest.create2EmptyNode(QuorumRequestPipelineTest.java:87)
	at org.apache.zookeeper.server.quorum.QuorumRequestPipelineTest.testSync(QuorumRequestPipelineTest.java:178)
	at org.apache.zookeeper.JUnit4ZKTestRunner$LoggedInvokeMethod.evaluate(JUnit4ZKTestRunner.java:79)


FAILED:  org.apache.zookeeper.server.quorum.QuorumRequestPipelineTest.testSetAndGetData[2]

Error Message:
KeeperErrorCode = ConnectionLoss for /foo

Stack Trace:
org.apache.zookeeper.KeeperException$ConnectionLossException: KeeperErrorCode = ConnectionLoss for /foo
	at org.apache.zookeeper.KeeperException.create(KeeperException.java:99)
	at org.apache.zookeeper.KeeperException.create(KeeperException.java:51)
	at org.apache.zookeeper.ZooKeeper.create(ZooKeeper.java:1544)
	at org.apache.zookeeper.ZooKeeper.create(ZooKeeper.java:1515)
	at org.apache.zookeeper.server.quorum.QuorumRequestPipelineTest.create2EmptyNode(QuorumRequestPipelineTest.java:87)
	at org.apache.zookeeper.server.quorum.QuorumRequestPipelineTest.testSetAndGetData(QuorumRequestPipelineTest.java:129)
	at org.apache.zookeeper.JUnit4ZKTestRunner$LoggedInvokeMethod.evaluate(JUnit4ZKTestRunner.java:79)


FAILED:  org.apache.zookeeper.server.quorum.QuorumRequestPipelineTest.testSetAndGetChildren2[2]

Error Message:
KeeperErrorCode = ConnectionLoss for /foo

Stack Trace:
org.apache.zookeeper.KeeperException$ConnectionLossException: KeeperErrorCode = ConnectionLoss for /foo
	at org.apache.zookeeper.KeeperException.create(KeeperException.java:99)
	at org.apache.zookeeper.KeeperException.create(KeeperException.java:51)
	at org.apache.zookeeper.ZooKeeper.create(ZooKeeper.java:1544)
	at org.apache.zookeeper.ZooKeeper.create(ZooKeeper.java:1515)
	at org.apache.zookeeper.server.quorum.QuorumRequestPipelineTest.create2EmptyNode(QuorumRequestPipelineTest.java:87)
	at org.apache.zookeeper.server.quorum.QuorumRequestPipelineTest.testSetAndGetChildren2(QuorumRequestPipelineTest.java:165)
	at org.apache.zookeeper.JUnit4ZKTestRunner$LoggedInvokeMethod.evaluate(JUnit4ZKTestRunner.java:79)


FAILED:  org.apache.zookeeper.server.quorum.QuorumRequestPipelineTest.testCreate2[2]

Error Message:
KeeperErrorCode = ConnectionLoss for /foo

Stack Trace:
org.apache.zookeeper.KeeperException$ConnectionLossException: KeeperErrorCode = ConnectionLoss for /foo
	at org.apache.zookeeper.KeeperException.create(KeeperException.java:99)
	at org.apache.zookeeper.KeeperException.create(KeeperException.java:51)
	at org.apache.zookeeper.ZooKeeper.create(ZooKeeper.java:1544)
	at org.apache.zookeeper.ZooKeeper.create(ZooKeeper.java:1515)
	at org.apache.zookeeper.server.quorum.QuorumRequestPipelineTest.testCreate2(QuorumRequestPipelineTest.java:102)
	at org.apache.zookeeper.JUnit4ZKTestRunner$LoggedInvokeMethod.evaluate(JUnit4ZKTestRunner.java:79)


FAILED:  org.apache.zookeeper.server.quorum.QuorumRequestPipelineTest.testCreate[2]

Error Message:
KeeperErrorCode = ConnectionLoss for /foo

Stack Trace:
org.apache.zookeeper.KeeperException$ConnectionLossException: KeeperErrorCode = ConnectionLoss for /foo
	at org.apache.zookeeper.KeeperException.create(KeeperException.java:99)
	at org.apache.zookeeper.KeeperException.create(KeeperException.java:51)
	at org.apache.zookeeper.ZooKeeper.create(ZooKeeper.java:1445)
	at org.apache.zookeeper.server.quorum.QuorumRequestPipelineTest.testCreate(QuorumRequestPipelineTest.java:93)
	at org.apache.zookeeper.JUnit4ZKTestRunner$LoggedInvokeMethod.evaluate(JUnit4ZKTestRunner.java:79)


FAILED:  org.apache.zookeeper.server.quorum.QuorumRequestPipelineTest.testDelete[2]

Error Message:
KeeperErrorCode = ConnectionLoss for /foo

Stack Trace:
org.apache.zookeeper.KeeperException$ConnectionLossException: KeeperErrorCode = ConnectionLoss for /foo
	at org.apache.zookeeper.KeeperException.create(KeeperException.java:99)
	at org.apache.zookeeper.KeeperException.create(KeeperException.java:51)
	at org.apache.zookeeper.ZooKeeper.create(ZooKeeper.java:1544)
	at org.apache.zookeeper.ZooKeeper.create(ZooKeeper.java:1515)
	at org.apache.zookeeper.server.quorum.QuorumRequestPipelineTest.create2EmptyNode(QuorumRequestPipelineTest.java:87)
	at org.apache.zookeeper.server.quorum.QuorumRequestPipelineTest.testDelete(QuorumRequestPipelineTest.java:111)
	at org.apache.zookeeper.JUnit4ZKTestRunner$LoggedInvokeMethod.evaluate(JUnit4ZKTestRunner.java:79)


FAILED:  org.apache.zookeeper.server.quorum.QuorumRequestPipelineTest.testExists[2]

Error Message:
KeeperErrorCode = ConnectionLoss for /foo

Stack Trace:
org.apache.zookeeper.KeeperException$ConnectionLossException: KeeperErrorCode = ConnectionLoss for /foo
	at org.apache.zookeeper.KeeperException.create(KeeperException.java:99)
	at org.apache.zookeeper.KeeperException.create(KeeperException.java:51)
	at org.apache.zookeeper.ZooKeeper.create(ZooKeeper.java:1544)
	at org.apache.zookeeper.ZooKeeper.create(ZooKeeper.java:1515)
	at org.apache.zookeeper.server.quorum.QuorumRequestPipelineTest.create2EmptyNode(QuorumRequestPipelineTest.java:87)
	at org.apache.zookeeper.server.quorum.QuorumRequestPipelineTest.testExists(QuorumRequestPipelineTest.java:120)
	at org.apache.zookeeper.JUnit4ZKTestRunner$LoggedInvokeMethod.evaluate(JUnit4ZKTestRunner.java:79)


FAILED:  org.apache.zookeeper.server.quorum.ReconfigBackupTest.testReconfigCreateNewVersionFile

Error Message:
client could not connect to reestablished quorum: giving up after 30+ seconds.

Stack Trace:
junit.framework.AssertionFailedError: client could not connect to reestablished quorum: giving up after 30+ seconds.
	at org.apache.zookeeper.test.ReconfigTest.testServerHasConfig(ReconfigTest.java:133)
	at org.apache.zookeeper.server.quorum.ReconfigBackupTest.testReconfigCreateNewVersionFile(ReconfigBackupTest.java:183)
	at org.apache.zookeeper.JUnit4ZKTestRunner$LoggedInvokeMethod.evaluate(JUnit4ZKTestRunner.java:79)


FAILED:  org.apache.zookeeper.server.quorum.ReconfigBackupTest.testVersionOfDynamicFilename

Error Message:
client could not connect to reestablished quorum: giving up after 30+ seconds.

Stack Trace:
junit.framework.AssertionFailedError: client could not connect to reestablished quorum: giving up after 30+ seconds.
	at org.apache.zookeeper.test.ReconfigTest.testServerHasConfig(ReconfigTest.java:133)
	at org.apache.zookeeper.server.quorum.ReconfigBackupTest.testVersionOfDynamicFilename(ReconfigBackupTest.java:327)
	at org.apache.zookeeper.JUnit4ZKTestRunner$LoggedInvokeMethod.evaluate(JUnit4ZKTestRunner.java:79)


FAILED:  org.apache.zookeeper.server.quorum.ReconfigDuringLeaderSyncTest.testDuringLeaderSync

Error Message:
Failed to connect to ZooKeeper server.

Stack Trace:
java.util.concurrent.TimeoutException: Failed to connect to ZooKeeper server.
	at org.apache.zookeeper.test.ClientBase$CountdownWatcher.waitForConnected(ClientBase.java:149)
	at org.apache.zookeeper.server.quorum.ReconfigDuringLeaderSyncTest.testDuringLeaderSync(ReconfigDuringLeaderSyncTest.java:162)
	at org.apache.zookeeper.JUnit4ZKTestRunner$LoggedInvokeMethod.evaluate(JUnit4ZKTestRunner.java:79)


FAILED:  org.apache.zookeeper.server.quorum.ReconfigFailureCasesTest.testTooFewRemainingPariticipants

Error Message:
Should have been BadArgumentsException!

Stack Trace:
junit.framework.AssertionFailedError: Should have been BadArgumentsException!
	at org.apache.zookeeper.server.quorum.ReconfigFailureCasesTest.testTooFewRemainingPariticipants(ReconfigFailureCasesTest.java:129)
	at org.apache.zookeeper.JUnit4ZKTestRunner$LoggedInvokeMethod.evaluate(JUnit4ZKTestRunner.java:79)


FAILED:  org.apache.zookeeper.server.quorum.ReconfigFailureCasesTest.testReconfigVersionConditionFails

Error Message:
Should have been BadVersionException!

Stack Trace:
junit.framework.AssertionFailedError: Should have been BadVersionException!
	at org.apache.zookeeper.server.quorum.ReconfigFailureCasesTest.testReconfigVersionConditionFails(ReconfigFailureCasesTest.java:155)
	at org.apache.zookeeper.JUnit4ZKTestRunner$LoggedInvokeMethod.evaluate(JUnit4ZKTestRunner.java:79)


FAILED:  org.apache.zookeeper.server.quorum.ReconfigFailureCasesTest.testIncrementalReconfigInvokedOnHiearchicalQS

Error Message:
client could not connect to reestablished quorum: giving up after 30+ seconds.

Stack Trace:
junit.framework.AssertionFailedError: client could not connect to reestablished quorum: giving up after 30+ seconds.
	at org.apache.zookeeper.test.ReconfigTest.reconfig(ReconfigTest.java:93)
	at org.apache.zookeeper.server.quorum.ReconfigFailureCasesTest.testIncrementalReconfigInvokedOnHiearchicalQS(ReconfigFailureCasesTest.java:87)
	at org.apache.zookeeper.JUnit4ZKTestRunner$LoggedInvokeMethod.evaluate(JUnit4ZKTestRunner.java:79)


FAILED:  org.apache.zookeeper.server.quorum.ReconfigFailureCasesTest.testObserverToParticipantConversionFails

Error Message:
Reconfig should have failed with NewConfigNoQuorum

Stack Trace:
junit.framework.AssertionFailedError: Reconfig should have failed with NewConfigNoQuorum
	at org.apache.zookeeper.server.quorum.ReconfigFailureCasesTest.testObserverToParticipantConversionFails(ReconfigFailureCasesTest.java:264)
	at org.apache.zookeeper.JUnit4ZKTestRunner$LoggedInvokeMethod.evaluate(JUnit4ZKTestRunner.java:79)


FAILED:  org.apache.zookeeper.server.quorum.ReconfigLegacyTest.testReconfigRemoveClientFromStatic

Error Message:
client could not connect to reestablished quorum: giving up after 30+ seconds.

Stack Trace:
junit.framework.AssertionFailedError: client could not connect to reestablished quorum: giving up after 30+ seconds.
	at org.apache.zookeeper.test.ReconfigTest.testServerHasConfig(ReconfigTest.java:133)
	at org.apache.zookeeper.server.quorum.ReconfigLegacyTest.testReconfigRemoveClientFromStatic(ReconfigLegacyTest.java:202)
	at org.apache.zookeeper.JUnit4ZKTestRunner$LoggedInvokeMethod.evaluate(JUnit4ZKTestRunner.java:79)


FAILED:  org.apache.zookeeper.server.quorum.ReconfigLegacyTest.testRestartZooKeeperServer

Error Message:
KeeperErrorCode = ConnectionLoss for /serverRestartTest

Stack Trace:
org.apache.zookeeper.KeeperException$ConnectionLossException: KeeperErrorCode = ConnectionLoss for /serverRestartTest
	at org.apache.zookeeper.KeeperException.create(KeeperException.java:99)
	at org.apache.zookeeper.KeeperException.create(KeeperException.java:51)
	at org.apache.zookeeper.ZooKeeper.create(ZooKeeper.java:1445)
	at org.apache.zookeeper.server.quorum.ReconfigLegacyTest.testRestartZooKeeperServer(ReconfigLegacyTest.java:286)
	at org.apache.zookeeper.JUnit4ZKTestRunner$LoggedInvokeMethod.evaluate(JUnit4ZKTestRunner.java:79)
	at java.util.concurrent.FutureTask.run(FutureTask.java:262)
	at java.lang.Thread.run(Thread.java:745)


FAILED:  org.apache.zookeeper.server.quorum.ReconfigLegacyTest.testConfigFileBackwardCompatibility

Error Message:
client could not connect to reestablished quorum: giving up after 30+ seconds.

Stack Trace:
junit.framework.AssertionFailedError: client could not connect to reestablished quorum: giving up after 30+ seconds.
	at org.apache.zookeeper.test.ReconfigTest.testServerHasConfig(ReconfigTest.java:133)
	at org.apache.zookeeper.server.quorum.ReconfigLegacyTest.testConfigFileBackwardCompatibility(ReconfigLegacyTest.java:97)
	at org.apache.zookeeper.JUnit4ZKTestRunner$LoggedInvokeMethod.evaluate(JUnit4ZKTestRunner.java:79)


FAILED:  org.apache.zookeeper.server.quorum.ReconfigRecoveryTest.testNextConfigAlreadyActive

Error Message:
client could not connect to reestablished quorum: giving up after 30+ seconds.

Stack Trace:
junit.framework.AssertionFailedError: client could not connect to reestablished quorum: giving up after 30+ seconds.
	at org.apache.zookeeper.test.ReconfigTest.testNormalOperation(ReconfigTest.java:183)
	at org.apache.zookeeper.server.quorum.ReconfigRecoveryTest.testNextConfigAlreadyActive(ReconfigRecoveryTest.java:338)
	at org.apache.zookeeper.JUnit4ZKTestRunner$LoggedInvokeMethod.evaluate(JUnit4ZKTestRunner.java:79)


FAILED:  org.apache.zookeeper.server.quorum.ReconfigRecoveryTest.testObserverConvertedToParticipantDuringFLE

Error Message:
client could not connect to reestablished quorum: giving up after 30+ seconds.

Stack Trace:
junit.framework.AssertionFailedError: client could not connect to reestablished quorum: giving up after 30+ seconds.
	at org.apache.zookeeper.test.ReconfigTest.testServerHasConfig(ReconfigTest.java:133)
	at org.apache.zookeeper.server.quorum.ReconfigRecoveryTest.testObserverConvertedToParticipantDuringFLE(ReconfigRecoveryTest.java:433)
	at org.apache.zookeeper.JUnit4ZKTestRunner$LoggedInvokeMethod.evaluate(JUnit4ZKTestRunner.java:79)


FAILED:  org.apache.zookeeper.server.quorum.ReconfigRecoveryTest.testCurrentObserverIsParticipantInNewConfig

Error Message:
client could not connect to reestablished quorum: giving up after 30+ seconds.

Stack Trace:
junit.framework.AssertionFailedError: client could not connect to reestablished quorum: giving up after 30+ seconds.
	at org.apache.zookeeper.test.ReconfigTest.testNormalOperation(ReconfigTest.java:183)
	at org.apache.zookeeper.server.quorum.ReconfigRecoveryTest.testCurrentObserverIsParticipantInNewConfig(ReconfigRecoveryTest.java:487)
	at org.apache.zookeeper.JUnit4ZKTestRunner$LoggedInvokeMethod.evaluate(JUnit4ZKTestRunner.java:79)


FAILED:  org.apache.zookeeper.server.quorum.ReconfigRecoveryTest.testCurrentServersAreObserversInNextConfig

Error Message:
client could not connect to reestablished quorum: giving up after 30+ seconds.

Stack Trace:
junit.framework.AssertionFailedError: client could not connect to reestablished quorum: giving up after 30+ seconds.
	at org.apache.zookeeper.test.ReconfigTest.testNormalOperation(ReconfigTest.java:183)
	at org.apache.zookeeper.server.quorum.ReconfigRecoveryTest.testCurrentServersAreObserversInNextConfig(ReconfigRecoveryTest.java:185)
	at org.apache.zookeeper.JUnit4ZKTestRunner$LoggedInvokeMethod.evaluate(JUnit4ZKTestRunner.java:79)


FAILED:  org.apache.zookeeper.server.quorum.ReconfigRecoveryTest.testNextConfigCompletion

Error Message:
client could not connect to reestablished quorum: giving up after 30+ seconds.

Stack Trace:
junit.framework.AssertionFailedError: client could not connect to reestablished quorum: giving up after 30+ seconds.
	at org.apache.zookeeper.test.ReconfigTest.testServerHasConfig(ReconfigTest.java:133)
	at org.apache.zookeeper.server.quorum.ReconfigRecoveryTest.testNextConfigCompletion(ReconfigRecoveryTest.java:106)
	at org.apache.zookeeper.JUnit4ZKTestRunner$LoggedInvokeMethod.evaluate(JUnit4ZKTestRunner.java:79)


FAILED:  org.apache.zookeeper.server.quorum.StandaloneDisabledTest.startSingleServerTest

Error Message:
client could not connect to reestablished quorum: giving up after 30+ seconds.

Stack Trace:
junit.framework.AssertionFailedError: client could not connect to reestablished quorum: giving up after 30+ seconds.
	at org.apache.zookeeper.test.ReconfigTest.testServerHasConfig(ReconfigTest.java:133)
	at org.apache.zookeeper.server.quorum.StandaloneDisabledTest.startSingleServerTest(StandaloneDisabledTest.java:61)
	at org.apache.zookeeper.JUnit4ZKTestRunner$LoggedInvokeMethod.evaluate(JUnit4ZKTestRunner.java:79)


FAILED:  org.apache.zookeeper.test.ACLCountTest.testAclCount

Error Message:
null

Stack Trace:
junit.framework.AssertionFailedError
	at org.apache.zookeeper.test.ACLCountTest.testAclCount(ACLCountTest.java:105)
	at org.apache.zookeeper.JUnit4ZKTestRunner$LoggedInvokeMethod.evaluate(JUnit4ZKTestRunner.java:79)


FAILED:  org.apache.zookeeper.test.ACLRootTest.testRootAcl

Error Message:
KeeperErrorCode = ConnectionLoss for /

Stack Trace:
org.apache.zookeeper.KeeperException$ConnectionLossException: KeeperErrorCode = ConnectionLoss for /
	at org.apache.zookeeper.KeeperException.create(KeeperException.java:99)
	at org.apache.zookeeper.KeeperException.create(KeeperException.java:51)
	at org.apache.zookeeper.ZooKeeper.setACL(ZooKeeper.java:2388)
	at org.apache.zookeeper.test.ACLRootTest.testRootAcl(ACLRootTest.java:35)
	at org.apache.zookeeper.JUnit4ZKTestRunner$LoggedInvokeMethod.evaluate(JUnit4ZKTestRunner.java:79)


FAILED:  org.apache.zookeeper.test.ACLTest.testAcls

Error Message:
KeeperErrorCode = ConnectionLoss for /0

Stack Trace:
org.apache.zookeeper.KeeperException$ConnectionLossException: KeeperErrorCode = ConnectionLoss for /0
	at org.apache.zookeeper.KeeperException.create(KeeperException.java:99)
	at org.apache.zookeeper.KeeperException.create(KeeperException.java:51)
	at org.apache.zookeeper.ZooKeeper.create(ZooKeeper.java:1445)
	at org.apache.zookeeper.test.ACLTest.testAcls(ACLTest.java:115)
	at org.apache.zookeeper.JUnit4ZKTestRunner$LoggedInvokeMethod.evaluate(JUnit4ZKTestRunner.java:79)


FAILED:  org.apache.zookeeper.test.ACLTest.testDisconnectedAddAuth

Error Message:
KeeperErrorCode = ConnectionLoss for /

Stack Trace:
org.apache.zookeeper.KeeperException$ConnectionLossException: KeeperErrorCode = ConnectionLoss for /
	at org.apache.zookeeper.KeeperException.create(KeeperException.java:99)
	at org.apache.zookeeper.KeeperException.create(KeeperException.java:51)
	at org.apache.zookeeper.ZooKeeper.setACL(ZooKeeper.java:2388)
	at org.apache.zookeeper.test.ACLTest.testDisconnectedAddAuth(ACLTest.java:78)
	at org.apache.zookeeper.JUnit4ZKTestRunner$LoggedInvokeMethod.evaluate(JUnit4ZKTestRunner.java:79)


FAILED:  org.apache.zookeeper.test.AsyncHammerTest.testHammer

Error Message:
null

Stack Trace:
junit.framework.AssertionFailedError
	at org.apache.zookeeper.test.AsyncHammerTest.testHammer(AsyncHammerTest.java:185)
	at org.apache.zookeeper.JUnit4ZKTestRunner$LoggedInvokeMethod.evaluate(JUnit4ZKTestRunner.java:79)


FAILED:  org.apache.zookeeper.test.AsyncOpsTest.testAsyncMulti

Error Message:
expected same:<0> was not:<1>

Stack Trace:
junit.framework.AssertionFailedError: expected same:<0> was not:<1>
	at org.apache.zookeeper.test.AsyncOps$MultiCB.latch_await(AsyncOps.java:764)
	at org.apache.zookeeper.test.AsyncOps$MultiCB.verifyMulti(AsyncOps.java:773)
	at org.apache.zookeeper.test.AsyncOpsTest.testAsyncMulti(AsyncOpsTest.java:254)
	at org.apache.zookeeper.JUnit4ZKTestRunner$LoggedInvokeMethod.evaluate(JUnit4ZKTestRunner.java:79)


FAILED:  org.apache.zookeeper.test.AsyncOpsTest.testAsyncMultiSequential_NoSideEffect

Error Message:
expected:<[OK:/foo:/foo]> but was:<[CONNECTIONLOSS:/foo:null]>

Stack Trace:
junit.framework.AssertionFailedError: expected:<[OK:/foo:/foo]> but was:<[CONNECTIONLOSS:/foo:null]>
	at org.apache.zookeeper.test.AsyncOps$AsyncCB.verify(AsyncOps.java:120)
	at org.apache.zookeeper.test.AsyncOps$StringCB.verifyCreate(AsyncOps.java:165)
	at org.apache.zookeeper.test.AsyncOps$MultiCB.verifyMultiSequential_NoSideEffect(AsyncOps.java:808)
	at org.apache.zookeeper.test.AsyncOpsTest.testAsyncMultiSequential_NoSideEffect(AsyncOpsTest.java:269)
	at org.apache.zookeeper.JUnit4ZKTestRunner$LoggedInvokeMethod.evaluate(JUnit4ZKTestRunner.java:79)


FAILED:  org.apache.zookeeper.test.AsyncOpsTest.testAsyncGetChildrenEmpty

Error Message:
expected:<[OK:/foo:/foo]> but was:<[CONNECTIONLOSS:/foo:null]>

Stack Trace:
junit.framework.AssertionFailedError: expected:<[OK:/foo:/foo]> but was:<[CONNECTIONLOSS:/foo:null]>
	at org.apache.zookeeper.test.AsyncOps$AsyncCB.verify(AsyncOps.java:120)
	at org.apache.zookeeper.test.AsyncOps$StringCB.verifyCreate(AsyncOps.java:165)
	at org.apache.zookeeper.test.AsyncOps$ChildrenCB.createNode(AsyncOps.java:295)
	at org.apache.zookeeper.test.AsyncOps$ChildrenCB.verifyGetChildrenEmpty(AsyncOps.java:315)
	at org.apache.zookeeper.test.AsyncOpsTest.testAsyncGetChildrenEmpty(AsyncOpsTest.java:204)
	at org.apache.zookeeper.JUnit4ZKTestRunner$LoggedInvokeMethod.evaluate(JUnit4ZKTestRunner.java:79)


FAILED:  org.apache.zookeeper.test.AsyncOpsTest.testAsyncSetACLFailure_BadVersion

Error Message:
expected:<[OK:/foo:/foo]> but was:<[CONNECTIONLOSS:/foo:null]>

Stack Trace:
junit.framework.AssertionFailedError: expected:<[OK:/foo:/foo]> but was:<[CONNECTIONLOSS:/foo:null]>
	at org.apache.zookeeper.test.AsyncOps$AsyncCB.verify(AsyncOps.java:120)
	at org.apache.zookeeper.test.AsyncOps$StringCB.verifyCreate(AsyncOps.java:165)
	at org.apache.zookeeper.test.AsyncOps$StatCB.verifySetACLFailure_BadVersion(AsyncOps.java:614)
	at org.apache.zookeeper.test.AsyncOpsTest.testAsyncSetACLFailure_BadVersion(AsyncOpsTest.java:164)
	at org.apache.zookeeper.JUnit4ZKTestRunner$LoggedInvokeMethod.evaluate(JUnit4ZKTestRunner.java:79)


FAILED:  org.apache.zookeeper.test.AsyncOpsTest.testAsyncCreate

Error Message:
expected:<[OK:/foo:/foo]> but was:<[CONNECTIONLOSS:/foo:null]>

Stack Trace:
junit.framework.AssertionFailedError: expected:<[OK:/foo:/foo]> but was:<[CONNECTIONLOSS:/foo:null]>
	at org.apache.zookeeper.test.AsyncOps$AsyncCB.verify(AsyncOps.java:120)
	at org.apache.zookeeper.test.AsyncOps$StringCB.verifyCreate(AsyncOps.java:165)
	at org.apache.zookeeper.test.AsyncOpsTest.testAsyncCreate(AsyncOpsTest.java:68)
	at org.apache.zookeeper.JUnit4ZKTestRunner$LoggedInvokeMethod.evaluate(JUnit4ZKTestRunner.java:79)


FAILED:  org.apache.zookeeper.test.AsyncOpsTest.testAsyncDelete

Error Message:
expected:<[OK:/foo:/foo]> but was:<[CONNECTIONLOSS:/foo:null]>

Stack Trace:
junit.framework.AssertionFailedError: expected:<[OK:/foo:/foo]> but was:<[CONNECTIONLOSS:/foo:null]>
	at org.apache.zookeeper.test.AsyncOps$AsyncCB.verify(AsyncOps.java:120)
	at org.apache.zookeeper.test.AsyncOps$StringCB.verifyCreate(AsyncOps.java:165)
	at org.apache.zookeeper.test.AsyncOps$VoidCB.verifyDelete(AsyncOps.java:696)
	at org.apache.zookeeper.test.AsyncOpsTest.testAsyncDelete(AsyncOpsTest.java:129)
	at org.apache.zookeeper.JUnit4ZKTestRunner$LoggedInvokeMethod.evaluate(JUnit4ZKTestRunner.java:79)


FAILED:  org.apache.zookeeper.test.AsyncOpsTest.testAsyncExists

Error Message:
expected:<[OK:/foo:/foo]> but was:<[CONNECTIONLOSS:/foo:null]>

Stack Trace:
junit.framework.AssertionFailedError: expected:<[OK:/foo:/foo]> but was:<[CONNECTIONLOSS:/foo:null]>
	at org.apache.zookeeper.test.AsyncOps$AsyncCB.verify(AsyncOps.java:120)
	at org.apache.zookeeper.test.AsyncOps$StringCB.verifyCreate(AsyncOps.java:165)
	at org.apache.zookeeper.test.AsyncOps$StatCB.verifyExists(AsyncOps.java:653)
	at org.apache.zookeeper.test.AsyncOpsTest.testAsyncExists(AsyncOpsTest.java:184)
	at org.apache.zookeeper.JUnit4ZKTestRunner$LoggedInvokeMethod.evaluate(JUnit4ZKTestRunner.java:79)


FAILED:  org.apache.zookeeper.test.AsyncOpsTest.testAsyncGetACL

Error Message:
expected:<[OK:/foo:/foo]> but was:<[CONNECTIONLOSS:/foo:null]>

Stack Trace:
junit.framework.AssertionFailedError: expected:<[OK:/foo:/foo]> but was:<[CONNECTIONLOSS:/foo:null]>
	at org.apache.zookeeper.test.AsyncOps$AsyncCB.verify(AsyncOps.java:120)
	at org.apache.zookeeper.test.AsyncOps$StringCB.verifyCreate(AsyncOps.java:165)
	at org.apache.zookeeper.test.AsyncOps$ACLCB.verifyGetACL(AsyncOps.java:236)
	at org.apache.zookeeper.test.AsyncOpsTest.testAsyncGetACL(AsyncOpsTest.java:194)
	at org.apache.zookeeper.JUnit4ZKTestRunner$LoggedInvokeMethod.evaluate(JUnit4ZKTestRunner.java:79)


FAILED:  org.apache.zookeeper.test.AsyncOpsTest.testAsyncCreate2Failure_NoNode

Error Message:
expected:<[NONODE]:/foo/bar:null:null> but was:<[CONNECTIONLOSS]:/foo/bar:null:null>

Stack Trace:
junit.framework.AssertionFailedError: expected:<[NONODE]:/foo/bar:null:null> but was:<[CONNECTIONLOSS]:/foo/bar:null:null>
	at org.apache.zookeeper.test.AsyncOps$AsyncCB.verify(AsyncOps.java:120)
	at org.apache.zookeeper.test.AsyncOps$Create2CB.verifyCreateFailure_NoNode(AsyncOps.java:502)
	at org.apache.zookeeper.test.AsyncOpsTest.testAsyncCreate2Failure_NoNode(AsyncOpsTest.java:118)
	at org.apache.zookeeper.JUnit4ZKTestRunner$LoggedInvokeMethod.evaluate(JUnit4ZKTestRunner.java:79)


FAILED:  org.apache.zookeeper.test.AsyncOpsTest.testAsyncCreateFailure_NoNode

Error Message:
expected:<[NONODE]:/foo/bar:null> but was:<[CONNECTIONLOSS]:/foo/bar:null>

Stack Trace:
junit.framework.AssertionFailedError: expected:<[NONODE]:/foo/bar:null> but was:<[CONNECTIONLOSS]:/foo/bar:null>
	at org.apache.zookeeper.test.AsyncOps$AsyncCB.verify(AsyncOps.java:120)
	at org.apache.zookeeper.test.AsyncOps$StringCB.verifyCreateFailure_NoNode(AsyncOps.java:189)
	at org.apache.zookeeper.test.AsyncOpsTest.testAsyncCreateFailure_NoNode(AsyncOpsTest.java:103)
	at org.apache.zookeeper.JUnit4ZKTestRunner$LoggedInvokeMethod.evaluate(JUnit4ZKTestRunner.java:79)


FAILED:  org.apache.zookeeper.test.AsyncOpsTest.testAsyncSetACL

Error Message:
expected:<[OK:/foo:/foo]> but was:<[CONNECTIONLOSS:/foo:null]>

Stack Trace:
junit.framework.AssertionFailedError: expected:<[OK:/foo:/foo]> but was:<[CONNECTIONLOSS:/foo:null]>
	at org.apache.zookeeper.test.AsyncOps$AsyncCB.verify(AsyncOps.java:120)
	at org.apache.zookeeper.test.AsyncOps$StringCB.verifyCreate(AsyncOps.java:165)
	at org.apache.zookeeper.test.AsyncOps$StatCB.verifySetACL(AsyncOps.java:600)
	at org.apache.zookeeper.test.AsyncOpsTest.testAsyncSetACL(AsyncOpsTest.java:154)
	at org.apache.zookeeper.JUnit4ZKTestRunner$LoggedInvokeMethod.evaluate(JUnit4ZKTestRunner.java:79)


FAILED:  org.apache.zookeeper.test.AsyncOpsTest.testAsyncMultiFailure_NoSideEffect

Error Message:
expected same:<0> was not:<1>

Stack Trace:
junit.framework.AssertionFailedError: expected same:<0> was not:<1>
	at org.apache.zookeeper.test.AsyncOps$MultiCB.latch_await(AsyncOps.java:764)
	at org.apache.zookeeper.test.AsyncOps$MultiCB.verifyMultiFailure_NoSideEffect(AsyncOps.java:800)
	at org.apache.zookeeper.test.AsyncOpsTest.testAsyncMultiFailure_NoSideEffect(AsyncOpsTest.java:264)
	at org.apache.zookeeper.JUnit4ZKTestRunner$LoggedInvokeMethod.evaluate(JUnit4ZKTestRunner.java:79)


FAILED:  org.apache.zookeeper.test.AsyncOpsTest.testAsyncGetData

Error Message:
expected:<[OK:/foo:/foo]> but was:<[CONNECTIONLOSS:/foo:null]>

Stack Trace:
junit.framework.AssertionFailedError: expected:<[OK:/foo:/foo]> but was:<[CONNECTIONLOSS:/foo:null]>
	at org.apache.zookeeper.test.AsyncOps$AsyncCB.verify(AsyncOps.java:120)
	at org.apache.zookeeper.test.AsyncOps$StringCB.verifyCreate(AsyncOps.java:165)
	at org.apache.zookeeper.test.AsyncOps$DataCB.verifyGetData(AsyncOps.java:551)
	at org.apache.zookeeper.test.AsyncOpsTest.testAsyncGetData(AsyncOpsTest.java:244)
	at org.apache.zookeeper.JUnit4ZKTestRunner$LoggedInvokeMethod.evaluate(JUnit4ZKTestRunner.java:79)


FAILED:  org.apache.zookeeper.test.AsyncOpsTest.testAsyncGetChildren2Two

Error Message:
expected:<[OK:/foo:/foo]> but was:<[CONNECTIONLOSS:/foo:null]>

Stack Trace:
junit.framework.AssertionFailedError: expected:<[OK:/foo:/foo]> but was:<[CONNECTIONLOSS:/foo:null]>
	at org.apache.zookeeper.test.AsyncOps$AsyncCB.verify(AsyncOps.java:120)
	at org.apache.zookeeper.test.AsyncOps$StringCB.verifyCreate(AsyncOps.java:165)
	at org.apache.zookeeper.test.AsyncOps$Children2CB.createNode(AsyncOps.java:381)
	at org.apache.zookeeper.test.AsyncOps$Children2CB.verifyGetChildrenTwo(AsyncOps.java:417)
	at org.apache.zookeeper.test.AsyncOpsTest.testAsyncGetChildren2Two(AsyncOpsTest.java:234)
	at org.apache.zookeeper.JUnit4ZKTestRunner$LoggedInvokeMethod.evaluate(JUnit4ZKTestRunner.java:79)


FAILED:  org.apache.zookeeper.test.AsyncOpsTest.testAsyncCreateFailure_NoChildForEphemeral

Error Message:
expected:<[OK:/foo:/foo]> but was:<[CONNECTIONLOSS:/foo:null]>

Stack Trace:
junit.framework.AssertionFailedError: expected:<[OK:/foo:/foo]> but was:<[CONNECTIONLOSS:/foo:null]>
	at org.apache.zookeeper.test.AsyncOps$AsyncCB.verify(AsyncOps.java:120)
	at org.apache.zookeeper.test.AsyncOps$StringCB.verifyCreateEphemeral(AsyncOps.java:170)
	at org.apache.zookeeper.test.AsyncOps$StringCB.verifyCreateFailure_NoChildForEphemeral(AsyncOps.java:193)
	at org.apache.zookeeper.test.AsyncOpsTest.testAsyncCreateFailure_NoChildForEphemeral(AsyncOpsTest.java:108)
	at org.apache.zookeeper.JUnit4ZKTestRunner$LoggedInvokeMethod.evaluate(JUnit4ZKTestRunner.java:79)


FAILED:  org.apache.zookeeper.test.AsyncOpsTest.testAsyncDeleteFailure_BadVersion

Error Message:
expected:<[OK:/foo:/foo]> but was:<[CONNECTIONLOSS:/foo:null]>

Stack Trace:
junit.framework.AssertionFailedError: expected:<[OK:/foo:/foo]> but was:<[CONNECTIONLOSS:/foo:null]>
	at org.apache.zookeeper.test.AsyncOps$AsyncCB.verify(AsyncOps.java:120)
	at org.apache.zookeeper.test.AsyncOps$StringCB.verifyCreate(AsyncOps.java:165)
	at org.apache.zookeeper.test.AsyncOps$VoidCB.verifyDeleteFailure_BadVersion(AsyncOps.java:709)
	at org.apache.zookeeper.test.AsyncOpsTest.testAsyncDeleteFailure_BadVersion(AsyncOpsTest.java:139)
	at org.apache.zookeeper.JUnit4ZKTestRunner$LoggedInvokeMethod.evaluate(JUnit4ZKTestRunner.java:79)


FAILED:  org.apache.zookeeper.test.AsyncOpsTest.testAsyncDeleteFailure_NoNode

Error Message:
expected:<[NONODE]:/foo:0> but was:<[CONNECTIONLOSS]:/foo:0>

Stack Trace:
junit.framework.AssertionFailedError: expected:<[NONODE]:/foo:0> but was:<[CONNECTIONLOSS]:/foo:0>
	at org.apache.zookeeper.test.AsyncOps$AsyncCB.verify(AsyncOps.java:120)
	at org.apache.zookeeper.test.AsyncOps$VoidCB.verifyDeleteFailure_NoNode(AsyncOps.java:705)
	at org.apache.zookeeper.test.AsyncOpsTest.testAsyncDeleteFailure_NoNode(AsyncOpsTest.java:134)
	at org.apache.zookeeper.JUnit4ZKTestRunner$LoggedInvokeMethod.evaluate(JUnit4ZKTestRunner.java:79)


FAILED:  org.apache.zookeeper.test.AsyncOpsTest.testAsyncSetDataFailure_BadVersion

Error Message:
expected:<[OK:/foo:/foo]> but was:<[CONNECTIONLOSS:/foo:null]>

Stack Trace:
junit.framework.AssertionFailedError: expected:<[OK:/foo:/foo]> but was:<[CONNECTIONLOSS:/foo:null]>
	at org.apache.zookeeper.test.AsyncOps$AsyncCB.verify(AsyncOps.java:120)
	at org.apache.zookeeper.test.AsyncOps$StringCB.verifyCreate(AsyncOps.java:165)
	at org.apache.zookeeper.test.AsyncOps$StatCB.verifySetDataFailure_BadVersion(AsyncOps.java:643)
	at org.apache.zookeeper.test.AsyncOpsTest.testAsyncSetDataFailure_BadVersion(AsyncOpsTest.java:179)
	at org.apache.zookeeper.JUnit4ZKTestRunner$LoggedInvokeMethod.evaluate(JUnit4ZKTestRunner.java:79)


FAILED:  org.apache.zookeeper.test.AsyncOpsTest.testAsyncCreate2

Error Message:
expected:<[OK:/foo:/foo:0:0:0:0]> but was:<[CONNECTIONLOSS:/foo:null:null]>

Stack Trace:
junit.framework.AssertionFailedError: expected:<[OK:/foo:/foo:0:0:0:0]> but was:<[CONNECTIONLOSS:/foo:null:null]>
	at org.apache.zookeeper.test.AsyncOps$AsyncCB.verify(AsyncOps.java:120)
	at org.apache.zookeeper.test.AsyncOps$Create2CB.verifyCreate(AsyncOps.java:483)
	at org.apache.zookeeper.test.AsyncOpsTest.testAsyncCreate2(AsyncOpsTest.java:73)
	at org.apache.zookeeper.JUnit4ZKTestRunner$LoggedInvokeMethod.evaluate(JUnit4ZKTestRunner.java:79)


FAILED:  org.apache.zookeeper.test.AsyncOpsTest.testAsyncGetChildren2Empty

Error Message:
expected:<[OK:/foo:/foo]> but was:<[CONNECTIONLOSS:/foo:null]>

Stack Trace:
junit.framework.AssertionFailedError: expected:<[OK:/foo:/foo]> but was:<[CONNECTIONLOSS:/foo:null]>
	at org.apache.zookeeper.test.AsyncOps$AsyncCB.verify(AsyncOps.java:120)
	at org.apache.zookeeper.test.AsyncOps$StringCB.verifyCreate(AsyncOps.java:165)
	at org.apache.zookeeper.test.AsyncOps$Children2CB.createNode(AsyncOps.java:381)
	at org.apache.zookeeper.test.AsyncOps$Children2CB.verifyGetChildrenEmpty(AsyncOps.java:401)
	at org.apache.zookeeper.test.AsyncOpsTest.testAsyncGetChildren2Empty(AsyncOpsTest.java:224)
	at org.apache.zookeeper.JUnit4ZKTestRunner$LoggedInvokeMethod.evaluate(JUnit4ZKTestRunner.java:79)


FAILED:  org.apache.zookeeper.test.AsyncOpsTest.testAsyncCreateThree

Error Message:
expected:<[OK:/op1:/op1]> but was:<[CONNECTIONLOSS:/op1:null]>

Stack Trace:
junit.framework.AssertionFailedError: expected:<[OK:/op1:/op1]> but was:<[CONNECTIONLOSS:/op1:null]>
	at org.apache.zookeeper.test.AsyncOps$AsyncCB.verify(AsyncOps.java:120)
	at org.apache.zookeeper.test.AsyncOpsTest.testAsyncCreateThree(AsyncOpsTest.java:91)
	at org.apache.zookeeper.JUnit4ZKTestRunner$LoggedInvokeMethod.evaluate(JUnit4ZKTestRunner.java:79)


FAILED:  org.apache.zookeeper.test.AsyncOpsTest.testAsyncMultiFailure_AllErrorResult

Error Message:
expected same:<0> was not:<1>

Stack Trace:
junit.framework.AssertionFailedError: expected same:<0> was not:<1>
	at org.apache.zookeeper.test.AsyncOps$MultiCB.latch_await(AsyncOps.java:764)
	at org.apache.zookeeper.test.AsyncOps$MultiCB.verifyMultiFailure_AllErrorResult(AsyncOps.java:787)
	at org.apache.zookeeper.test.AsyncOpsTest.testAsyncMultiFailure_AllErrorResult(AsyncOpsTest.java:259)
	at org.apache.zookeeper.JUnit4ZKTestRunner$LoggedInvokeMethod.evaluate(JUnit4ZKTestRunner.java:79)


FAILED:  org.apache.zookeeper.test.AsyncOpsTest.testAsyncGetChildrenTwo

Error Message:
expected:<[OK:/foo:/foo]> but was:<[CONNECTIONLOSS:/foo:null]>

Stack Trace:
junit.framework.AssertionFailedError: expected:<[OK:/foo:/foo]> but was:<[CONNECTIONLOSS:/foo:null]>
	at org.apache.zookeeper.test.AsyncOps$AsyncCB.verify(AsyncOps.java:120)
	at org.apache.zookeeper.test.AsyncOps$StringCB.verifyCreate(AsyncOps.java:165)
	at org.apache.zookeeper.test.AsyncOps$ChildrenCB.createNode(AsyncOps.java:295)
	at org.apache.zookeeper.test.AsyncOps$ChildrenCB.verifyGetChildrenTwo(AsyncOps.java:331)
	at org.apache.zookeeper.test.AsyncOpsTest.testAsyncGetChildrenTwo(AsyncOpsTest.java:214)
	at org.apache.zookeeper.JUnit4ZKTestRunner$LoggedInvokeMethod.evaluate(JUnit4ZKTestRunner.java:79)


FAILED:  org.apache.zookeeper.test.AsyncOpsTest.testAsyncCreateFailure_NodeExists

Error Message:
expected:<[OK:/foo:/foo]> but was:<[CONNECTIONLOSS:/foo:null]>

Stack Trace:
junit.framework.AssertionFailedError: expected:<[OK:/foo:/foo]> but was:<[CONNECTIONLOSS:/foo:null]>
	at org.apache.zookeeper.test.AsyncOps$AsyncCB.verify(AsyncOps.java:120)
	at org.apache.zookeeper.test.AsyncOps$StringCB.verifyCreate(AsyncOps.java:165)
	at org.apache.zookeeper.test.AsyncOps$StringCB.verifyCreateFailure_NodeExists(AsyncOps.java:174)
	at org.apache.zookeeper.test.AsyncOpsTest.testAsyncCreateFailure_NodeExists(AsyncOpsTest.java:98)
	at org.apache.zookeeper.JUnit4ZKTestRunner$LoggedInvokeMethod.evaluate(JUnit4ZKTestRunner.java:79)


FAILED:  org.apache.zookeeper.test.AsyncOpsTest.testAsyncCreate2Failure_NoChildForEphemeral

Error Message:
expected:<[OK:/foo:/foo]> but was:<[CONNECTIONLOSS:/foo:null]>

Stack Trace:
junit.framework.AssertionFailedError: expected:<[OK:/foo:/foo]> but was:<[CONNECTIONLOSS:/foo:null]>
	at org.apache.zookeeper.test.AsyncOps$AsyncCB.verify(AsyncOps.java:120)
	at org.apache.zookeeper.test.AsyncOps$StringCB.verifyCreateEphemeral(AsyncOps.java:170)
	at org.apache.zookeeper.test.AsyncOps$Create2CB.verifyCreateFailure_NoChildForEphemeral(AsyncOps.java:506)
	at org.apache.zookeeper.test.AsyncOpsTest.testAsyncCreate2Failure_NoChildForEphemeral(AsyncOpsTest.java:124)
	at org.apache.zookeeper.JUnit4ZKTestRunner$LoggedInvokeMethod.evaluate(JUnit4ZKTestRunner.java:79)


FAILED:  org.apache.zookeeper.test.AsyncOpsTest.testAsyncSetData

Error Message:
expected:<[OK:/foo:/foo]> but was:<[CONNECTIONLOSS:/foo:null]>

Stack Trace:
junit.framework.AssertionFailedError: expected:<[OK:/foo:/foo]> but was:<[CONNECTIONLOSS:/foo:null]>
	at org.apache.zookeeper.test.AsyncOps$AsyncCB.verify(AsyncOps.java:120)
	at org.apache.zookeeper.test.AsyncOps$StringCB.verifyCreate(AsyncOps.java:165)
	at org.apache.zookeeper.test.AsyncOps$StatCB.verifySetData(AsyncOps.java:629)
	at org.apache.zookeeper.test.AsyncOpsTest.testAsyncSetData(AsyncOpsTest.java:169)
	at org.apache.zookeeper.JUnit4ZKTestRunner$LoggedInvokeMethod.evaluate(JUnit4ZKTestRunner.java:79)


FAILED:  org.apache.zookeeper.test.AsyncOpsTest.testAsyncSetDataFailure_NoNode

Error Message:
expected:<[NONODE]:/foo:0:testing:null> but was:<[CONNECTIONLOSS]:/foo:0:testing:null>

Stack Trace:
junit.framework.AssertionFailedError: expected:<[NONODE]:/foo:0:testing:null> but was:<[CONNECTIONLOSS]:/foo:0:testing:null>
	at org.apache.zookeeper.test.AsyncOps$AsyncCB.verify(AsyncOps.java:120)
	at org.apache.zookeeper.test.AsyncOps$StatCB.verifySetDataFailure_NoNode(AsyncOps.java:639)
	at org.apache.zookeeper.test.AsyncOpsTest.testAsyncSetDataFailure_NoNode(AsyncOpsTest.java:174)
	at org.apache.zookeeper.JUnit4ZKTestRunner$LoggedInvokeMethod.evaluate(JUnit4ZKTestRunner.java:79)


FAILED:  org.apache.zookeeper.test.AsyncOpsTest.testAsyncSetACLFailure_NoNode

Error Message:
expected:<[NONODE]:/foo:0:testing:null> but was:<[CONNECTIONLOSS]:/foo:0:testing:null>

Stack Trace:
junit.framework.AssertionFailedError: expected:<[NONODE]:/foo:0:testing:null> but was:<[CONNECTIONLOSS]:/foo:0:testing:null>
	at org.apache.zookeeper.test.AsyncOps$AsyncCB.verify(AsyncOps.java:120)
	at org.apache.zookeeper.test.AsyncOps$StatCB.verifySetACLFailure_NoNode(AsyncOps.java:610)
	at org.apache.zookeeper.test.AsyncOpsTest.testAsyncSetACLFailure_NoNode(AsyncOpsTest.java:159)
	at org.apache.zookeeper.JUnit4ZKTestRunner$LoggedInvokeMethod.evaluate(JUnit4ZKTestRunner.java:79)


FAILED:  org.apache.zookeeper.test.AsyncOpsTest.testAsyncDeleteFailure_NotEmpty

Error Message:
expected:<[NOTEMPTY]:/foo:0> but was:<[CONNECTIONLOSS]:/foo:0>

Stack Trace:
junit.framework.AssertionFailedError: expected:<[NOTEMPTY]:/foo:0> but was:<[CONNECTIONLOSS]:/foo:0>
	at org.apache.zookeeper.test.AsyncOps$AsyncCB.verify(AsyncOps.java:120)
	at org.apache.zookeeper.test.AsyncOps$VoidCB.verifyDeleteFailure_NotEmpty(AsyncOps.java:723)
	at org.apache.zookeeper.test.AsyncOpsTest.testAsyncDeleteFailure_NotEmpty(AsyncOpsTest.java:144)
	at org.apache.zookeeper.JUnit4ZKTestRunner$LoggedInvokeMethod.evaluate(JUnit4ZKTestRunner.java:79)


FAILED:  org.apache.zookeeper.test.AsyncOpsTest.testAsyncGetChildrenSingle

Error Message:
expected:<[OK:/foo:/foo]> but was:<[CONNECTIONLOSS:/foo:null]>

Stack Trace:
junit.framework.AssertionFailedError: expected:<[OK:/foo:/foo]> but was:<[CONNECTIONLOSS:/foo:null]>
	at org.apache.zookeeper.test.AsyncOps$AsyncCB.verify(AsyncOps.java:120)
	at org.apache.zookeeper.test.AsyncOps$StringCB.verifyCreate(AsyncOps.java:165)
	at org.apache.zookeeper.test.AsyncOps$ChildrenCB.createNode(AsyncOps.java:295)
	at org.apache.zookeeper.test.AsyncOps$ChildrenCB.verifyGetChildrenSingle(AsyncOps.java:321)
	at org.apache.zookeeper.test.AsyncOpsTest.testAsyncGetChildrenSingle(AsyncOpsTest.java:209)
	at org.apache.zookeeper.JUnit4ZKTestRunner$LoggedInvokeMethod.evaluate(JUnit4ZKTestRunner.java:79)


FAILED:  org.apache.zookeeper.test.AsyncOpsTest.testAsyncCreate2Failure_NodeExists

Error Message:
expected:<[OK:/foo:/foo:0:0:0:0]> but was:<[CONNECTIONLOSS:/foo:null:null]>

Stack Trace:
junit.framework.AssertionFailedError: expected:<[OK:/foo:/foo:0:0:0:0]> but was:<[CONNECTIONLOSS:/foo:null:null]>
	at org.apache.zookeeper.test.AsyncOps$AsyncCB.verify(AsyncOps.java:120)
	at org.apache.zookeeper.test.AsyncOps$Create2CB.verifyCreate(AsyncOps.java:483)
	at org.apache.zookeeper.test.AsyncOps$Create2CB.verifyCreateFailure_NodeExists(AsyncOps.java:487)
	at org.apache.zookeeper.test.AsyncOpsTest.testAsyncCreate2Failure_NodeExists(AsyncOpsTest.java:113)
	at org.apache.zookeeper.JUnit4ZKTestRunner$LoggedInvokeMethod.evaluate(JUnit4ZKTestRunner.java:79)


FAILED:  org.apache.zookeeper.test.AsyncOpsTest.testAsyncGetChildren2Single

Error Message:
expected:<[OK:/foo:/foo]> but was:<[CONNECTIONLOSS:/foo:null]>

Stack Trace:
junit.framework.AssertionFailedError: expected:<[OK:/foo:/foo]> but was:<[CONNECTIONLOSS:/foo:null]>
	at org.apache.zookeeper.test.AsyncOps$AsyncCB.verify(AsyncOps.java:120)
	at org.apache.zookeeper.test.AsyncOps$StringCB.verifyCreate(AsyncOps.java:165)
	at org.apache.zookeeper.test.AsyncOps$Children2CB.createNode(AsyncOps.java:381)
	at org.apache.zookeeper.test.AsyncOps$Children2CB.verifyGetChildrenSingle(AsyncOps.java:407)
	at org.apache.zookeeper.test.AsyncOpsTest.testAsyncGetChildren2Single(AsyncOpsTest.java:229)
	at org.apache.zookeeper.JUnit4ZKTestRunner$LoggedInvokeMethod.evaluate(JUnit4ZKTestRunner.java:79)


FAILED:  org.apache.zookeeper.test.AsyncTest.testAsync

Error Message:
expected:<0> but was:<-4>

Stack Trace:
junit.framework.AssertionFailedError: expected:<0> but was:<-4>
	at org.apache.zookeeper.test.AsyncTest.testAsync(AsyncTest.java:88)
	at org.apache.zookeeper.JUnit4ZKTestRunner$LoggedInvokeMethod.evaluate(JUnit4ZKTestRunner.java:79)


FAILED:  org.apache.zookeeper.test.AuthTest.testSuper

Error Message:
KeeperErrorCode = ConnectionLoss for /path1

Stack Trace:
org.apache.zookeeper.KeeperException$ConnectionLossException: KeeperErrorCode = ConnectionLoss for /path1
	at org.apache.zookeeper.KeeperException.create(KeeperException.java:99)
	at org.apache.zookeeper.KeeperException.create(KeeperException.java:51)
	at org.apache.zookeeper.ZooKeeper.create(ZooKeeper.java:1445)
	at org.apache.zookeeper.test.AuthTest.testSuper(AuthTest.java:110)
	at org.apache.zookeeper.JUnit4ZKTestRunner$LoggedInvokeMethod.evaluate(JUnit4ZKTestRunner.java:79)


FAILED:  org.apache.zookeeper.test.AuthTest.testSuperACL

Error Message:
KeeperErrorCode = ConnectionLoss for /path1

Stack Trace:
org.apache.zookeeper.KeeperException$ConnectionLossException: KeeperErrorCode = ConnectionLoss for /path1
	at org.apache.zookeeper.KeeperException.create(KeeperException.java:99)
	at org.apache.zookeeper.KeeperException.create(KeeperException.java:51)
	at org.apache.zookeeper.ZooKeeper.create(ZooKeeper.java:1445)
	at org.apache.zookeeper.test.AuthTest.testSuperACL(AuthTest.java:156)
	at org.apache.zookeeper.JUnit4ZKTestRunner$LoggedInvokeMethod.evaluate(JUnit4ZKTestRunner.java:79)


FAILED:  org.apache.zookeeper.test.BufferSizeTest.testCreatesReqs

Error Message:
KeeperErrorCode = ConnectionLoss for /create_test

Stack Trace:
org.apache.zookeeper.KeeperException$ConnectionLossException: KeeperErrorCode = ConnectionLoss for /create_test
	at org.apache.zookeeper.KeeperException.create(KeeperException.java:99)
	at org.apache.zookeeper.KeeperException.create(KeeperException.java:51)
	at org.apache.zookeeper.ZooKeeper.create(ZooKeeper.java:1445)
	at org.apache.zookeeper.test.BufferSizeTest$1.execute(BufferSizeTest.java:55)
	at org.apache.zookeeper.test.BufferSizeTest.testRequests(BufferSizeTest.java:74)
	at org.apache.zookeeper.test.BufferSizeTest.testCreatesReqs(BufferSizeTest.java:52)
	at org.apache.zookeeper.JUnit4ZKTestRunner$LoggedInvokeMethod.evaluate(JUnit4ZKTestRunner.java:79)


FAILED:  org.apache.zookeeper.test.BufferSizeTest.testSetReqs

Error Message:
KeeperErrorCode = ConnectionLoss for /set_test

Stack Trace:
org.apache.zookeeper.KeeperException$ConnectionLossException: KeeperErrorCode = ConnectionLoss for /set_test
	at org.apache.zookeeper.KeeperException.create(KeeperException.java:99)
	at org.apache.zookeeper.KeeperException.create(KeeperException.java:51)
	at org.apache.zookeeper.ZooKeeper.create(ZooKeeper.java:1445)
	at org.apache.zookeeper.test.BufferSizeTest.testSetReqs(BufferSizeTest.java:63)
	at org.apache.zookeeper.JUnit4ZKTestRunner$LoggedInvokeMethod.evaluate(JUnit4ZKTestRunner.java:79)


FAILED:  org.apache.zookeeper.test.BufferSizeTest.testStartup

Error Message:
KeeperErrorCode = ConnectionLoss for /test_node

Stack Trace:
org.apache.zookeeper.KeeperException$ConnectionLossException: KeeperErrorCode = ConnectionLoss for /test_node
	at org.apache.zookeeper.KeeperException.create(KeeperException.java:99)
	at org.apache.zookeeper.KeeperException.create(KeeperException.java:51)
	at org.apache.zookeeper.ZooKeeper.create(ZooKeeper.java:1445)
	at org.apache.zookeeper.test.BufferSizeTest.testStartup(BufferSizeTest.java:93)
	at org.apache.zookeeper.JUnit4ZKTestRunner$LoggedInvokeMethod.evaluate(JUnit4ZKTestRunner.java:79)


FAILED:  org.apache.zookeeper.test.ChrootAsyncTest.testAsyncCreate2Failure_NoChildForEphemeral

Error Message:
Timeout occurred. Please note the time in the report does not reflect the time until the timeout.

Stack Trace:
junit.framework.AssertionFailedError: Timeout occurred. Please note the time in the report does not reflect the time until the timeout.
	at java.lang.Thread.run(Thread.java:745)


FAILED:  org.apache.zookeeper.test.ChrootClientTest.testPing

Error Message:
KeeperErrorCode = ConnectionLoss for /chrootclienttest

Stack Trace:
org.apache.zookeeper.KeeperException$ConnectionLossException: KeeperErrorCode = ConnectionLoss for /chrootclienttest
	at org.apache.zookeeper.KeeperException.create(KeeperException.java:99)
	at org.apache.zookeeper.KeeperException.create(KeeperException.java:51)
	at org.apache.zookeeper.ZooKeeper.create(ZooKeeper.java:1445)
	at org.apache.zookeeper.test.ChrootClientTest.setUp(ChrootClientTest.java:43)


FAILED:  org.apache.zookeeper.test.ChrootClientTest.testTryWithResources

Error Message:
KeeperErrorCode = ConnectionLoss for /chrootclienttest

Stack Trace:
org.apache.zookeeper.KeeperException$ConnectionLossException: KeeperErrorCode = ConnectionLoss for /chrootclienttest
	at org.apache.zookeeper.KeeperException.create(KeeperException.java:99)
	at org.apache.zookeeper.KeeperException.create(KeeperException.java:51)
	at org.apache.zookeeper.ZooKeeper.create(ZooKeeper.java:1445)
	at org.apache.zookeeper.test.ChrootClientTest.setUp(ChrootClientTest.java:43)


FAILED:  org.apache.zookeeper.test.ChrootClientTest.testACLs

Error Message:
KeeperErrorCode = ConnectionLoss for /chrootclienttest

Stack Trace:
org.apache.zookeeper.KeeperException$ConnectionLossException: KeeperErrorCode = ConnectionLoss for /chrootclienttest
	at org.apache.zookeeper.KeeperException.create(KeeperException.java:99)
	at org.apache.zookeeper.KeeperException.create(KeeperException.java:51)
	at org.apache.zookeeper.ZooKeeper.create(ZooKeeper.java:1445)
	at org.apache.zookeeper.test.ChrootClientTest.setUp(ChrootClientTest.java:43)


FAILED:  org.apache.zookeeper.test.ChrootClientTest.testClientCleanup

Error Message:
KeeperErrorCode = ConnectionLoss for /chrootclienttest

Stack Trace:
org.apache.zookeeper.KeeperException$ConnectionLossException: KeeperErrorCode = ConnectionLoss for /chrootclienttest
	at org.apache.zookeeper.KeeperException.create(KeeperException.java:99)
	at org.apache.zookeeper.KeeperException.create(KeeperException.java:51)
	at org.apache.zookeeper.ZooKeeper.create(ZooKeeper.java:1445)
	at org.apache.zookeeper.test.ChrootClientTest.setUp(ChrootClientTest.java:43)


FAILED:  org.apache.zookeeper.test.ChrootClientTest.testClientwithoutWatcherObj

Error Message:
KeeperErrorCode = ConnectionLoss for /chrootclienttest

Stack Trace:
org.apache.zookeeper.KeeperException$ConnectionLossException: KeeperErrorCode = ConnectionLoss for /chrootclienttest
	at org.apache.zookeeper.KeeperException.create(KeeperException.java:99)
	at org.apache.zookeeper.KeeperException.create(KeeperException.java:51)
	at org.apache.zookeeper.ZooKeeper.create(ZooKeeper.java:1445)
	at org.apache.zookeeper.test.ChrootClientTest.setUp(ChrootClientTest.java:43)


FAILED:  org.apache.zookeeper.test.ChrootClientTest.testSequentialNodeData

Error Message:
KeeperErrorCode = ConnectionLoss for /chrootclienttest

Stack Trace:
org.apache.zookeeper.KeeperException$ConnectionLossException: KeeperErrorCode = ConnectionLoss for /chrootclienttest
	at org.apache.zookeeper.KeeperException.create(KeeperException.java:99)
	at org.apache.zookeeper.KeeperException.create(KeeperException.java:51)
	at org.apache.zookeeper.ZooKeeper.create(ZooKeeper.java:1445)
	at org.apache.zookeeper.test.ChrootClientTest.setUp(ChrootClientTest.java:43)


FAILED:  org.apache.zookeeper.test.ChrootClientTest.testSequentialNodeNames

Error Message:
KeeperErrorCode = ConnectionLoss for /chrootclienttest

Stack Trace:
org.apache.zookeeper.KeeperException$ConnectionLossException: KeeperErrorCode = ConnectionLoss for /chrootclienttest
	at org.apache.zookeeper.KeeperException.create(KeeperException.java:99)
	at org.apache.zookeeper.KeeperException.create(KeeperException.java:51)
	at org.apache.zookeeper.ZooKeeper.create(ZooKeeper.java:1445)
	at org.apache.zookeeper.test.ChrootClientTest.setUp(ChrootClientTest.java:43)


FAILED:  org.apache.zookeeper.test.ChrootClientTest.testClientWithWatcherObj

Error Message:
KeeperErrorCode = ConnectionLoss for /chrootclienttest

Stack Trace:
org.apache.zookeeper.KeeperException$ConnectionLossException: KeeperErrorCode = ConnectionLoss for /chrootclienttest
	at org.apache.zookeeper.KeeperException.create(KeeperException.java:99)
	at org.apache.zookeeper.KeeperException.create(KeeperException.java:51)
	at org.apache.zookeeper.ZooKeeper.create(ZooKeeper.java:1445)
	at org.apache.zookeeper.test.ChrootClientTest.setUp(ChrootClientTest.java:43)


FAILED:  org.apache.zookeeper.test.ChrootClientTest.testTestability

Error Message:
KeeperErrorCode = ConnectionLoss for /chrootclienttest

Stack Trace:
org.apache.zookeeper.KeeperException$ConnectionLossException: KeeperErrorCode = ConnectionLoss for /chrootclienttest
	at org.apache.zookeeper.KeeperException.create(KeeperException.java:99)
	at org.apache.zookeeper.KeeperException.create(KeeperException.java:51)
	at org.apache.zookeeper.ZooKeeper.create(ZooKeeper.java:1445)
	at org.apache.zookeeper.test.ChrootClientTest.setUp(ChrootClientTest.java:43)


FAILED:  org.apache.zookeeper.test.ChrootClientTest.testNullAuthId

Error Message:
KeeperErrorCode = ConnectionLoss for /chrootclienttest

Stack Trace:
org.apache.zookeeper.KeeperException$ConnectionLossException: KeeperErrorCode = ConnectionLoss for /chrootclienttest
	at org.apache.zookeeper.KeeperException.create(KeeperException.java:99)
	at org.apache.zookeeper.KeeperException.create(KeeperException.java:51)
	at org.apache.zookeeper.ZooKeeper.create(ZooKeeper.java:1445)
	at org.apache.zookeeper.test.ChrootClientTest.setUp(ChrootClientTest.java:43)


FAILED:  org.apache.zookeeper.test.ChrootClientTest.testNonExistingOpCode

Error Message:
KeeperErrorCode = ConnectionLoss for /chrootclienttest

Stack Trace:
org.apache.zookeeper.KeeperException$ConnectionLossException: KeeperErrorCode = ConnectionLoss for /chrootclienttest
	at org.apache.zookeeper.KeeperException.create(KeeperException.java:99)
	at org.apache.zookeeper.KeeperException.create(KeeperException.java:51)
	at org.apache.zookeeper.ZooKeeper.create(ZooKeeper.java:1445)
	at org.apache.zookeeper.test.ChrootClientTest.setUp(ChrootClientTest.java:43)


FAILED:  org.apache.zookeeper.test.ChrootClientTest.testDeleteWithChildren

Error Message:
KeeperErrorCode = ConnectionLoss for /chrootclienttest

Stack Trace:
org.apache.zookeeper.KeeperException$ConnectionLossException: KeeperErrorCode = ConnectionLoss for /chrootclienttest
	at org.apache.zookeeper.KeeperException.create(KeeperException.java:99)
	at org.apache.zookeeper.KeeperException.create(KeeperException.java:51)
	at org.apache.zookeeper.ZooKeeper.create(ZooKeeper.java:1445)
	at org.apache.zookeeper.test.ChrootClientTest.setUp(ChrootClientTest.java:43)


FAILED:  org.apache.zookeeper.test.ChrootClientTest.testPathValidation

Error Message:
KeeperErrorCode = ConnectionLoss for /chrootclienttest

Stack Trace:
org.apache.zookeeper.KeeperException$ConnectionLossException: KeeperErrorCode = ConnectionLoss for /chrootclienttest
	at org.apache.zookeeper.KeeperException.create(KeeperException.java:99)
	at org.apache.zookeeper.KeeperException.create(KeeperException.java:51)
	at org.apache.zookeeper.ZooKeeper.create(ZooKeeper.java:1445)
	at org.apache.zookeeper.test.ChrootClientTest.setUp(ChrootClientTest.java:43)


FAILED:  org.apache.zookeeper.test.ChrootClientTest.testLargeNodeData

Error Message:
KeeperErrorCode = ConnectionLoss for /chrootclienttest

Stack Trace:
org.apache.zookeeper.KeeperException$ConnectionLossException: KeeperErrorCode = ConnectionLoss for /chrootclienttest
	at org.apache.zookeeper.KeeperException.create(KeeperException.java:99)
	at org.apache.zookeeper.KeeperException.create(KeeperException.java:51)
	at org.apache.zookeeper.ZooKeeper.create(ZooKeeper.java:1445)
	at org.apache.zookeeper.test.ChrootClientTest.setUp(ChrootClientTest.java:43)


FAILED:  org.apache.zookeeper.test.ChrootClientTest.testMutipleWatcherObjs

Error Message:
KeeperErrorCode = ConnectionLoss for /chrootclienttest

Stack Trace:
org.apache.zookeeper.KeeperException$ConnectionLossException: KeeperErrorCode = ConnectionLoss for /chrootclienttest
	at org.apache.zookeeper.KeeperException.create(KeeperException.java:99)
	at org.apache.zookeeper.KeeperException.create(KeeperException.java:51)
	at org.apache.zookeeper.ZooKeeper.create(ZooKeeper.java:1445)
	at org.apache.zookeeper.test.ChrootClientTest.setUp(ChrootClientTest.java:43)


FAILED:  org.apache.zookeeper.test.ChrootTest.testChrootSynchronous

Error Message:
KeeperErrorCode = ConnectionLoss for /ch1

Stack Trace:
org.apache.zookeeper.KeeperException$ConnectionLossException: KeeperErrorCode = ConnectionLoss for /ch1
	at org.apache.zookeeper.KeeperException.create(KeeperException.java:99)
	at org.apache.zookeeper.KeeperException.create(KeeperException.java:51)
	at org.apache.zookeeper.ZooKeeper.create(ZooKeeper.java:1445)
	at org.apache.zookeeper.test.ChrootTest.testChrootSynchronous(ChrootTest.java:63)
	at org.apache.zookeeper.JUnit4ZKTestRunner$LoggedInvokeMethod.evaluate(JUnit4ZKTestRunner.java:79)


FAILED:  org.apache.zookeeper.test.ClientHammerTest.testHammerBasic

Error Message:
KeeperErrorCode = ConnectionLoss for /test-0

Stack Trace:
org.apache.zookeeper.KeeperException$ConnectionLossException: KeeperErrorCode = ConnectionLoss for /test-0
	at org.apache.zookeeper.KeeperException.create(KeeperException.java:99)
	at org.apache.zookeeper.KeeperException.create(KeeperException.java:51)
	at org.apache.zookeeper.ZooKeeper.create(ZooKeeper.java:1445)
	at org.apache.zookeeper.test.ClientHammerTest.runHammer(ClientHammerTest.java:132)
	at org.apache.zookeeper.test.ClientHammerTest.testHammerBasic(ClientHammerTest.java:120)
	at org.apache.zookeeper.JUnit4ZKTestRunner$LoggedInvokeMethod.evaluate(JUnit4ZKTestRunner.java:79)


FAILED:  org.apache.zookeeper.test.ClientHammerTest.testHammerSuper

Error Message:
KeeperErrorCode = ConnectionLoss for /test-0

Stack Trace:
org.apache.zookeeper.KeeperException$ConnectionLossException: KeeperErrorCode = ConnectionLoss for /test-0
	at org.apache.zookeeper.KeeperException.create(KeeperException.java:99)
	at org.apache.zookeeper.KeeperException.create(KeeperException.java:51)
	at org.apache.zookeeper.ZooKeeper.create(ZooKeeper.java:1445)
	at org.apache.zookeeper.test.ClientHammerTest.testHammerSuper(ClientHammerTest.java:167)
	at org.apache.zookeeper.JUnit4ZKTestRunner$LoggedInvokeMethod.evaluate(JUnit4ZKTestRunner.java:79)


FAILED:  org.apache.zookeeper.test.ClientRetryTest.testClientRetry

Error Message:
Failed to connect to ZooKeeper server.

Stack Trace:
java.util.concurrent.TimeoutException: Failed to connect to ZooKeeper server.
	at org.apache.zookeeper.test.ClientBase$CountdownWatcher.waitForConnected(ClientBase.java:149)
	at org.apache.zookeeper.test.ClientRetryTest.testClientRetry(ClientRetryTest.java:63)
	at org.apache.zookeeper.JUnit4ZKTestRunner$LoggedInvokeMethod.evaluate(JUnit4ZKTestRunner.java:79)


FAILED:  org.apache.zookeeper.test.ClientSkipACLTest.testACLs

Error Message:
KeeperErrorCode = ConnectionLoss for /acltest

Stack Trace:
org.apache.zookeeper.KeeperException$ConnectionLossException: KeeperErrorCode = ConnectionLoss for /acltest
	at org.apache.zookeeper.KeeperException.create(KeeperException.java:99)
	at org.apache.zookeeper.KeeperException.create(KeeperException.java:51)
	at org.apache.zookeeper.ZooKeeper.create(ZooKeeper.java:1445)
	at org.apache.zookeeper.test.ClientTest.testACLs(ClientTest.java:130)
	at org.apache.zookeeper.JUnit4ZKTestRunner$LoggedInvokeMethod.evaluate(JUnit4ZKTestRunner.java:79)


FAILED:  org.apache.zookeeper.test.ClientSkipACLTest.testPing

Error Message:
Unable to connect to server

Stack Trace:
junit.framework.AssertionFailedError: Unable to connect to server
	at org.apache.zookeeper.test.ClientBase.createClient(ClientBase.java:231)
	at org.apache.zookeeper.test.ClientBase.createClient(ClientBase.java:220)
	at org.apache.zookeeper.test.ClientBase.createClient(ClientBase.java:205)
	at org.apache.zookeeper.test.ClientBase.createClient(ClientBase.java:198)
	at org.apache.zookeeper.test.ClientTest.testPing(ClientTest.java:69)
	at org.apache.zookeeper.JUnit4ZKTestRunner$LoggedInvokeMethod.evaluate(JUnit4ZKTestRunner.java:79)


FAILED:  org.apache.zookeeper.test.ClientSkipACLTest.testClientCleanup

Error Message:
null

Stack Trace:
junit.framework.AssertionFailedError
	at org.apache.zookeeper.test.ClientTest.testClientCleanup(ClientTest.java:807)
	at org.apache.zookeeper.JUnit4ZKTestRunner$LoggedInvokeMethod.evaluate(JUnit4ZKTestRunner.java:79)


FAILED:  org.apache.zookeeper.test.ClientSkipACLTest.testClientwithoutWatcherObj

Error Message:
KeeperErrorCode = ConnectionLoss for /benwashere

Stack Trace:
org.apache.zookeeper.KeeperException$ConnectionLossException: KeeperErrorCode = ConnectionLoss for /benwashere
	at org.apache.zookeeper.KeeperException.create(KeeperException.java:99)
	at org.apache.zookeeper.KeeperException.create(KeeperException.java:51)
	at org.apache.zookeeper.ZooKeeper.create(ZooKeeper.java:1445)
	at org.apache.zookeeper.test.ClientTest.performClientTest(ClientTest.java:384)
	at org.apache.zookeeper.test.ClientTest.testClientwithoutWatcherObj(ClientTest.java:98)
	at org.apache.zookeeper.JUnit4ZKTestRunner$LoggedInvokeMethod.evaluate(JUnit4ZKTestRunner.java:79)


FAILED:  org.apache.zookeeper.test.ClientSkipACLTest.testSequentialNodeData

Error Message:
KeeperErrorCode = ConnectionLoss for /queue

Stack Trace:
org.apache.zookeeper.KeeperException$ConnectionLossException: KeeperErrorCode = ConnectionLoss for /queue
	at org.apache.zookeeper.KeeperException.create(KeeperException.java:99)
	at org.apache.zookeeper.KeeperException.create(KeeperException.java:51)
	at org.apache.zookeeper.ZooKeeper.create(ZooKeeper.java:1445)
	at org.apache.zookeeper.test.ClientTest.testSequentialNodeData(ClientTest.java:565)
	at org.apache.zookeeper.JUnit4ZKTestRunner$LoggedInvokeMethod.evaluate(JUnit4ZKTestRunner.java:79)


FAILED:  org.apache.zookeeper.test.ClientSkipACLTest.testSequentialNodeNames

Error Message:
KeeperErrorCode = ConnectionLoss for /SEQUENCE

Stack Trace:
org.apache.zookeeper.KeeperException$ConnectionLossException: KeeperErrorCode = ConnectionLoss for /SEQUENCE
	at org.apache.zookeeper.KeeperException.create(KeeperException.java:99)
	at org.apache.zookeeper.KeeperException.create(KeeperException.java:51)
	at org.apache.zookeeper.ZooKeeper.create(ZooKeeper.java:1445)
	at org.apache.zookeeper.test.ClientTest.testSequentialNodeNames(ClientTest.java:523)
	at org.apache.zookeeper.JUnit4ZKTestRunner$LoggedInvokeMethod.evaluate(JUnit4ZKTestRunner.java:79)


FAILED:  org.apache.zookeeper.test.ClientSkipACLTest.testClientWithWatcherObj

Error Message:
KeeperErrorCode = ConnectionLoss for /benwashere

Stack Trace:
org.apache.zookeeper.KeeperException$ConnectionLossException: KeeperErrorCode = ConnectionLoss for /benwashere
	at org.apache.zookeeper.KeeperException.create(KeeperException.java:99)
	at org.apache.zookeeper.KeeperException.create(KeeperException.java:51)
	at org.apache.zookeeper.ZooKeeper.create(ZooKeeper.java:1445)
	at org.apache.zookeeper.test.ClientTest.performClientTest(ClientTest.java:384)
	at org.apache.zookeeper.test.ClientTest.testClientWithWatcherObj(ClientTest.java:105)
	at org.apache.zookeeper.JUnit4ZKTestRunner$LoggedInvokeMethod.evaluate(JUnit4ZKTestRunner.java:79)


FAILED:  org.apache.zookeeper.test.ClientSkipACLTest.testNullAuthId

Error Message:
KeeperErrorCode = ConnectionLoss for /acltest

Stack Trace:
org.apache.zookeeper.KeeperException$ConnectionLossException: KeeperErrorCode = ConnectionLoss for /acltest
	at org.apache.zookeeper.KeeperException.create(KeeperException.java:99)
	at org.apache.zookeeper.KeeperException.create(KeeperException.java:51)
	at org.apache.zookeeper.ZooKeeper.create(ZooKeeper.java:1445)
	at org.apache.zookeeper.test.ClientTest.testNullAuthId(ClientTest.java:208)
	at org.apache.zookeeper.JUnit4ZKTestRunner$LoggedInvokeMethod.evaluate(JUnit4ZKTestRunner.java:79)


FAILED:  org.apache.zookeeper.test.ClientSkipACLTest.testDeleteWithChildren

Error Message:
KeeperErrorCode = ConnectionLoss for /parent

Stack Trace:
org.apache.zookeeper.KeeperException$ConnectionLossException: KeeperErrorCode = ConnectionLoss for /parent
	at org.apache.zookeeper.KeeperException.create(KeeperException.java:99)
	at org.apache.zookeeper.KeeperException.create(KeeperException.java:51)
	at org.apache.zookeeper.ZooKeeper.create(ZooKeeper.java:1445)
	at org.apache.zookeeper.test.ClientTest.testDeleteWithChildren(ClientTest.java:736)
	at org.apache.zookeeper.JUnit4ZKTestRunner$LoggedInvokeMethod.evaluate(JUnit4ZKTestRunner.java:79)


FAILED:  org.apache.zookeeper.test.ClientSkipACLTest.testPathValidation

Error Message:
KeeperErrorCode = ConnectionLoss for /createseqpar

Stack Trace:
org.apache.zookeeper.KeeperException$ConnectionLossException: KeeperErrorCode = ConnectionLoss for /createseqpar
	at org.apache.zookeeper.KeeperException.create(KeeperException.java:99)
	at org.apache.zookeeper.KeeperException.create(KeeperException.java:51)
	at org.apache.zookeeper.ZooKeeper.create(ZooKeeper.java:1445)
	at org.apache.zookeeper.test.ClientTest.testPathValidation(ClientTest.java:652)
	at org.apache.zookeeper.JUnit4ZKTestRunner$LoggedInvokeMethod.evaluate(JUnit4ZKTestRunner.java:79)


FAILED:  org.apache.zookeeper.test.ClientSkipACLTest.testLargeNodeData

Error Message:
KeeperErrorCode = ConnectionLoss for /large

Stack Trace:
org.apache.zookeeper.KeeperException$ConnectionLossException: KeeperErrorCode = ConnectionLoss for /large
	at org.apache.zookeeper.KeeperException.create(KeeperException.java:99)
	at org.apache.zookeeper.KeeperException.create(KeeperException.java:51)
	at org.apache.zookeeper.ZooKeeper.create(ZooKeeper.java:1445)
	at org.apache.zookeeper.test.ClientTest.testLargeNodeData(ClientTest.java:604)
	at org.apache.zookeeper.JUnit4ZKTestRunner$LoggedInvokeMethod.evaluate(JUnit4ZKTestRunner.java:79)


FAILED:  org.apache.zookeeper.test.ClientSkipACLTest.testMutipleWatcherObjs

Error Message:
KeeperErrorCode = ConnectionLoss for /foo-0

Stack Trace:
org.apache.zookeeper.KeeperException$ConnectionLossException: KeeperErrorCode = ConnectionLoss for /foo-0
	at org.apache.zookeeper.KeeperException.create(KeeperException.java:99)
	at org.apache.zookeeper.KeeperException.create(KeeperException.java:51)
	at org.apache.zookeeper.ZooKeeper.create(ZooKeeper.java:1445)
	at org.apache.zookeeper.test.ClientTest.testMutipleWatcherObjs(ClientTest.java:273)
	at org.apache.zookeeper.JUnit4ZKTestRunner$LoggedInvokeMethod.evaluate(JUnit4ZKTestRunner.java:79)


FAILED:  org.apache.zookeeper.test.ClientTest.testACLs

Error Message:
KeeperErrorCode = ConnectionLoss for /acltest

Stack Trace:
org.apache.zookeeper.KeeperException$ConnectionLossException: KeeperErrorCode = ConnectionLoss for /acltest
	at org.apache.zookeeper.KeeperException.create(KeeperException.java:99)
	at org.apache.zookeeper.KeeperException.create(KeeperException.java:51)
	at org.apache.zookeeper.ZooKeeper.create(ZooKeeper.java:1445)
	at org.apache.zookeeper.test.ClientTest.testACLs(ClientTest.java:130)
	at org.apache.zookeeper.JUnit4ZKTestRunner$LoggedInvokeMethod.evaluate(JUnit4ZKTestRunner.java:79)


FAILED:  org.apache.zookeeper.test.ClientTest.testPing

Error Message:
Unable to connect to server

Stack Trace:
junit.framework.AssertionFailedError: Unable to connect to server
	at org.apache.zookeeper.test.ClientBase.createClient(ClientBase.java:231)
	at org.apache.zookeeper.test.ClientBase.createClient(ClientBase.java:220)
	at org.apache.zookeeper.test.ClientBase.createClient(ClientBase.java:205)
	at org.apache.zookeeper.test.ClientBase.createClient(ClientBase.java:198)
	at org.apache.zookeeper.test.ClientTest.testPing(ClientTest.java:69)
	at org.apache.zookeeper.JUnit4ZKTestRunner$LoggedInvokeMethod.evaluate(JUnit4ZKTestRunner.java:79)


FAILED:  org.apache.zookeeper.test.ClientTest.testClientCleanup

Error Message:
null

Stack Trace:
junit.framework.AssertionFailedError
	at org.apache.zookeeper.test.ClientTest.testClientCleanup(ClientTest.java:807)
	at org.apache.zookeeper.JUnit4ZKTestRunner$LoggedInvokeMethod.evaluate(JUnit4ZKTestRunner.java:79)


FAILED:  org.apache.zookeeper.test.ClientTest.testClientwithoutWatcherObj

Error Message:
KeeperErrorCode = ConnectionLoss for /benwashere

Stack Trace:
org.apache.zookeeper.KeeperException$ConnectionLossException: KeeperErrorCode = ConnectionLoss for /benwashere
	at org.apache.zookeeper.KeeperException.create(KeeperException.java:99)
	at org.apache.zookeeper.KeeperException.create(KeeperException.java:51)
	at org.apache.zookeeper.ZooKeeper.create(ZooKeeper.java:1445)
	at org.apache.zookeeper.test.ClientTest.performClientTest(ClientTest.java:384)
	at org.apache.zookeeper.test.ClientTest.testClientwithoutWatcherObj(ClientTest.java:98)
	at org.apache.zookeeper.JUnit4ZKTestRunner$LoggedInvokeMethod.evaluate(JUnit4ZKTestRunner.java:79)


FAILED:  org.apache.zookeeper.test.ClientTest.testSequentialNodeData

Error Message:
KeeperErrorCode = ConnectionLoss for /queue

Stack Trace:
org.apache.zookeeper.KeeperException$ConnectionLossException: KeeperErrorCode = ConnectionLoss for /queue
	at org.apache.zookeeper.KeeperException.create(KeeperException.java:99)
	at org.apache.zookeeper.KeeperException.create(KeeperException.java:51)
	at org.apache.zookeeper.ZooKeeper.create(ZooKeeper.java:1445)
	at org.apache.zookeeper.test.ClientTest.testSequentialNodeData(ClientTest.java:565)
	at org.apache.zookeeper.JUnit4ZKTestRunner$LoggedInvokeMethod.evaluate(JUnit4ZKTestRunner.java:79)


FAILED:  org.apache.zookeeper.test.ClientTest.testSequentialNodeNames

Error Message:
KeeperErrorCode = ConnectionLoss for /SEQUENCE

Stack Trace:
org.apache.zookeeper.KeeperException$ConnectionLossException: KeeperErrorCode = ConnectionLoss for /SEQUENCE
	at org.apache.zookeeper.KeeperException.create(KeeperException.java:99)
	at org.apache.zookeeper.KeeperException.create(KeeperException.java:51)
	at org.apache.zookeeper.ZooKeeper.create(ZooKeeper.java:1445)
	at org.apache.zookeeper.test.ClientTest.testSequentialNodeNames(ClientTest.java:523)
	at org.apache.zookeeper.JUnit4ZKTestRunner$LoggedInvokeMethod.evaluate(JUnit4ZKTestRunner.java:79)


FAILED:  org.apache.zookeeper.test.ClientTest.testClientWithWatcherObj

Error Message:
KeeperErrorCode = ConnectionLoss for /benwashere

Stack Trace:
org.apache.zookeeper.KeeperException$ConnectionLossException: KeeperErrorCode = ConnectionLoss for /benwashere
	at org.apache.zookeeper.KeeperException.create(KeeperException.java:99)
	at org.apache.zookeeper.KeeperException.create(KeeperException.java:51)
	at org.apache.zookeeper.ZooKeeper.create(ZooKeeper.java:1445)
	at org.apache.zookeeper.test.ClientTest.performClientTest(ClientTest.java:384)
	at org.apache.zookeeper.test.ClientTest.testClientWithWatcherObj(ClientTest.java:105)
	at org.apache.zookeeper.JUnit4ZKTestRunner$LoggedInvokeMethod.evaluate(JUnit4ZKTestRunner.java:79)


FAILED:  org.apache.zookeeper.test.ClientTest.testNullAuthId

Error Message:
KeeperErrorCode = ConnectionLoss for /acltest

Stack Trace:
org.apache.zookeeper.KeeperException$ConnectionLossException: KeeperErrorCode = ConnectionLoss for /acltest
	at org.apache.zookeeper.KeeperException.create(KeeperException.java:99)
	at org.apache.zookeeper.KeeperException.create(KeeperException.java:51)
	at org.apache.zookeeper.ZooKeeper.create(ZooKeeper.java:1445)
	at org.apache.zookeeper.test.ClientTest.testNullAuthId(ClientTest.java:208)
	at org.apache.zookeeper.JUnit4ZKTestRunner$LoggedInvokeMethod.evaluate(JUnit4ZKTestRunner.java:79)


FAILED:  org.apache.zookeeper.test.ClientTest.testDeleteWithChildren

Error Message:
KeeperErrorCode = ConnectionLoss for /parent

Stack Trace:
org.apache.zookeeper.KeeperException$ConnectionLossException: KeeperErrorCode = ConnectionLoss for /parent
	at org.apache.zookeeper.KeeperException.create(KeeperException.java:99)
	at org.apache.zookeeper.KeeperException.create(KeeperException.java:51)
	at org.apache.zookeeper.ZooKeeper.create(ZooKeeper.java:1445)
	at org.apache.zookeeper.test.ClientTest.testDeleteWithChildren(ClientTest.java:736)
	at org.apache.zookeeper.JUnit4ZKTestRunner$LoggedInvokeMethod.evaluate(JUnit4ZKTestRunner.java:79)


FAILED:  org.apache.zookeeper.test.ClientTest.testPathValidation

Error Message:
KeeperErrorCode = ConnectionLoss for /createseqpar

Stack Trace:
org.apache.zookeeper.KeeperException$ConnectionLossException: KeeperErrorCode = ConnectionLoss for /createseqpar
	at org.apache.zookeeper.KeeperException.create(KeeperException.java:99)
	at org.apache.zookeeper.KeeperException.create(KeeperException.java:51)
	at org.apache.zookeeper.ZooKeeper.create(ZooKeeper.java:1445)
	at org.apache.zookeeper.test.ClientTest.testPathValidation(ClientTest.java:652)
	at org.apache.zookeeper.JUnit4ZKTestRunner$LoggedInvokeMethod.evaluate(JUnit4ZKTestRunner.java:79)


FAILED:  org.apache.zookeeper.test.ClientTest.testLargeNodeData

Error Message:
KeeperErrorCode = ConnectionLoss for /large

Stack Trace:
org.apache.zookeeper.KeeperException$ConnectionLossException: KeeperErrorCode = ConnectionLoss for /large
	at org.apache.zookeeper.KeeperException.create(KeeperException.java:99)
	at org.apache.zookeeper.KeeperException.create(KeeperException.java:51)
	at org.apache.zookeeper.ZooKeeper.create(ZooKeeper.java:1445)
	at org.apache.zookeeper.test.ClientTest.testLargeNodeData(ClientTest.java:604)
	at org.apache.zookeeper.JUnit4ZKTestRunner$LoggedInvokeMethod.evaluate(JUnit4ZKTestRunner.java:79)


FAILED:  org.apache.zookeeper.test.ClientTest.testMutipleWatcherObjs

Error Message:
KeeperErrorCode = ConnectionLoss for /foo-0

Stack Trace:
org.apache.zookeeper.KeeperException$ConnectionLossException: KeeperErrorCode = ConnectionLoss for /foo-0
	at org.apache.zookeeper.KeeperException.create(KeeperException.java:99)
	at org.apache.zookeeper.KeeperException.create(KeeperException.java:51)
	at org.apache.zookeeper.ZooKeeper.create(ZooKeeper.java:1445)
	at org.apache.zookeeper.test.ClientTest.testMutipleWatcherObjs(ClientTest.java:273)
	at org.apache.zookeeper.JUnit4ZKTestRunner$LoggedInvokeMethod.evaluate(JUnit4ZKTestRunner.java:79)


FAILED:  org.apache.zookeeper.test.CreateTest.testCreateWithStat

Error Message:
KeeperErrorCode = ConnectionLoss for /foo

Stack Trace:
org.apache.zookeeper.KeeperException$ConnectionLossException: KeeperErrorCode = ConnectionLoss for /foo
	at org.apache.zookeeper.KeeperException.create(KeeperException.java:99)
	at org.apache.zookeeper.KeeperException.create(KeeperException.java:51)
	at org.apache.zookeeper.ZooKeeper.create(ZooKeeper.java:1544)
	at org.apache.zookeeper.ZooKeeper.create(ZooKeeper.java:1515)
	at org.apache.zookeeper.test.CreateTest.createWithStatVerifyResult(CreateTest.java:97)
	at org.apache.zookeeper.test.CreateTest.testCreateWithStat(CreateTest.java:62)
	at org.apache.zookeeper.JUnit4ZKTestRunner$LoggedInvokeMethod.evaluate(JUnit4ZKTestRunner.java:79)


FAILED:  org.apache.zookeeper.test.CreateTest.testCreateWithNullStat

Error Message:
KeeperErrorCode = ConnectionLoss for /foo

Stack Trace:
org.apache.zookeeper.KeeperException$ConnectionLossException: KeeperErrorCode = ConnectionLoss for /foo
	at org.apache.zookeeper.KeeperException.create(KeeperException.java:99)
	at org.apache.zookeeper.KeeperException.create(KeeperException.java:51)
	at org.apache.zookeeper.ZooKeeper.create(ZooKeeper.java:1544)
	at org.apache.zookeeper.ZooKeeper.create(ZooKeeper.java:1515)
	at org.apache.zookeeper.test.CreateTest.testCreateWithNullStat(CreateTest.java:77)
	at org.apache.zookeeper.JUnit4ZKTestRunner$LoggedInvokeMethod.evaluate(JUnit4ZKTestRunner.java:79)


FAILED:  org.apache.zookeeper.test.CreateTest.testCreate

Error Message:
KeeperErrorCode = ConnectionLoss for /foo

Stack Trace:
org.apache.zookeeper.KeeperException$ConnectionLossException: KeeperErrorCode = ConnectionLoss for /foo
	at org.apache.zookeeper.KeeperException.create(KeeperException.java:99)
	at org.apache.zookeeper.KeeperException.create(KeeperException.java:51)
	at org.apache.zookeeper.ZooKeeper.create(ZooKeeper.java:1445)
	at org.apache.zookeeper.test.CreateTest.createNoStatVerifyResult(CreateTest.java:86)
	at org.apache.zookeeper.test.CreateTest.testCreate(CreateTest.java:54)
	at org.apache.zookeeper.JUnit4ZKTestRunner$LoggedInvokeMethod.evaluate(JUnit4ZKTestRunner.java:79)


FAILED:  org.apache.zookeeper.test.DisconnectedWatcherTest.testDeepChildWatcherAutoResetWithChroot

Error Message:
KeeperErrorCode = ConnectionLoss for /ch1

Stack Trace:
org.apache.zookeeper.KeeperException$ConnectionLossException: KeeperErrorCode = ConnectionLoss for /ch1
	at org.apache.zookeeper.KeeperException.create(KeeperException.java:99)
	at org.apache.zookeeper.KeeperException.create(KeeperException.java:51)
	at org.apache.zookeeper.ZooKeeper.create(ZooKeeper.java:1445)
	at org.apache.zookeeper.test.DisconnectedWatcherTest.testDeepChildWatcherAutoResetWithChroot(DisconnectedWatcherTest.java:141)
	at org.apache.zookeeper.JUnit4ZKTestRunner$LoggedInvokeMethod.evaluate(JUnit4ZKTestRunner.java:79)


FAILED:  org.apache.zookeeper.test.DisconnectedWatcherTest.testChildWatcherAutoResetWithChroot

Error Message:
KeeperErrorCode = ConnectionLoss for /ch1

Stack Trace:
org.apache.zookeeper.KeeperException$ConnectionLossException: KeeperErrorCode = ConnectionLoss for /ch1
	at org.apache.zookeeper.KeeperException.create(KeeperException.java:99)
	at org.apache.zookeeper.KeeperException.create(KeeperException.java:51)
	at org.apache.zookeeper.ZooKeeper.create(ZooKeeper.java:1445)
	at org.apache.zookeeper.test.DisconnectedWatcherTest.testChildWatcherAutoResetWithChroot(DisconnectedWatcherTest.java:62)
	at org.apache.zookeeper.JUnit4ZKTestRunner$LoggedInvokeMethod.evaluate(JUnit4ZKTestRunner.java:79)


FAILED:  org.apache.zookeeper.test.DisconnectedWatcherTest.testDefaultWatcherAutoResetWithChroot

Error Message:
KeeperErrorCode = ConnectionLoss for /ch1

Stack Trace:
org.apache.zookeeper.KeeperException$ConnectionLossException: KeeperErrorCode = ConnectionLoss for /ch1
	at org.apache.zookeeper.KeeperException.create(KeeperException.java:99)
	at org.apache.zookeeper.KeeperException.create(KeeperException.java:51)
	at org.apache.zookeeper.ZooKeeper.create(ZooKeeper.java:1445)
	at org.apache.zookeeper.test.DisconnectedWatcherTest.testDefaultWatcherAutoResetWithChroot(DisconnectedWatcherTest.java:102)
	at org.apache.zookeeper.JUnit4ZKTestRunner$LoggedInvokeMethod.evaluate(JUnit4ZKTestRunner.java:79)


FAILED:  org.apache.zookeeper.test.DisconnectedWatcherTest.testManyChildWatchersAutoReset

Error Message:
Unable to connect to server

Stack Trace:
junit.framework.AssertionFailedError: Unable to connect to server
	at org.apache.zookeeper.test.ClientBase.createClient(ClientBase.java:231)
	at org.apache.zookeeper.test.ClientBase.createClient(ClientBase.java:220)
	at org.apache.zookeeper.test.ClientBase.createClient(ClientBase.java:211)
	at org.apache.zookeeper.test.DisconnectedWatcherTest.testManyChildWatchersAutoReset(DisconnectedWatcherTest.java:186)
	at org.apache.zookeeper.JUnit4ZKTestRunner$LoggedInvokeMethod.evaluate(JUnit4ZKTestRunner.java:79)


FAILED:  org.apache.zookeeper.test.DuplicateLocalSessionUpgradeTest.testLocalSessionUpgradeOnFollower

Error Message:
KeeperErrorCode = ConnectionLoss for /ephemeral

Stack Trace:
org.apache.zookeeper.KeeperException$ConnectionLossException: KeeperErrorCode = ConnectionLoss for /ephemeral
	at org.apache.zookeeper.KeeperException.create(KeeperException.java:99)
	at org.apache.zookeeper.KeeperException.create(KeeperException.java:51)
	at org.apache.zookeeper.ZooKeeper.create(ZooKeeper.java:1445)
	at org.apache.zookeeper.test.DuplicateLocalSessionUpgradeTest.testLocalSessionUpgrade(DuplicateLocalSessionUpgradeTest.java:96)
	at org.apache.zookeeper.test.DuplicateLocalSessionUpgradeTest.testLocalSessionUpgradeOnFollower(DuplicateLocalSessionUpgradeTest.java:65)
	at org.apache.zookeeper.JUnit4ZKTestRunner$LoggedInvokeMethod.evaluate(JUnit4ZKTestRunner.java:79)


FAILED:  org.apache.zookeeper.test.DuplicateLocalSessionUpgradeTest.testLocalSessionUpgradeOnLeader

Error Message:
KeeperErrorCode = ConnectionLoss for /ephemeral

Stack Trace:
org.apache.zookeeper.KeeperException$ConnectionLossException: KeeperErrorCode = ConnectionLoss for /ephemeral
	at org.apache.zookeeper.KeeperException.create(KeeperException.java:99)
	at org.apache.zookeeper.KeeperException.create(KeeperException.java:51)
	at org.apache.zookeeper.ZooKeeper.create(ZooKeeper.java:1445)
	at org.apache.zookeeper.test.DuplicateLocalSessionUpgradeTest.testLocalSessionUpgrade(DuplicateLocalSessionUpgradeTest.java:96)
	at org.apache.zookeeper.test.DuplicateLocalSessionUpgradeTest.testLocalSessionUpgradeOnLeader(DuplicateLocalSessionUpgradeTest.java:70)
	at org.apache.zookeeper.JUnit4ZKTestRunner$LoggedInvokeMethod.evaluate(JUnit4ZKTestRunner.java:79)


FAILED:  org.apache.zookeeper.test.EmptiedSnapshotRecoveryTest.testRestoreWithEmptySnapFiles

Error Message:
KeeperErrorCode = ConnectionLoss for /node-0

Stack Trace:
org.apache.zookeeper.KeeperException$ConnectionLossException: KeeperErrorCode = ConnectionLoss for /node-0
	at org.apache.zookeeper.KeeperException.create(KeeperException.java:99)
	at org.apache.zookeeper.KeeperException.create(KeeperException.java:51)
	at org.apache.zookeeper.ZooKeeper.create(ZooKeeper.java:1445)
	at org.apache.zookeeper.test.EmptiedSnapshotRecoveryTest.runTest(EmptiedSnapshotRecoveryTest.java:68)
	at org.apache.zookeeper.test.EmptiedSnapshotRecoveryTest.testRestoreWithEmptySnapFiles(EmptiedSnapshotRecoveryTest.java:117)
	at org.apache.zookeeper.JUnit4ZKTestRunner$LoggedInvokeMethod.evaluate(JUnit4ZKTestRunner.java:79)


FAILED:  org.apache.zookeeper.test.EmptiedSnapshotRecoveryTest.testRestoreWithNoSnapFiles

Error Message:
Address already in use

Stack Trace:
java.net.BindException: Address already in use
	at sun.nio.ch.Net.bind0(Native Method)
	at sun.nio.ch.Net.bind(Net.java:463)
	at sun.nio.ch.Net.bind(Net.java:455)
	at sun.nio.ch.ServerSocketChannelImpl.bind(ServerSocketChannelImpl.java:223)
	at sun.nio.ch.ServerSocketAdaptor.bind(ServerSocketAdaptor.java:74)
	at sun.nio.ch.ServerSocketAdaptor.bind(ServerSocketAdaptor.java:67)
	at org.apache.zookeeper.server.NIOServerCnxnFactory.configure(NIOServerCnxnFactory.java:687)
	at org.apache.zookeeper.server.ServerCnxnFactory.configure(ServerCnxnFactory.java:76)
	at org.apache.zookeeper.server.ServerCnxnFactory.createFactory(ServerCnxnFactory.java:154)
	at org.apache.zookeeper.server.ServerCnxnFactory.createFactory(ServerCnxnFactory.java:147)
	at org.apache.zookeeper.test.EmptiedSnapshotRecoveryTest.runTest(EmptiedSnapshotRecoveryTest.java:61)
	at org.apache.zookeeper.test.EmptiedSnapshotRecoveryTest.testRestoreWithNoSnapFiles(EmptiedSnapshotRecoveryTest.java:126)
	at org.apache.zookeeper.JUnit4ZKTestRunner$LoggedInvokeMethod.evaluate(JUnit4ZKTestRunner.java:79)


FAILED:  org.apache.zookeeper.test.FollowerResyncConcurrencyTest.testResyncByTxnlogThenDiffAfterFollowerCrashes

Error Message:
KeeperErrorCode = ConnectionLoss for /mybar

Stack Trace:
org.apache.zookeeper.KeeperException$ConnectionLossException: KeeperErrorCode = ConnectionLoss for /mybar
	at org.apache.zookeeper.KeeperException.create(KeeperException.java:99)
	at org.apache.zookeeper.KeeperException.create(KeeperException.java:51)
	at org.apache.zookeeper.ZooKeeper.create(ZooKeeper.java:1445)
	at org.apache.zookeeper.test.FollowerResyncConcurrencyTest.followerResyncCrashTest(FollowerResyncConcurrencyTest.java:235)
	at org.apache.zookeeper.test.FollowerResyncConcurrencyTest.testResyncByTxnlogThenDiffAfterFollowerCrashes(FollowerResyncConcurrencyTest.java:191)
	at org.apache.zookeeper.JUnit4ZKTestRunner$LoggedInvokeMethod.evaluate(JUnit4ZKTestRunner.java:79)


FAILED:  org.apache.zookeeper.test.FollowerResyncConcurrencyTest.testLaggingFollowerResyncsUnderNewEpoch

Error Message:
KeeperErrorCode = ConnectionLoss for /resyncundernewepoch

Stack Trace:
org.apache.zookeeper.KeeperException$ConnectionLossException: KeeperErrorCode = ConnectionLoss for /resyncundernewepoch
	at org.apache.zookeeper.KeeperException.create(KeeperException.java:99)
	at org.apache.zookeeper.KeeperException.create(KeeperException.java:51)
	at org.apache.zookeeper.ZooKeeper.create(ZooKeeper.java:1445)
	at org.apache.zookeeper.test.FollowerResyncConcurrencyTest.testLaggingFollowerResyncsUnderNewEpoch(FollowerResyncConcurrencyTest.java:114)
	at org.apache.zookeeper.JUnit4ZKTestRunner$LoggedInvokeMethod.evaluate(JUnit4ZKTestRunner.java:79)


FAILED:  org.apache.zookeeper.test.FollowerResyncConcurrencyTest.testResyncByDiffAfterFollowerCrashes

Error Message:
Failed to connect to ZooKeeper server.

Stack Trace:
java.util.concurrent.TimeoutException: Failed to connect to ZooKeeper server.
	at org.apache.zookeeper.test.ClientBase$CountdownWatcher.waitForConnected(ClientBase.java:149)
	at org.apache.zookeeper.test.FollowerResyncConcurrencyTest.createClient(FollowerResyncConcurrencyTest.java:547)
	at org.apache.zookeeper.test.FollowerResyncConcurrencyTest.testResyncByDiffAfterFollowerCrashes(FollowerResyncConcurrencyTest.java:416)
	at org.apache.zookeeper.JUnit4ZKTestRunner$LoggedInvokeMethod.evaluate(JUnit4ZKTestRunner.java:79)


FAILED:  org.apache.zookeeper.test.FollowerResyncConcurrencyTest.testResyncBySnapThenDiffAfterFollowerCrashes

Error Message:
KeeperErrorCode = ConnectionLoss for /mybar

Stack Trace:
org.apache.zookeeper.KeeperException$ConnectionLossException: KeeperErrorCode = ConnectionLoss for /mybar
	at org.apache.zookeeper.KeeperException.create(KeeperException.java:99)
	at org.apache.zookeeper.KeeperException.create(KeeperException.java:51)
	at org.apache.zookeeper.ZooKeeper.create(ZooKeeper.java:1445)
	at org.apache.zookeeper.test.FollowerResyncConcurrencyTest.followerResyncCrashTest(FollowerResyncConcurrencyTest.java:235)
	at org.apache.zookeeper.test.FollowerResyncConcurrencyTest.testResyncBySnapThenDiffAfterFollowerCrashes(FollowerResyncConcurrencyTest.java:176)
	at org.apache.zookeeper.JUnit4ZKTestRunner$LoggedInvokeMethod.evaluate(JUnit4ZKTestRunner.java:79)


FAILED:  org.apache.zookeeper.test.FollowerResyncConcurrencyTest.testFollowerWatcherResync

Error Message:
KeeperErrorCode = ConnectionLoss for /foo

Stack Trace:
org.apache.zookeeper.KeeperException$ConnectionLossException: KeeperErrorCode = ConnectionLoss for /foo
	at org.apache.zookeeper.KeeperException.create(KeeperException.java:99)
	at org.apache.zookeeper.KeeperException.create(KeeperException.java:51)
	at org.apache.zookeeper.ZooKeeper.create(ZooKeeper.java:1445)
	at org.apache.zookeeper.test.FollowerResyncConcurrencyTest.testFollowerWatcherResync(FollowerResyncConcurrencyTest.java:724)
	at org.apache.zookeeper.JUnit4ZKTestRunner$LoggedInvokeMethod.evaluate(JUnit4ZKTestRunner.java:79)


FAILED:  org.apache.zookeeper.test.FourLetterWordsQuorumTest.testFourLetterWords

Error Message:
null

Stack Trace:
junit.framework.AssertionFailedError
	at org.apache.zookeeper.test.FourLetterWordsQuorumTest.verify(FourLetterWordsQuorumTest.java:115)
	at org.apache.zookeeper.test.FourLetterWordsQuorumTest.testFourLetterWords(FourLetterWordsQuorumTest.java:84)
	at org.apache.zookeeper.JUnit4ZKTestRunner$LoggedInvokeMethod.evaluate(JUnit4ZKTestRunner.java:79)


FAILED:  org.apache.zookeeper.test.FourLetterWordsTest.testFourLetterWords

Error Message:
null

Stack Trace:
junit.framework.AssertionFailedError
	at org.apache.zookeeper.test.FourLetterWordsTest.verify(FourLetterWordsTest.java:130)
	at org.apache.zookeeper.test.FourLetterWordsTest.testFourLetterWords(FourLetterWordsTest.java:96)
	at org.apache.zookeeper.JUnit4ZKTestRunner$LoggedInvokeMethod.evaluate(JUnit4ZKTestRunner.java:79)
	at java.util.concurrent.FutureTask.run(FutureTask.java:262)
	at java.lang.Thread.run(Thread.java:745)


FAILED:  org.apache.zookeeper.test.FourLetterWordsTest.testValidateConsOutput

Error Message:
test timed out after 30000 milliseconds

Stack Trace:
org.junit.runners.model.TestTimedOutException: test timed out after 30000 milliseconds
	at sun.misc.Unsafe.park(Native Method)
	at java.util.concurrent.locks.LockSupport.parkNanos(LockSupport.java:226)
	at java.util.concurrent.locks.AbstractQueuedSynchronizer.doAcquireSharedNanos(AbstractQueuedSynchronizer.java:1033)
	at java.util.concurrent.locks.AbstractQueuedSynchronizer.tryAcquireSharedNanos(AbstractQueuedSynchronizer.java:1326)
	at java.util.concurrent.CountDownLatch.await(CountDownLatch.java:282)
	at org.apache.zookeeper.test.ClientBase.createClient(ClientBase.java:229)
	at org.apache.zookeeper.test.ClientBase.createClient(ClientBase.java:220)
	at org.apache.zookeeper.test.ClientBase.createClient(ClientBase.java:205)
	at org.apache.zookeeper.test.ClientBase.createClient(ClientBase.java:198)
	at org.apache.zookeeper.test.FourLetterWordsTest.testValidateConsOutput(FourLetterWordsTest.java:179)
	at org.apache.zookeeper.JUnit4ZKTestRunner$LoggedInvokeMethod.evaluate(JUnit4ZKTestRunner.java:79)
	at java.util.concurrent.FutureTask.run(FutureTask.java:262)
	at java.lang.Thread.run(Thread.java:745)


FAILED:  org.apache.zookeeper.test.FourLetterWordsTest.testValidateSocketTimeout

Error Message:
no such object in table

Stack Trace:
java.rmi.NoSuchObjectException: no such object in table
	at sun.rmi.transport.StreamRemoteCall.exceptionReceivedFromServer(StreamRemoteCall.java:275)
	at sun.rmi.transport.StreamRemoteCall.executeCall(StreamRemoteCall.java:252)
	at sun.rmi.server.UnicastRef.invoke(UnicastRef.java:161)
	at com.sun.jmx.remote.internal.PRef.invoke(Unknown Source)
	at javax.management.remote.rmi.RMIConnectionImpl_Stub.getConnectionId(Unknown Source)
	at javax.management.remote.rmi.RMIConnector.getConnectionId(RMIConnector.java:384)
	at javax.management.remote.rmi.RMIConnector.connect(RMIConnector.java:346)
	at javax.management.remote.JMXConnectorFactory.connect(JMXConnectorFactory.java:268)
	at javax.management.remote.JMXConnectorFactory.connect(JMXConnectorFactory.java:227)
	at org.apache.zookeeper.test.JMXEnv.setUp(JMXEnv.java:58)
	at org.apache.zookeeper.test.ClientBase.setUp(ClientBase.java:512)
	at java.util.concurrent.FutureTask.run(FutureTask.java:262)
	at java.lang.Thread.run(Thread.java:745)


FAILED:  org.apache.zookeeper.test.FourLetterWordsTest.testValidateStatOutput

Error Message:
test timed out after 30000 milliseconds

Stack Trace:
org.junit.runners.model.TestTimedOutException: test timed out after 30000 milliseconds
	at sun.misc.Unsafe.park(Native Method)
	at java.util.concurrent.locks.LockSupport.parkNanos(LockSupport.java:226)
	at java.util.concurrent.locks.AbstractQueuedSynchronizer.doAcquireSharedNanos(AbstractQueuedSynchronizer.java:1033)
	at java.util.concurrent.locks.AbstractQueuedSynchronizer.tryAcquireSharedNanos(AbstractQueuedSynchronizer.java:1326)
	at java.util.concurrent.CountDownLatch.await(CountDownLatch.java:282)
	at org.apache.zookeeper.test.ClientBase.createClient(ClientBase.java:229)
	at org.apache.zookeeper.test.ClientBase.createClient(ClientBase.java:220)
	at org.apache.zookeeper.test.ClientBase.createClient(ClientBase.java:205)
	at org.apache.zookeeper.test.ClientBase.createClient(ClientBase.java:198)
	at org.apache.zookeeper.test.FourLetterWordsTest.testValidateStatOutput(FourLetterWordsTest.java:136)
	at org.apache.zookeeper.JUnit4ZKTestRunner$LoggedInvokeMethod.evaluate(JUnit4ZKTestRunner.java:79)
	at java.util.concurrent.FutureTask.run(FutureTask.java:262)
	at java.lang.Thread.run(Thread.java:745)


FAILED:  org.apache.zookeeper.test.FourLetterWordsWhiteListTest.testFourLetterWordsEnableAllCommandsThroughAsterisk

Error Message:
null

Stack Trace:
junit.framework.AssertionFailedError
	at org.apache.zookeeper.test.FourLetterWordsWhiteListTest.verifyFuzzyMatch(FourLetterWordsWhiteListTest.java:239)
	at org.apache.zookeeper.test.FourLetterWordsWhiteListTest.verifyAllCommandsSuccess(FourLetterWordsWhiteListTest.java:188)
	at org.apache.zookeeper.test.FourLetterWordsWhiteListTest.testFourLetterWordsEnableAllCommandsThroughAsterisk(FourLetterWordsWhiteListTest.java:127)
	at org.apache.zookeeper.JUnit4ZKTestRunner$LoggedInvokeMethod.evaluate(JUnit4ZKTestRunner.java:79)
	at java.util.concurrent.FutureTask.run(FutureTask.java:262)
	at java.lang.Thread.run(Thread.java:745)


FAILED:  org.apache.zookeeper.test.FourLetterWordsWhiteListTest.testFourLetterWordsEnableAllCommandsThroughExplicitList

Error Message:
null

Stack Trace:
junit.framework.AssertionFailedError
	at org.apache.zookeeper.test.FourLetterWordsWhiteListTest.verifyFuzzyMatch(FourLetterWordsWhiteListTest.java:239)
	at org.apache.zookeeper.test.FourLetterWordsWhiteListTest.verifyAllCommandsSuccess(FourLetterWordsWhiteListTest.java:188)
	at org.apache.zookeeper.test.FourLetterWordsWhiteListTest.testFourLetterWordsEnableAllCommandsThroughExplicitList(FourLetterWordsWhiteListTest.java:139)
	at org.apache.zookeeper.JUnit4ZKTestRunner$LoggedInvokeMethod.evaluate(JUnit4ZKTestRunner.java:79)
	at java.util.concurrent.FutureTask.run(FutureTask.java:262)
	at java.lang.Thread.run(Thread.java:745)


FAILED:  org.apache.zookeeper.test.FourLetterWordsWhiteListTest.testFourLetterWordsAllDisabledByDefault

Error Message:
null

Stack Trace:
junit.framework.AssertionFailedError
	at org.apache.zookeeper.test.FourLetterWordsWhiteListTest.verifyFuzzyMatch(FourLetterWordsWhiteListTest.java:239)
	at org.apache.zookeeper.test.FourLetterWordsWhiteListTest.testFourLetterWordsAllDisabledByDefault(FourLetterWordsWhiteListTest.java:64)
	at org.apache.zookeeper.JUnit4ZKTestRunner$LoggedInvokeMethod.evaluate(JUnit4ZKTestRunner.java:79)
	at java.util.concurrent.FutureTask.run(FutureTask.java:262)
	at java.lang.Thread.run(Thread.java:745)


FAILED:  org.apache.zookeeper.test.GetChildren2Test.testChildren

Error Message:
KeeperErrorCode = ConnectionLoss for /foo

Stack Trace:
org.apache.zookeeper.KeeperException$ConnectionLossException: KeeperErrorCode = ConnectionLoss for /foo
	at org.apache.zookeeper.KeeperException.create(KeeperException.java:99)
	at org.apache.zookeeper.KeeperException.create(KeeperException.java:51)
	at org.apache.zookeeper.ZooKeeper.create(ZooKeeper.java:1445)
	at org.apache.zookeeper.test.GetChildren2Test.testChildren(GetChildren2Test.java:96)
	at org.apache.zookeeper.JUnit4ZKTestRunner$LoggedInvokeMethod.evaluate(JUnit4ZKTestRunner.java:79)


FAILED:  org.apache.zookeeper.test.GetChildren2Test.testChild

Error Message:
KeeperErrorCode = ConnectionLoss for /foo

Stack Trace:
org.apache.zookeeper.KeeperException$ConnectionLossException: KeeperErrorCode = ConnectionLoss for /foo
	at org.apache.zookeeper.KeeperException.create(KeeperException.java:99)
	at org.apache.zookeeper.KeeperException.create(KeeperException.java:51)
	at org.apache.zookeeper.ZooKeeper.create(ZooKeeper.java:1445)
	at org.apache.zookeeper.test.GetChildren2Test.testChild(GetChildren2Test.java:56)
	at org.apache.zookeeper.JUnit4ZKTestRunner$LoggedInvokeMethod.evaluate(JUnit4ZKTestRunner.java:79)


FAILED:  org.apache.zookeeper.test.GetProposalFromTxnTest.testGetProposalFromTxn

Error Message:
KeeperErrorCode = ConnectionLoss for /invalidsnap-0

Stack Trace:
org.apache.zookeeper.KeeperException$ConnectionLossException: KeeperErrorCode = ConnectionLoss for /invalidsnap-0
	at org.apache.zookeeper.KeeperException.create(KeeperException.java:99)
	at org.apache.zookeeper.KeeperException.create(KeeperException.java:51)
	at org.apache.zookeeper.ZooKeeper.create(ZooKeeper.java:1445)
	at org.apache.zookeeper.test.GetProposalFromTxnTest.testGetProposalFromTxn(GetProposalFromTxnTest.java:80)
	at org.apache.zookeeper.JUnit4ZKTestRunner$LoggedInvokeMethod.evaluate(JUnit4ZKTestRunner.java:79)


FAILED:  org.apache.zookeeper.test.HierarchicalQuorumTest.testHierarchicalQuorum

Error Message:
KeeperErrorCode = ConnectionLoss for /test-0

Stack Trace:
org.apache.zookeeper.KeeperException$ConnectionLossException: KeeperErrorCode = ConnectionLoss for /test-0
	at org.apache.zookeeper.KeeperException.create(KeeperException.java:99)
	at org.apache.zookeeper.KeeperException.create(KeeperException.java:51)
	at org.apache.zookeeper.ZooKeeper.create(ZooKeeper.java:1445)
	at org.apache.zookeeper.test.ClientHammerTest.runHammer(ClientHammerTest.java:132)
	at org.apache.zookeeper.test.HierarchicalQuorumTest.testHierarchicalQuorum(HierarchicalQuorumTest.java:308)
	at org.apache.zookeeper.JUnit4ZKTestRunner$LoggedInvokeMethod.evaluate(JUnit4ZKTestRunner.java:79)


FAILED:  org.apache.zookeeper.test.KeyAuthClientTest.testAuth

Error Message:
test failed :org.apache.zookeeper.KeeperException$ConnectionLossException: KeeperErrorCode = ConnectionLoss for /

Stack Trace:
junit.framework.AssertionFailedError: test failed :org.apache.zookeeper.KeeperException$ConnectionLossException: KeeperErrorCode = ConnectionLoss for /
	at org.apache.zookeeper.test.KeyAuthClientTest.preAuth(KeyAuthClientTest.java:67)
	at org.apache.zookeeper.test.KeyAuthClientTest.testAuth(KeyAuthClientTest.java:125)
	at org.apache.zookeeper.JUnit4ZKTestRunner$LoggedInvokeMethod.evaluate(JUnit4ZKTestRunner.java:79)


FAILED:  org.apache.zookeeper.test.LeaderSessionTrackerTest.testExpiredSessionWithLocalSession

Error Message:
KeeperErrorCode = ConnectionLoss for /ok

Stack Trace:
org.apache.zookeeper.KeeperException$ConnectionLossException: KeeperErrorCode = ConnectionLoss for /ok
	at org.apache.zookeeper.KeeperException.create(KeeperException.java:99)
	at org.apache.zookeeper.KeeperException.create(KeeperException.java:51)
	at org.apache.zookeeper.ZooKeeper.create(ZooKeeper.java:1445)
	at org.apache.zookeeper.test.LeaderSessionTrackerTest.testCreateEphemeral(LeaderSessionTrackerTest.java:114)
	at org.apache.zookeeper.test.LeaderSessionTrackerTest.testExpiredSessionWithLocalSession(LeaderSessionTrackerTest.java:68)
	at org.apache.zookeeper.JUnit4ZKTestRunner$LoggedInvokeMethod.evaluate(JUnit4ZKTestRunner.java:79)


FAILED:  org.apache.zookeeper.test.LeaderSessionTrackerTest.testExpiredSessionWithoutLocalSession

Error Message:
KeeperErrorCode = ConnectionLoss for /ok

Stack Trace:
org.apache.zookeeper.KeeperException$ConnectionLossException: KeeperErrorCode = ConnectionLoss for /ok
	at org.apache.zookeeper.KeeperException.create(KeeperException.java:99)
	at org.apache.zookeeper.KeeperException.create(KeeperException.java:51)
	at org.apache.zookeeper.ZooKeeper.create(ZooKeeper.java:1445)
	at org.apache.zookeeper.test.LeaderSessionTrackerTest.testCreateEphemeral(LeaderSessionTrackerTest.java:114)
	at org.apache.zookeeper.test.LeaderSessionTrackerTest.testExpiredSessionWithoutLocalSession(LeaderSessionTrackerTest.java:73)
	at org.apache.zookeeper.JUnit4ZKTestRunner$LoggedInvokeMethod.evaluate(JUnit4ZKTestRunner.java:79)


FAILED:  org.apache.zookeeper.test.LeaderSessionTrackerTest.testCreatePersistent

Error Message:
KeeperErrorCode = ConnectionLoss for /ok

Stack Trace:
org.apache.zookeeper.KeeperException$ConnectionLossException: KeeperErrorCode = ConnectionLoss for /ok
	at org.apache.zookeeper.KeeperException.create(KeeperException.java:99)
	at org.apache.zookeeper.KeeperException.create(KeeperException.java:51)
	at org.apache.zookeeper.ZooKeeper.create(ZooKeeper.java:1445)
	at org.apache.zookeeper.test.LeaderSessionTrackerTest.testCreatePersistent(LeaderSessionTrackerTest.java:156)
	at org.apache.zookeeper.JUnit4ZKTestRunner$LoggedInvokeMethod.evaluate(JUnit4ZKTestRunner.java:79)


FAILED:  org.apache.zookeeper.test.LoadFromLogTest.testReloadSnapshotWithMissingParent

Error Message:
KeeperErrorCode = ConnectionLoss for /a

Stack Trace:
org.apache.zookeeper.KeeperException$ConnectionLossException: KeeperErrorCode = ConnectionLoss for /a
	at org.apache.zookeeper.KeeperException.create(KeeperException.java:99)
	at org.apache.zookeeper.KeeperException.create(KeeperException.java:51)
	at org.apache.zookeeper.ZooKeeper.create(ZooKeeper.java:1445)
	at org.apache.zookeeper.test.LoadFromLogTest.testReloadSnapshotWithMissingParent(LoadFromLogTest.java:525)
	at org.apache.zookeeper.JUnit4ZKTestRunner$LoggedInvokeMethod.evaluate(JUnit4ZKTestRunner.java:79)


FAILED:  org.apache.zookeeper.test.LoadFromLogTest.testRestoreWithTransactionErrors

Error Message:
KeeperErrorCode = ConnectionLoss for /invaliddir/test-

Stack Trace:
org.apache.zookeeper.KeeperException$ConnectionLossException: KeeperErrorCode = ConnectionLoss for /invaliddir/test-
	at org.apache.zookeeper.KeeperException.create(KeeperException.java:99)
	at org.apache.zookeeper.KeeperException.create(KeeperException.java:51)
	at org.apache.zookeeper.ZooKeeper.create(ZooKeeper.java:1445)
	at org.apache.zookeeper.test.LoadFromLogTest.testRestoreWithTransactionErrors(LoadFromLogTest.java:433)
	at org.apache.zookeeper.JUnit4ZKTestRunner$LoggedInvokeMethod.evaluate(JUnit4ZKTestRunner.java:79)


FAILED:  org.apache.zookeeper.test.LoadFromLogTest.testLoad

Error Message:
KeeperErrorCode = ConnectionLoss for /invalidsnap-0

Stack Trace:
org.apache.zookeeper.KeeperException$ConnectionLossException: KeeperErrorCode = ConnectionLoss for /invalidsnap-0
	at org.apache.zookeeper.KeeperException.create(KeeperException.java:99)
	at org.apache.zookeeper.KeeperException.create(KeeperException.java:51)
	at org.apache.zookeeper.ZooKeeper.create(ZooKeeper.java:1445)
	at org.apache.zookeeper.test.LoadFromLogTest.testLoad(LoadFromLogTest.java:94)
	at org.apache.zookeeper.JUnit4ZKTestRunner$LoggedInvokeMethod.evaluate(JUnit4ZKTestRunner.java:79)


FAILED:  org.apache.zookeeper.test.LoadFromLogTest.testRestore

Error Message:
KeeperErrorCode = ConnectionLoss for /invalidsnap

Stack Trace:
org.apache.zookeeper.KeeperException$ConnectionLossException: KeeperErrorCode = ConnectionLoss for /invalidsnap
	at org.apache.zookeeper.KeeperException.create(KeeperException.java:99)
	at org.apache.zookeeper.KeeperException.create(KeeperException.java:51)
	at org.apache.zookeeper.ZooKeeper.create(ZooKeeper.java:1445)
	at org.apache.zookeeper.test.LoadFromLogTest.testRestore(LoadFromLogTest.java:351)
	at org.apache.zookeeper.JUnit4ZKTestRunner$LoggedInvokeMethod.evaluate(JUnit4ZKTestRunner.java:79)


FAILED:  org.apache.zookeeper.test.LoadFromLogTest.testLoadFailure

Error Message:
KeeperErrorCode = ConnectionLoss for /data-

Stack Trace:
org.apache.zookeeper.KeeperException$ConnectionLossException: KeeperErrorCode = ConnectionLoss for /data-
	at org.apache.zookeeper.KeeperException.create(KeeperException.java:99)
	at org.apache.zookeeper.KeeperException.create(KeeperException.java:51)
	at org.apache.zookeeper.ZooKeeper.create(ZooKeeper.java:1445)
	at org.apache.zookeeper.test.LoadFromLogTest.testLoadFailure(LoadFromLogTest.java:156)
	at org.apache.zookeeper.JUnit4ZKTestRunner$LoggedInvokeMethod.evaluate(JUnit4ZKTestRunner.java:79)


FAILED:  org.apache.zookeeper.test.LocalSessionsOnlyTest.testLocalSessionsOnLeader

Error Message:
KeeperErrorCode = ConnectionLoss for /testLocalSessions-leaderTest-1

Stack Trace:
org.apache.zookeeper.KeeperException$ConnectionLossException: KeeperErrorCode = ConnectionLoss for /testLocalSessions-leaderTest-1
	at org.apache.zookeeper.KeeperException.create(KeeperException.java:99)
	at org.apache.zookeeper.KeeperException.create(KeeperException.java:51)
	at org.apache.zookeeper.ZooKeeper.create(ZooKeeper.java:1445)
	at org.apache.zookeeper.test.LocalSessionsOnlyTest.testLocalSessions(LocalSessionsOnlyTest.java:93)
	at org.apache.zookeeper.test.LocalSessionsOnlyTest.testLocalSessionsOnLeader(LocalSessionsOnlyTest.java:72)
	at org.apache.zookeeper.JUnit4ZKTestRunner$LoggedInvokeMethod.evaluate(JUnit4ZKTestRunner.java:79)


FAILED:  org.apache.zookeeper.test.LocalSessionsOnlyTest.testLocalSessionsOnFollower

Error Message:
KeeperErrorCode = ConnectionLoss for /testLocalSessions-followerTest-1

Stack Trace:
org.apache.zookeeper.KeeperException$ConnectionLossException: KeeperErrorCode = ConnectionLoss for /testLocalSessions-followerTest-1
	at org.apache.zookeeper.KeeperException.create(KeeperException.java:99)
	at org.apache.zookeeper.KeeperException.create(KeeperException.java:51)
	at org.apache.zookeeper.ZooKeeper.create(ZooKeeper.java:1445)
	at org.apache.zookeeper.test.LocalSessionsOnlyTest.testLocalSessions(LocalSessionsOnlyTest.java:93)
	at org.apache.zookeeper.test.LocalSessionsOnlyTest.testLocalSessionsOnFollower(LocalSessionsOnlyTest.java:67)
	at org.apache.zookeeper.JUnit4ZKTestRunner$LoggedInvokeMethod.evaluate(JUnit4ZKTestRunner.java:79)


FAILED:  org.apache.zookeeper.test.MaxCnxnsTest.testMaxCnxns

Error Message:
expected same:<30> was not:<15>

Stack Trace:
junit.framework.AssertionFailedError: expected same:<30> was not:<15>
	at org.apache.zookeeper.test.MaxCnxnsTest.testMaxCnxns(MaxCnxnsTest.java:134)
	at org.apache.zookeeper.JUnit4ZKTestRunner$LoggedInvokeMethod.evaluate(JUnit4ZKTestRunner.java:79)


FAILED:  org.apache.zookeeper.test.MultiAsyncTransactionTest.testSequentialNodeCreateInAsyncMulti

Error Message:
expected:<0> but was:<-4>

Stack Trace:
junit.framework.AssertionFailedError: expected:<0> but was:<-4>
	at org.apache.zookeeper.test.MultiAsyncTransactionTest.testSequentialNodeCreateInAsyncMulti(MultiAsyncTransactionTest.java:112)
	at org.apache.zookeeper.JUnit4ZKTestRunner$LoggedInvokeMethod.evaluate(JUnit4ZKTestRunner.java:79)


FAILED:  org.apache.zookeeper.test.MultiTransactionTest.testTransactionBuilder[0]

Error Message:
KeeperErrorCode = ConnectionLoss

Stack Trace:
org.apache.zookeeper.KeeperException$ConnectionLossException: KeeperErrorCode = ConnectionLoss
	at org.apache.zookeeper.KeeperException.create(KeeperException.java:99)
	at org.apache.zookeeper.ZooKeeper.multiInternal(ZooKeeper.java:1818)
	at org.apache.zookeeper.ZooKeeper.multi(ZooKeeper.java:1737)
	at org.apache.zookeeper.Transaction.commit(Transaction.java:62)
	at org.apache.zookeeper.test.MultiTransactionTest.commit(MultiTransactionTest.java:193)
	at org.apache.zookeeper.test.MultiTransactionTest.testTransactionBuilder(MultiTransactionTest.java:720)
	at org.apache.zookeeper.JUnit4ZKTestRunner$LoggedInvokeMethod.evaluate(JUnit4ZKTestRunner.java:79)


FAILED:  org.apache.zookeeper.test.MultiTransactionTest.testDeleteUpdateConflict[0]

Error Message:
KeeperErrorCode = ConnectionLoss for /multi

Stack Trace:
org.apache.zookeeper.KeeperException$ConnectionLossException: KeeperErrorCode = ConnectionLoss for /multi
	at org.apache.zookeeper.KeeperException.create(KeeperException.java:99)
	at org.apache.zookeeper.KeeperException.create(KeeperException.java:51)
	at org.apache.zookeeper.ZooKeeper.exists(ZooKeeper.java:1928)
	at org.apache.zookeeper.test.MultiTransactionTest.testDeleteUpdateConflict(MultiTransactionTest.java:578)
	at org.apache.zookeeper.JUnit4ZKTestRunner$LoggedInvokeMethod.evaluate(JUnit4ZKTestRunner.java:79)


FAILED:  org.apache.zookeeper.test.MultiTransactionTest.testChRootSetData[0]

Error Message:
KeeperErrorCode = ConnectionLoss

Stack Trace:
org.apache.zookeeper.KeeperException$ConnectionLossException: KeeperErrorCode = ConnectionLoss
	at org.apache.zookeeper.KeeperException.create(KeeperException.java:99)
	at org.apache.zookeeper.ZooKeeper.multiInternal(ZooKeeper.java:1818)
	at org.apache.zookeeper.ZooKeeper.multi(ZooKeeper.java:1737)
	at org.apache.zookeeper.test.MultiTransactionTest.multi(MultiTransactionTest.java:118)
	at org.apache.zookeeper.test.MultiTransactionTest.createNameSpace(MultiTransactionTest.java:451)
	at org.apache.zookeeper.test.MultiTransactionTest.testChRootSetData(MultiTransactionTest.java:372)
	at org.apache.zookeeper.JUnit4ZKTestRunner$LoggedInvokeMethod.evaluate(JUnit4ZKTestRunner.java:79)


FAILED:  org.apache.zookeeper.test.MultiTransactionTest.testUpdateConflict[0]

Error Message:
KeeperErrorCode = ConnectionLoss for /multi

Stack Trace:
org.apache.zookeeper.KeeperException$ConnectionLossException: KeeperErrorCode = ConnectionLoss for /multi
	at org.apache.zookeeper.KeeperException.create(KeeperException.java:99)
	at org.apache.zookeeper.KeeperException.create(KeeperException.java:51)
	at org.apache.zookeeper.ZooKeeper.exists(ZooKeeper.java:1928)
	at org.apache.zookeeper.test.MultiTransactionTest.testUpdateConflict(MultiTransactionTest.java:550)
	at org.apache.zookeeper.JUnit4ZKTestRunner$LoggedInvokeMethod.evaluate(JUnit4ZKTestRunner.java:79)


FAILED:  org.apache.zookeeper.test.MultiTransactionTest.testMultiRollback[0]

Error Message:
KeeperErrorCode = ConnectionLoss for /foo

Stack Trace:
org.apache.zookeeper.KeeperException$ConnectionLossException: KeeperErrorCode = ConnectionLoss for /foo
	at org.apache.zookeeper.KeeperException.create(KeeperException.java:99)
	at org.apache.zookeeper.KeeperException.create(KeeperException.java:51)
	at org.apache.zookeeper.ZooKeeper.create(ZooKeeper.java:1445)
	at org.apache.zookeeper.test.MultiTransactionTest.testMultiRollback(MultiTransactionTest.java:258)
	at org.apache.zookeeper.JUnit4ZKTestRunner$LoggedInvokeMethod.evaluate(JUnit4ZKTestRunner.java:79)


FAILED:  org.apache.zookeeper.test.MultiTransactionTest.testChRootTransaction[0]

Error Message:
KeeperErrorCode = ConnectionLoss

Stack Trace:
org.apache.zookeeper.KeeperException$ConnectionLossException: KeeperErrorCode = ConnectionLoss
	at org.apache.zookeeper.KeeperException.create(KeeperException.java:99)
	at org.apache.zookeeper.ZooKeeper.multiInternal(ZooKeeper.java:1818)
	at org.apache.zookeeper.ZooKeeper.multi(ZooKeeper.java:1737)
	at org.apache.zookeeper.test.MultiTransactionTest.multi(MultiTransactionTest.java:118)
	at org.apache.zookeeper.test.MultiTransactionTest.createNameSpace(MultiTransactionTest.java:451)
	at org.apache.zookeeper.test.MultiTransactionTest.testChRootTransaction(MultiTransactionTest.java:414)
	at org.apache.zookeeper.JUnit4ZKTestRunner$LoggedInvokeMethod.evaluate(JUnit4ZKTestRunner.java:79)


FAILED:  org.apache.zookeeper.test.MultiTransactionTest.testNoWatchesTriggeredForFailedMultiRequest[0]

Error Message:
KeeperErrorCode = ConnectionLoss

Stack Trace:
org.apache.zookeeper.KeeperException$ConnectionLossException: KeeperErrorCode = ConnectionLoss
	at org.apache.zookeeper.KeeperException.create(KeeperException.java:99)
	at org.apache.zookeeper.ZooKeeper.multiInternal(ZooKeeper.java:1818)
	at org.apache.zookeeper.ZooKeeper.multi(ZooKeeper.java:1737)
	at org.apache.zookeeper.test.MultiTransactionTest.multi(MultiTransactionTest.java:118)
	at org.apache.zookeeper.test.MultiTransactionTest.testNoWatchesTriggeredForFailedMultiRequest(MultiTransactionTest.java:702)
	at org.apache.zookeeper.JUnit4ZKTestRunner$LoggedInvokeMethod.evaluate(JUnit4ZKTestRunner.java:79)


FAILED:  org.apache.zookeeper.test.MultiTransactionTest.testChRootCreateDelete[0]

Error Message:
KeeperErrorCode = ConnectionLoss

Stack Trace:
org.apache.zookeeper.KeeperException$ConnectionLossException: KeeperErrorCode = ConnectionLoss
	at org.apache.zookeeper.KeeperException.create(KeeperException.java:99)
	at org.apache.zookeeper.ZooKeeper.multiInternal(ZooKeeper.java:1818)
	at org.apache.zookeeper.ZooKeeper.multi(ZooKeeper.java:1737)
	at org.apache.zookeeper.test.MultiTransactionTest.multi(MultiTransactionTest.java:118)
	at org.apache.zookeeper.test.MultiTransactionTest.createNameSpace(MultiTransactionTest.java:451)
	at org.apache.zookeeper.test.MultiTransactionTest.testChRootCreateDelete(MultiTransactionTest.java:346)
	at org.apache.zookeeper.JUnit4ZKTestRunner$LoggedInvokeMethod.evaluate(JUnit4ZKTestRunner.java:79)


FAILED:  org.apache.zookeeper.test.MultiTransactionTest.testChRootCheck[0]

Error Message:
KeeperErrorCode = ConnectionLoss

Stack Trace:
org.apache.zookeeper.KeeperException$ConnectionLossException: KeeperErrorCode = ConnectionLoss
	at org.apache.zookeeper.KeeperException.create(KeeperException.java:99)
	at org.apache.zookeeper.ZooKeeper.multiInternal(ZooKeeper.java:1818)
	at org.apache.zookeeper.ZooKeeper.multi(ZooKeeper.java:1737)
	at org.apache.zookeeper.test.MultiTransactionTest.multi(MultiTransactionTest.java:118)
	at org.apache.zookeeper.test.MultiTransactionTest.createNameSpace(MultiTransactionTest.java:451)
	at org.apache.zookeeper.test.MultiTransactionTest.testChRootCheck(MultiTransactionTest.java:395)
	at org.apache.zookeeper.JUnit4ZKTestRunner$LoggedInvokeMethod.evaluate(JUnit4ZKTestRunner.java:79)


FAILED:  org.apache.zookeeper.test.MultiTransactionTest.testWatchesTriggered[0]

Error Message:
KeeperErrorCode = ConnectionLoss

Stack Trace:
org.apache.zookeeper.KeeperException$ConnectionLossException: KeeperErrorCode = ConnectionLoss
	at org.apache.zookeeper.KeeperException.create(KeeperException.java:99)
	at org.apache.zookeeper.ZooKeeper.multiInternal(ZooKeeper.java:1818)
	at org.apache.zookeeper.ZooKeeper.multi(ZooKeeper.java:1737)
	at org.apache.zookeeper.test.MultiTransactionTest.multi(MultiTransactionTest.java:118)
	at org.apache.zookeeper.test.MultiTransactionTest.testWatchesTriggered(MultiTransactionTest.java:690)
	at org.apache.zookeeper.JUnit4ZKTestRunner$LoggedInvokeMethod.evaluate(JUnit4ZKTestRunner.java:79)


FAILED:  org.apache.zookeeper.test.MultiTransactionTest.testCreate[0]

Error Message:
KeeperErrorCode = ConnectionLoss

Stack Trace:
org.apache.zookeeper.KeeperException$ConnectionLossException: KeeperErrorCode = ConnectionLoss
	at org.apache.zookeeper.KeeperException.create(KeeperException.java:99)
	at org.apache.zookeeper.ZooKeeper.multiInternal(ZooKeeper.java:1818)
	at org.apache.zookeeper.ZooKeeper.multi(ZooKeeper.java:1737)
	at org.apache.zookeeper.test.MultiTransactionTest.multi(MultiTransactionTest.java:118)
	at org.apache.zookeeper.test.MultiTransactionTest.testCreate(MultiTransactionTest.java:458)
	at org.apache.zookeeper.JUnit4ZKTestRunner$LoggedInvokeMethod.evaluate(JUnit4ZKTestRunner.java:79)


FAILED:  org.apache.zookeeper.test.MultiTransactionTest.testNestedCreate[0]

Error Message:
KeeperErrorCode = ConnectionLoss

Stack Trace:
org.apache.zookeeper.KeeperException$ConnectionLossException: KeeperErrorCode = ConnectionLoss
	at org.apache.zookeeper.KeeperException.create(KeeperException.java:99)
	at org.apache.zookeeper.ZooKeeper.multiInternal(ZooKeeper.java:1818)
	at org.apache.zookeeper.ZooKeeper.multi(ZooKeeper.java:1737)
	at org.apache.zookeeper.test.MultiTransactionTest.multi(MultiTransactionTest.java:118)
	at org.apache.zookeeper.test.MultiTransactionTest.testNestedCreate(MultiTransactionTest.java:497)
	at org.apache.zookeeper.JUnit4ZKTestRunner$LoggedInvokeMethod.evaluate(JUnit4ZKTestRunner.java:79)


FAILED:  org.apache.zookeeper.test.MultiTransactionTest.testGetResults[0]

Error Message:
KeeperErrorCode = ConnectionLoss for /multi

Stack Trace:
org.apache.zookeeper.KeeperException$ConnectionLossException: KeeperErrorCode = ConnectionLoss for /multi
	at org.apache.zookeeper.KeeperException.create(KeeperException.java:99)
	at org.apache.zookeeper.KeeperException.create(KeeperException.java:51)
	at org.apache.zookeeper.ZooKeeper.exists(ZooKeeper.java:1928)
	at org.apache.zookeeper.test.MultiTransactionTest.testGetResults(MultiTransactionTest.java:620)
	at org.apache.zookeeper.JUnit4ZKTestRunner$LoggedInvokeMethod.evaluate(JUnit4ZKTestRunner.java:79)


FAILED:  org.apache.zookeeper.test.MultiTransactionTest.testSetData[0]

Error Message:
KeeperErrorCode = ConnectionLoss

Stack Trace:
org.apache.zookeeper.KeeperException$ConnectionLossException: KeeperErrorCode = ConnectionLoss
	at org.apache.zookeeper.KeeperException.create(KeeperException.java:99)
	at org.apache.zookeeper.ZooKeeper.multiInternal(ZooKeeper.java:1818)
	at org.apache.zookeeper.ZooKeeper.multi(ZooKeeper.java:1737)
	at org.apache.zookeeper.test.MultiTransactionTest.multi(MultiTransactionTest.java:118)
	at org.apache.zookeeper.test.MultiTransactionTest.testSetData(MultiTransactionTest.java:526)
	at org.apache.zookeeper.JUnit4ZKTestRunner$LoggedInvokeMethod.evaluate(JUnit4ZKTestRunner.java:79)


FAILED:  org.apache.zookeeper.test.MultiTransactionTest.testCreateDelete[0]

Error Message:
KeeperErrorCode = ConnectionLoss

Stack Trace:
org.apache.zookeeper.KeeperException$ConnectionLossException: KeeperErrorCode = ConnectionLoss
	at org.apache.zookeeper.KeeperException.create(KeeperException.java:99)
	at org.apache.zookeeper.ZooKeeper.multiInternal(ZooKeeper.java:1818)
	at org.apache.zookeeper.ZooKeeper.multi(ZooKeeper.java:1737)
	at org.apache.zookeeper.test.MultiTransactionTest.multi(MultiTransactionTest.java:118)
	at org.apache.zookeeper.test.MultiTransactionTest.testCreateDelete(MultiTransactionTest.java:471)
	at org.apache.zookeeper.JUnit4ZKTestRunner$LoggedInvokeMethod.evaluate(JUnit4ZKTestRunner.java:79)


FAILED:  org.apache.zookeeper.test.MultiTransactionTest.testTransactionBuilder[1]

Error Message:
KeeperErrorCode = ConnectionLoss

Stack Trace:
org.apache.zookeeper.KeeperException$ConnectionLossException: KeeperErrorCode = ConnectionLoss
	at org.apache.zookeeper.KeeperException.create(KeeperException.java:99)
	at org.apache.zookeeper.test.MultiTransactionTest.commit(MultiTransactionTest.java:188)
	at org.apache.zookeeper.test.MultiTransactionTest.testTransactionBuilder(MultiTransactionTest.java:720)
	at org.apache.zookeeper.JUnit4ZKTestRunner$LoggedInvokeMethod.evaluate(JUnit4ZKTestRunner.java:79)


FAILED:  org.apache.zookeeper.test.MultiTransactionTest.testDeleteUpdateConflict[1]

Error Message:
KeeperErrorCode = ConnectionLoss for /multi

Stack Trace:
org.apache.zookeeper.KeeperException$ConnectionLossException: KeeperErrorCode = ConnectionLoss for /multi
	at org.apache.zookeeper.KeeperException.create(KeeperException.java:99)
	at org.apache.zookeeper.KeeperException.create(KeeperException.java:51)
	at org.apache.zookeeper.ZooKeeper.exists(ZooKeeper.java:1928)
	at org.apache.zookeeper.test.MultiTransactionTest.testDeleteUpdateConflict(MultiTransactionTest.java:578)
	at org.apache.zookeeper.JUnit4ZKTestRunner$LoggedInvokeMethod.evaluate(JUnit4ZKTestRunner.java:79)


FAILED:  org.apache.zookeeper.test.MultiTransactionTest.testChRootSetData[1]

Error Message:
KeeperErrorCode = ConnectionLoss

Stack Trace:
org.apache.zookeeper.KeeperException$ConnectionLossException: KeeperErrorCode = ConnectionLoss
	at org.apache.zookeeper.KeeperException.create(KeeperException.java:99)
	at org.apache.zookeeper.test.MultiTransactionTest.multi(MultiTransactionTest.java:113)
	at org.apache.zookeeper.test.MultiTransactionTest.createNameSpace(MultiTransactionTest.java:451)
	at org.apache.zookeeper.test.MultiTransactionTest.testChRootSetData(MultiTransactionTest.java:372)
	at org.apache.zookeeper.JUnit4ZKTestRunner$LoggedInvokeMethod.evaluate(JUnit4ZKTestRunner.java:79)


FAILED:  org.apache.zookeeper.test.MultiTransactionTest.testUpdateConflict[1]

Error Message:
KeeperErrorCode = ConnectionLoss for /multi

Stack Trace:
org.apache.zookeeper.KeeperException$ConnectionLossException: KeeperErrorCode = ConnectionLoss for /multi
	at org.apache.zookeeper.KeeperException.create(KeeperException.java:99)
	at org.apache.zookeeper.KeeperException.create(KeeperException.java:51)
	at org.apache.zookeeper.ZooKeeper.exists(ZooKeeper.java:1928)
	at org.apache.zookeeper.test.MultiTransactionTest.testUpdateConflict(MultiTransactionTest.java:550)
	at org.apache.zookeeper.JUnit4ZKTestRunner$LoggedInvokeMethod.evaluate(JUnit4ZKTestRunner.java:79)


FAILED:  org.apache.zookeeper.test.MultiTransactionTest.testMultiRollback[1]

Error Message:
KeeperErrorCode = ConnectionLoss for /foo

Stack Trace:
org.apache.zookeeper.KeeperException$ConnectionLossException: KeeperErrorCode = ConnectionLoss for /foo
	at org.apache.zookeeper.KeeperException.create(KeeperException.java:99)
	at org.apache.zookeeper.KeeperException.create(KeeperException.java:51)
	at org.apache.zookeeper.ZooKeeper.create(ZooKeeper.java:1445)
	at org.apache.zookeeper.test.MultiTransactionTest.testMultiRollback(MultiTransactionTest.java:258)
	at org.apache.zookeeper.JUnit4ZKTestRunner$LoggedInvokeMethod.evaluate(JUnit4ZKTestRunner.java:79)


FAILED:  org.apache.zookeeper.test.MultiTransactionTest.testChRootTransaction[1]

Error Message:
KeeperErrorCode = ConnectionLoss

Stack Trace:
org.apache.zookeeper.KeeperException$ConnectionLossException: KeeperErrorCode = ConnectionLoss
	at org.apache.zookeeper.KeeperException.create(KeeperException.java:99)
	at org.apache.zookeeper.test.MultiTransactionTest.multi(MultiTransactionTest.java:113)
	at org.apache.zookeeper.test.MultiTransactionTest.createNameSpace(MultiTransactionTest.java:451)
	at org.apache.zookeeper.test.MultiTransactionTest.testChRootTransaction(MultiTransactionTest.java:414)
	at org.apache.zookeeper.JUnit4ZKTestRunner$LoggedInvokeMethod.evaluate(JUnit4ZKTestRunner.java:79)


FAILED:  org.apache.zookeeper.test.MultiTransactionTest.testNoWatchesTriggeredForFailedMultiRequest[1]

Error Message:
KeeperErrorCode = ConnectionLoss

Stack Trace:
org.apache.zookeeper.KeeperException$ConnectionLossException: KeeperErrorCode = ConnectionLoss
	at org.apache.zookeeper.KeeperException.create(KeeperException.java:99)
	at org.apache.zookeeper.test.MultiTransactionTest.multi(MultiTransactionTest.java:113)
	at org.apache.zookeeper.test.MultiTransactionTest.testNoWatchesTriggeredForFailedMultiRequest(MultiTransactionTest.java:702)
	at org.apache.zookeeper.JUnit4ZKTestRunner$LoggedInvokeMethod.evaluate(JUnit4ZKTestRunner.java:79)


FAILED:  org.apache.zookeeper.test.MultiTransactionTest.testChRootCreateDelete[1]

Error Message:
KeeperErrorCode = ConnectionLoss

Stack Trace:
org.apache.zookeeper.KeeperException$ConnectionLossException: KeeperErrorCode = ConnectionLoss
	at org.apache.zookeeper.KeeperException.create(KeeperException.java:99)
	at org.apache.zookeeper.test.MultiTransactionTest.multi(MultiTransactionTest.java:113)
	at org.apache.zookeeper.test.MultiTransactionTest.createNameSpace(MultiTransactionTest.java:451)
	at org.apache.zookeeper.test.MultiTransactionTest.testChRootCreateDelete(MultiTransactionTest.java:346)
	at org.apache.zookeeper.JUnit4ZKTestRunner$LoggedInvokeMethod.evaluate(JUnit4ZKTestRunner.java:79)


FAILED:  org.apache.zookeeper.test.MultiTransactionTest.testChRootCheck[1]

Error Message:
KeeperErrorCode = ConnectionLoss

Stack Trace:
org.apache.zookeeper.KeeperException$ConnectionLossException: KeeperErrorCode = ConnectionLoss
	at org.apache.zookeeper.KeeperException.create(KeeperException.java:99)
	at org.apache.zookeeper.test.MultiTransactionTest.multi(MultiTransactionTest.java:113)
	at org.apache.zookeeper.test.MultiTransactionTest.createNameSpace(MultiTransactionTest.java:451)
	at org.apache.zookeeper.test.MultiTransactionTest.testChRootCheck(MultiTransactionTest.java:395)
	at org.apache.zookeeper.JUnit4ZKTestRunner$LoggedInvokeMethod.evaluate(JUnit4ZKTestRunner.java:79)


FAILED:  org.apache.zookeeper.test.MultiTransactionTest.testWatchesTriggered[1]

Error Message:
KeeperErrorCode = ConnectionLoss

Stack Trace:
org.apache.zookeeper.KeeperException$ConnectionLossException: KeeperErrorCode = ConnectionLoss
	at org.apache.zookeeper.KeeperException.create(KeeperException.java:99)
	at org.apache.zookeeper.test.MultiTransactionTest.multi(MultiTransactionTest.java:113)
	at org.apache.zookeeper.test.MultiTransactionTest.testWatchesTriggered(MultiTransactionTest.java:690)
	at org.apache.zookeeper.JUnit4ZKTestRunner$LoggedInvokeMethod.evaluate(JUnit4ZKTestRunner.java:79)


FAILED:  org.apache.zookeeper.test.MultiTransactionTest.testCreate[1]

Error Message:
KeeperErrorCode = ConnectionLoss

Stack Trace:
org.apache.zookeeper.KeeperException$ConnectionLossException: KeeperErrorCode = ConnectionLoss
	at org.apache.zookeeper.KeeperException.create(KeeperException.java:99)
	at org.apache.zookeeper.test.MultiTransactionTest.multi(MultiTransactionTest.java:113)
	at org.apache.zookeeper.test.MultiTransactionTest.testCreate(MultiTransactionTest.java:458)
	at org.apache.zookeeper.JUnit4ZKTestRunner$LoggedInvokeMethod.evaluate(JUnit4ZKTestRunner.java:79)


FAILED:  org.apache.zookeeper.test.MultiTransactionTest.testNestedCreate[1]

Error Message:
KeeperErrorCode = ConnectionLoss

Stack Trace:
org.apache.zookeeper.KeeperException$ConnectionLossException: KeeperErrorCode = ConnectionLoss
	at org.apache.zookeeper.KeeperException.create(KeeperException.java:99)
	at org.apache.zookeeper.test.MultiTransactionTest.multi(MultiTransactionTest.java:113)
	at org.apache.zookeeper.test.MultiTransactionTest.testNestedCreate(MultiTransactionTest.java:497)
	at org.apache.zookeeper.JUnit4ZKTestRunner$LoggedInvokeMethod.evaluate(JUnit4ZKTestRunner.java:79)


FAILED:  org.apache.zookeeper.test.MultiTransactionTest.testGetResults[1]

Error Message:
KeeperErrorCode = ConnectionLoss for /multi

Stack Trace:
org.apache.zookeeper.KeeperException$ConnectionLossException: KeeperErrorCode = ConnectionLoss for /multi
	at org.apache.zookeeper.KeeperException.create(KeeperException.java:99)
	at org.apache.zookeeper.KeeperException.create(KeeperException.java:51)
	at org.apache.zookeeper.ZooKeeper.exists(ZooKeeper.java:1928)
	at org.apache.zookeeper.test.MultiTransactionTest.testGetResults(MultiTransactionTest.java:612)
	at org.apache.zookeeper.JUnit4ZKTestRunner$LoggedInvokeMethod.evaluate(JUnit4ZKTestRunner.java:79)


FAILED:  org.apache.zookeeper.test.MultiTransactionTest.testSetData[1]

Error Message:
KeeperErrorCode = ConnectionLoss

Stack Trace:
org.apache.zookeeper.KeeperException$ConnectionLossException: KeeperErrorCode = ConnectionLoss
	at org.apache.zookeeper.KeeperException.create(KeeperException.java:99)
	at org.apache.zookeeper.test.MultiTransactionTest.multi(MultiTransactionTest.java:113)
	at org.apache.zookeeper.test.MultiTransactionTest.testSetData(MultiTransactionTest.java:526)
	at org.apache.zookeeper.JUnit4ZKTestRunner$LoggedInvokeMethod.evaluate(JUnit4ZKTestRunner.java:79)


FAILED:  org.apache.zookeeper.test.MultiTransactionTest.testCreateDelete[1]

Error Message:
KeeperErrorCode = ConnectionLoss

Stack Trace:
org.apache.zookeeper.KeeperException$ConnectionLossException: KeeperErrorCode = ConnectionLoss
	at org.apache.zookeeper.KeeperException.create(KeeperException.java:99)
	at org.apache.zookeeper.test.MultiTransactionTest.multi(MultiTransactionTest.java:113)
	at org.apache.zookeeper.test.MultiTransactionTest.testCreateDelete(MultiTransactionTest.java:471)
	at org.apache.zookeeper.JUnit4ZKTestRunner$LoggedInvokeMethod.evaluate(JUnit4ZKTestRunner.java:79)


FAILED:  org.apache.zookeeper.test.AsyncHammerTest.testHammer

Error Message:
null

Stack Trace:
junit.framework.AssertionFailedError
	at org.apache.zookeeper.test.AsyncHammerTest.testHammer(AsyncHammerTest.java:185)
	at org.apache.zookeeper.JUnit4ZKTestRunner$LoggedInvokeMethod.evaluate(JUnit4ZKTestRunner.java:79)


FAILED:  org.apache.zookeeper.test.NonRecoverableErrorTest.testZooKeeperServiceAvailableOnLeader

Error Message:
KeeperErrorCode = ConnectionLoss for /noLeaderIssue

Stack Trace:
org.apache.zookeeper.KeeperException$ConnectionLossException: KeeperErrorCode = ConnectionLoss for /noLeaderIssue
	at org.apache.zookeeper.KeeperException.create(KeeperException.java:99)
	at org.apache.zookeeper.KeeperException.create(KeeperException.java:51)
	at org.apache.zookeeper.ZooKeeper.create(ZooKeeper.java:1445)
	at org.apache.zookeeper.test.NonRecoverableErrorTest.testZooKeeperServiceAvailableOnLeader(NonRecoverableErrorTest.java:88)
	at org.apache.zookeeper.JUnit4ZKTestRunner$LoggedInvokeMethod.evaluate(JUnit4ZKTestRunner.java:79)
	at java.util.concurrent.FutureTask.run(FutureTask.java:262)
	at java.lang.Thread.run(Thread.java:745)


FAILED:  org.apache.zookeeper.test.NullDataTest.testNullData

Error Message:
KeeperErrorCode = ConnectionLoss for /SIZE

Stack Trace:
org.apache.zookeeper.KeeperException$ConnectionLossException: KeeperErrorCode = ConnectionLoss for /SIZE
	at org.apache.zookeeper.KeeperException.create(KeeperException.java:99)
	at org.apache.zookeeper.KeeperException.create(KeeperException.java:51)
	at org.apache.zookeeper.ZooKeeper.create(ZooKeeper.java:1445)
	at org.apache.zookeeper.test.NullDataTest.testNullData(NullDataTest.java:59)
	at org.apache.zookeeper.JUnit4ZKTestRunner$LoggedInvokeMethod.evaluate(JUnit4ZKTestRunner.java:79)


FAILED:  org.apache.zookeeper.test.ObserverHierarchicalQuorumTest.testHierarchicalQuorum

Error Message:
KeeperErrorCode = ConnectionLoss for /test-0

Stack Trace:
org.apache.zookeeper.KeeperException$ConnectionLossException: KeeperErrorCode = ConnectionLoss for /test-0
	at org.apache.zookeeper.KeeperException.create(KeeperException.java:99)
	at org.apache.zookeeper.KeeperException.create(KeeperException.java:51)
	at org.apache.zookeeper.ZooKeeper.create(ZooKeeper.java:1445)
	at org.apache.zookeeper.test.ClientHammerTest.runHammer(ClientHammerTest.java:132)
	at org.apache.zookeeper.test.ObserverHierarchicalQuorumTest.testHierarchicalQuorum(ObserverHierarchicalQuorumTest.java:37)
	at org.apache.zookeeper.JUnit4ZKTestRunner$LoggedInvokeMethod.evaluate(JUnit4ZKTestRunner.java:79)


FAILED:  org.apache.zookeeper.test.ObserverQuorumHammerTest.testHammerBasic

Error Message:
KeeperErrorCode = ConnectionLoss for /test-0

Stack Trace:
org.apache.zookeeper.KeeperException$ConnectionLossException: KeeperErrorCode = ConnectionLoss for /test-0
	at org.apache.zookeeper.KeeperException.create(KeeperException.java:99)
	at org.apache.zookeeper.KeeperException.create(KeeperException.java:51)
	at org.apache.zookeeper.ZooKeeper.create(ZooKeeper.java:1445)
	at org.apache.zookeeper.test.ClientHammerTest.runHammer(ClientHammerTest.java:132)
	at org.apache.zookeeper.test.ClientHammerTest.testHammerBasic(ClientHammerTest.java:120)
	at org.apache.zookeeper.test.ObserverQuorumHammerTest.testHammerBasic(ObserverQuorumHammerTest.java:37)
	at org.apache.zookeeper.JUnit4ZKTestRunner$LoggedInvokeMethod.evaluate(JUnit4ZKTestRunner.java:79)


FAILED:  org.apache.zookeeper.test.ObserverTest.testObserver

Error Message:
KeeperErrorCode = ConnectionLoss for /obstest

Stack Trace:
org.apache.zookeeper.KeeperException$ConnectionLossException: KeeperErrorCode = ConnectionLoss for /obstest
	at org.apache.zookeeper.KeeperException.create(KeeperException.java:99)
	at org.apache.zookeeper.KeeperException.create(KeeperException.java:51)
	at org.apache.zookeeper.ZooKeeper.create(ZooKeeper.java:1445)
	at org.apache.zookeeper.test.ObserverTest.testObserver(ObserverTest.java:100)
	at org.apache.zookeeper.JUnit4ZKTestRunner$LoggedInvokeMethod.evaluate(JUnit4ZKTestRunner.java:79)


FAILED:  org.apache.zookeeper.test.QuorumHammerTest.testHammerBasic

Error Message:
KeeperErrorCode = ConnectionLoss for /test-0

Stack Trace:
org.apache.zookeeper.KeeperException$ConnectionLossException: KeeperErrorCode = ConnectionLoss for /test-0
	at org.apache.zookeeper.KeeperException.create(KeeperException.java:99)
	at org.apache.zookeeper.KeeperException.create(KeeperException.java:51)
	at org.apache.zookeeper.ZooKeeper.create(ZooKeeper.java:1445)
	at org.apache.zookeeper.test.ClientHammerTest.runHammer(ClientHammerTest.java:132)
	at org.apache.zookeeper.test.ClientHammerTest.testHammerBasic(ClientHammerTest.java:120)
	at org.apache.zookeeper.test.QuorumHammerTest.testHammerBasic(QuorumHammerTest.java:49)
	at org.apache.zookeeper.JUnit4ZKTestRunner$LoggedInvokeMethod.evaluate(JUnit4ZKTestRunner.java:79)


FAILED:  org.apache.zookeeper.test.QuorumQuotaTest.testQuotaWithQuorum

Error Message:
KeeperErrorCode = ConnectionLoss for /

Stack Trace:
org.apache.zookeeper.KeeperException$ConnectionLossException: KeeperErrorCode = ConnectionLoss for /
	at org.apache.zookeeper.KeeperException.create(KeeperException.java:99)
	at org.apache.zookeeper.KeeperException.create(KeeperException.java:51)
	at org.apache.zookeeper.ZooKeeper.setData(ZooKeeper.java:2256)
	at org.apache.zookeeper.test.QuorumQuotaTest.testQuotaWithQuorum(QuorumQuotaTest.java:36)
	at org.apache.zookeeper.JUnit4ZKTestRunner$LoggedInvokeMethod.evaluate(JUnit4ZKTestRunner.java:79)


FAILED:  org.apache.zookeeper.test.QuorumTest.testLeaderShutdown

Error Message:
KeeperErrorCode = ConnectionLoss for /blah

Stack Trace:
org.apache.zookeeper.KeeperException$ConnectionLossException: KeeperErrorCode = ConnectionLoss for /blah
	at org.apache.zookeeper.KeeperException.create(KeeperException.java:99)
	at org.apache.zookeeper.KeeperException.create(KeeperException.java:51)
	at org.apache.zookeeper.ZooKeeper.create(ZooKeeper.java:1445)
	at org.apache.zookeeper.test.QuorumTest.testLeaderShutdown(QuorumTest.java:138)
	at org.apache.zookeeper.JUnit4ZKTestRunner$LoggedInvokeMethod.evaluate(JUnit4ZKTestRunner.java:79)


FAILED:  org.apache.zookeeper.test.QuorumTest.testACLs

Error Message:
KeeperErrorCode = ConnectionLoss for /acltest

Stack Trace:
org.apache.zookeeper.KeeperException$ConnectionLossException: KeeperErrorCode = ConnectionLoss for /acltest
	at org.apache.zookeeper.KeeperException.create(KeeperException.java:99)
	at org.apache.zookeeper.KeeperException.create(KeeperException.java:51)
	at org.apache.zookeeper.ZooKeeper.create(ZooKeeper.java:1445)
	at org.apache.zookeeper.test.ClientTest.testACLs(ClientTest.java:130)
	at org.apache.zookeeper.test.QuorumTest.testACLs(QuorumTest.java:93)
	at org.apache.zookeeper.JUnit4ZKTestRunner$LoggedInvokeMethod.evaluate(JUnit4ZKTestRunner.java:79)


FAILED:  org.apache.zookeeper.test.QuorumTest.testPing

Error Message:
Unable to connect to server

Stack Trace:
junit.framework.AssertionFailedError: Unable to connect to server
	at org.apache.zookeeper.test.ClientBase.createClient(ClientBase.java:231)
	at org.apache.zookeeper.test.ClientBase.createClient(ClientBase.java:220)
	at org.apache.zookeeper.test.ClientBase.createClient(ClientBase.java:205)
	at org.apache.zookeeper.test.ClientBase.createClient(ClientBase.java:198)
	at org.apache.zookeeper.test.ClientTest.testPing(ClientTest.java:69)
	at org.apache.zookeeper.test.QuorumTest.testPing(QuorumTest.java:81)
	at org.apache.zookeeper.JUnit4ZKTestRunner$LoggedInvokeMethod.evaluate(JUnit4ZKTestRunner.java:79)


FAILED:  org.apache.zookeeper.test.QuorumTest.testNoLogBeforeLeaderEstablishment

Error Message:
KeeperErrorCode = ConnectionLoss for /blah

Stack Trace:
org.apache.zookeeper.KeeperException$ConnectionLossException: KeeperErrorCode = ConnectionLoss for /blah
	at org.apache.zookeeper.KeeperException.create(KeeperException.java:99)
	at org.apache.zookeeper.KeeperException.create(KeeperException.java:51)
	at org.apache.zookeeper.ZooKeeper.create(ZooKeeper.java:1445)
	at org.apache.zookeeper.test.QuorumTest.testNoLogBeforeLeaderEstablishment(QuorumTest.java:378)
	at org.apache.zookeeper.JUnit4ZKTestRunner$LoggedInvokeMethod.evaluate(JUnit4ZKTestRunner.java:79)


FAILED:  org.apache.zookeeper.test.QuorumTest.testClientwithoutWatcherObj

Error Message:
KeeperErrorCode = ConnectionLoss for /benwashere

Stack Trace:
org.apache.zookeeper.KeeperException$ConnectionLossException: KeeperErrorCode = ConnectionLoss for /benwashere
	at org.apache.zookeeper.KeeperException.create(KeeperException.java:99)
	at org.apache.zookeeper.KeeperException.create(KeeperException.java:51)
	at org.apache.zookeeper.ZooKeeper.create(ZooKeeper.java:1445)
	at org.apache.zookeeper.test.ClientTest.performClientTest(ClientTest.java:384)
	at org.apache.zookeeper.test.ClientTest.testClientwithoutWatcherObj(ClientTest.java:98)
	at org.apache.zookeeper.test.QuorumTest.testClientwithoutWatcherObj(QuorumTest.java:100)
	at org.apache.zookeeper.JUnit4ZKTestRunner$LoggedInvokeMethod.evaluate(JUnit4ZKTestRunner.java:79)


FAILED:  org.apache.zookeeper.test.QuorumTest.testSequentialNodeNames

Error Message:
KeeperErrorCode = ConnectionLoss for /SEQUENCE

Stack Trace:
org.apache.zookeeper.KeeperException$ConnectionLossException: KeeperErrorCode = ConnectionLoss for /SEQUENCE
	at org.apache.zookeeper.KeeperException.create(KeeperException.java:99)
	at org.apache.zookeeper.KeeperException.create(KeeperException.java:51)
	at org.apache.zookeeper.ZooKeeper.create(ZooKeeper.java:1445)
	at org.apache.zookeeper.test.ClientTest.testSequentialNodeNames(ClientTest.java:523)
	at org.apache.zookeeper.test.QuorumTest.testSequentialNodeNames(QuorumTest.java:88)
	at org.apache.zookeeper.JUnit4ZKTestRunner$LoggedInvokeMethod.evaluate(JUnit4ZKTestRunner.java:79)


FAILED:  org.apache.zookeeper.test.QuorumTest.testSessionMoved

Error Message:
KeeperErrorCode = ConnectionLoss for /sessionMoveTest

Stack Trace:
org.apache.zookeeper.KeeperException$ConnectionLossException: KeeperErrorCode = ConnectionLoss for /sessionMoveTest
	at org.apache.zookeeper.KeeperException.create(KeeperException.java:99)
	at org.apache.zookeeper.KeeperException.create(KeeperException.java:51)
	at org.apache.zookeeper.ZooKeeper.create(ZooKeeper.java:1445)
	at org.apache.zookeeper.test.QuorumTest.testSessionMoved(QuorumTest.java:202)
	at org.apache.zookeeper.JUnit4ZKTestRunner$LoggedInvokeMethod.evaluate(JUnit4ZKTestRunner.java:79)


FAILED:  org.apache.zookeeper.test.QuorumTest.testClientWithWatcherObj

Error Message:
KeeperErrorCode = ConnectionLoss for /benwashere

Stack Trace:
org.apache.zookeeper.KeeperException$ConnectionLossException: KeeperErrorCode = ConnectionLoss for /benwashere
	at org.apache.zookeeper.KeeperException.create(KeeperException.java:99)
	at org.apache.zookeeper.KeeperException.create(KeeperException.java:51)
	at org.apache.zookeeper.ZooKeeper.create(ZooKeeper.java:1445)
	at org.apache.zookeeper.test.ClientTest.performClientTest(ClientTest.java:384)
	at org.apache.zookeeper.test.ClientTest.testClientWithWatcherObj(ClientTest.java:105)
	at org.apache.zookeeper.test.QuorumTest.testClientWithWatcherObj(QuorumTest.java:107)
	at org.apache.zookeeper.JUnit4ZKTestRunner$LoggedInvokeMethod.evaluate(JUnit4ZKTestRunner.java:79)


FAILED:  org.apache.zookeeper.test.QuorumTest.testMultiToFollower

Error Message:
KeeperErrorCode = ConnectionLoss

Stack Trace:
org.apache.zookeeper.KeeperException$ConnectionLossException: KeeperErrorCode = ConnectionLoss
	at org.apache.zookeeper.KeeperException.create(KeeperException.java:99)
	at org.apache.zookeeper.ZooKeeper.multiInternal(ZooKeeper.java:1818)
	at org.apache.zookeeper.ZooKeeper.multi(ZooKeeper.java:1737)
	at org.apache.zookeeper.test.QuorumTest.testMultiToFollower(QuorumTest.java:446)
	at org.apache.zookeeper.JUnit4ZKTestRunner$LoggedInvokeMethod.evaluate(JUnit4ZKTestRunner.java:79)


FAILED:  org.apache.zookeeper.test.QuorumTest.testDeleteWithChildren

Error Message:
KeeperErrorCode = ConnectionLoss for /parent

Stack Trace:
org.apache.zookeeper.KeeperException$ConnectionLossException: KeeperErrorCode = ConnectionLoss for /parent
	at org.apache.zookeeper.KeeperException.create(KeeperException.java:99)
	at org.apache.zookeeper.KeeperException.create(KeeperException.java:51)
	at org.apache.zookeeper.ZooKeeper.create(ZooKeeper.java:1445)
	at org.apache.zookeeper.test.ClientTest.testDeleteWithChildren(ClientTest.java:736)
	at org.apache.zookeeper.test.QuorumTest.testDeleteWithChildren(QuorumTest.java:76)
	at org.apache.zookeeper.JUnit4ZKTestRunner$LoggedInvokeMethod.evaluate(JUnit4ZKTestRunner.java:79)


FAILED:  org.apache.zookeeper.test.QuorumTest.testMultipleWatcherObjs

Error Message:
KeeperErrorCode = ConnectionLoss for /foo-0

Stack Trace:
org.apache.zookeeper.KeeperException$ConnectionLossException: KeeperErrorCode = ConnectionLoss for /foo-0
	at org.apache.zookeeper.KeeperException.create(KeeperException.java:99)
	at org.apache.zookeeper.KeeperException.create(KeeperException.java:51)
	at org.apache.zookeeper.ZooKeeper.create(ZooKeeper.java:1445)
	at org.apache.zookeeper.test.ClientTest.testMutipleWatcherObjs(ClientTest.java:273)
	at org.apache.zookeeper.test.QuorumTest.testMultipleWatcherObjs(QuorumTest.java:184)
	at org.apache.zookeeper.JUnit4ZKTestRunner$LoggedInvokeMethod.evaluate(JUnit4ZKTestRunner.java:79)


FAILED:  org.apache.zookeeper.test.QuorumZxidSyncTest.testBehindLeader

Error Message:
KeeperErrorCode = ConnectionLoss for /0

Stack Trace:
org.apache.zookeeper.KeeperException$ConnectionLossException: KeeperErrorCode = ConnectionLoss for /0
	at org.apache.zookeeper.KeeperException.create(KeeperException.java:99)
	at org.apache.zookeeper.KeeperException.create(KeeperException.java:51)
	at org.apache.zookeeper.ZooKeeper.create(ZooKeeper.java:1445)
	at org.apache.zookeeper.test.QuorumZxidSyncTest.testBehindLeader(QuorumZxidSyncTest.java:54)
	at org.apache.zookeeper.JUnit4ZKTestRunner$LoggedInvokeMethod.evaluate(JUnit4ZKTestRunner.java:79)


FAILED:  org.apache.zookeeper.test.QuorumZxidSyncTest.testLateLogs

Error Message:
KeeperErrorCode = ConnectionLoss for /0

Stack Trace:
org.apache.zookeeper.KeeperException$ConnectionLossException: KeeperErrorCode = ConnectionLoss for /0
	at org.apache.zookeeper.KeeperException.create(KeeperException.java:99)
	at org.apache.zookeeper.KeeperException.create(KeeperException.java:51)
	at org.apache.zookeeper.ZooKeeper.create(ZooKeeper.java:1445)
	at org.apache.zookeeper.test.QuorumZxidSyncTest.testLateLogs(QuorumZxidSyncTest.java:115)
	at org.apache.zookeeper.JUnit4ZKTestRunner$LoggedInvokeMethod.evaluate(JUnit4ZKTestRunner.java:79)


FAILED:  org.apache.zookeeper.test.ReadOnlyModeTest.testSessionEstablishment

Error Message:
KeeperErrorCode = ConnectionLoss for /test

Stack Trace:
org.apache.zookeeper.KeeperException$ConnectionLossException: KeeperErrorCode = ConnectionLoss for /test
	at org.apache.zookeeper.KeeperException.create(KeeperException.java:99)
	at org.apache.zookeeper.KeeperException.create(KeeperException.java:51)
	at org.apache.zookeeper.ZooKeeper.create(ZooKeeper.java:1445)
	at org.apache.zookeeper.test.ReadOnlyModeTest.testSessionEstablishment(ReadOnlyModeTest.java:243)
	at org.apache.zookeeper.JUnit4ZKTestRunner$LoggedInvokeMethod.evaluate(JUnit4ZKTestRunner.java:79)
	at java.util.concurrent.FutureTask.run(FutureTask.java:262)
	at java.lang.Thread.run(Thread.java:745)


FAILED:  org.apache.zookeeper.test.ReadOnlyModeTest.testSeekForRwServer

Error Message:
KeeperErrorCode = ConnectionLoss for /test

Stack Trace:
org.apache.zookeeper.KeeperException$ConnectionLossException: KeeperErrorCode = ConnectionLoss for /test
	at org.apache.zookeeper.KeeperException.create(KeeperException.java:99)
	at org.apache.zookeeper.KeeperException.create(KeeperException.java:51)
	at org.apache.zookeeper.ZooKeeper.create(ZooKeeper.java:1445)
	at org.apache.zookeeper.test.ReadOnlyModeTest.testSeekForRwServer(ReadOnlyModeTest.java:284)
	at org.apache.zookeeper.JUnit4ZKTestRunner$LoggedInvokeMethod.evaluate(JUnit4ZKTestRunner.java:79)
	at java.util.concurrent.FutureTask.run(FutureTask.java:262)
	at java.lang.Thread.run(Thread.java:745)


FAILED:  org.apache.zookeeper.test.ReadOnlyModeTest.testReadOnlyClient

Error Message:
KeeperErrorCode = ConnectionLoss for /tnode

Stack Trace:
org.apache.zookeeper.KeeperException$ConnectionLossException: KeeperErrorCode = ConnectionLoss for /tnode
	at org.apache.zookeeper.KeeperException.create(KeeperException.java:99)
	at org.apache.zookeeper.KeeperException.create(KeeperException.java:51)
	at org.apache.zookeeper.ZooKeeper.create(ZooKeeper.java:1445)
	at org.apache.zookeeper.test.ReadOnlyModeTest.testReadOnlyClient(ReadOnlyModeTest.java:125)
	at org.apache.zookeeper.JUnit4ZKTestRunner$LoggedInvokeMethod.evaluate(JUnit4ZKTestRunner.java:79)
	at java.util.concurrent.FutureTask.run(FutureTask.java:262)
	at java.lang.Thread.run(Thread.java:745)


FAILED:  org.apache.zookeeper.test.ReadOnlyModeTest.testConnectionEvents

Error Message:
Did not succeed in connecting in 30s

Stack Trace:
junit.framework.AssertionFailedError: Did not succeed in connecting in 30s
	at org.apache.zookeeper.test.ReadOnlyModeTest.testConnectionEvents(ReadOnlyModeTest.java:186)
	at org.apache.zookeeper.JUnit4ZKTestRunner$LoggedInvokeMethod.evaluate(JUnit4ZKTestRunner.java:79)
	at java.util.concurrent.FutureTask.run(FutureTask.java:262)
	at java.lang.Thread.run(Thread.java:745)


FAILED:  org.apache.zookeeper.test.ReadOnlyModeTest.testMultiTransaction

Error Message:
KeeperErrorCode = ConnectionLoss for /tnode1

Stack Trace:
org.apache.zookeeper.KeeperException$ConnectionLossException: KeeperErrorCode = ConnectionLoss for /tnode1
	at org.apache.zookeeper.KeeperException.create(KeeperException.java:99)
	at org.apache.zookeeper.KeeperException.create(KeeperException.java:51)
	at org.apache.zookeeper.ZooKeeper.create(ZooKeeper.java:1445)
	at org.apache.zookeeper.test.ReadOnlyModeTest.testMultiTransaction(ReadOnlyModeTest.java:83)
	at org.apache.zookeeper.JUnit4ZKTestRunner$LoggedInvokeMethod.evaluate(JUnit4ZKTestRunner.java:79)
	at java.util.concurrent.FutureTask.run(FutureTask.java:262)
	at java.lang.Thread.run(Thread.java:745)


FAILED:  org.apache.zookeeper.test.ReconfigExceptionTest.testReconfigFailWithAuthWithNoACL

Error Message:
test timed out after 10000 milliseconds

Stack Trace:
org.junit.runners.model.TestTimedOutException: test timed out after 10000 milliseconds
	at java.lang.Object.wait(Native Method)
	at org.apache.zookeeper.test.ClientBase$CountdownWatcher.waitForConnected(ClientBase.java:145)
	at org.apache.zookeeper.test.ReconfigExceptionTest.resetZKAdmin(ReconfigExceptionTest.java:201)
	at org.apache.zookeeper.test.ReconfigExceptionTest.testReconfigFailWithAuthWithNoACL(ReconfigExceptionTest.java:128)
	at org.apache.zookeeper.JUnit4ZKTestRunner$LoggedInvokeMethod.evaluate(JUnit4ZKTestRunner.java:79)
	at java.util.concurrent.FutureTask.run(FutureTask.java:262)
	at java.lang.Thread.run(Thread.java:745)


FAILED:  org.apache.zookeeper.test.ReconfigExceptionTest.testReconfigEnabledWithAuthAndWrongACL

Error Message:
test timed out after 10000 milliseconds

Stack Trace:
org.junit.runners.model.TestTimedOutException: test timed out after 10000 milliseconds
	at java.lang.Object.wait(Native Method)
	at org.apache.zookeeper.test.ClientBase$CountdownWatcher.waitForConnected(ClientBase.java:145)
	at org.apache.zookeeper.test.ReconfigExceptionTest.resetZKAdmin(ReconfigExceptionTest.java:201)
	at org.apache.zookeeper.test.ReconfigExceptionTest.testReconfigEnabledWithAuthAndWrongACL(ReconfigExceptionTest.java:143)
	at org.apache.zookeeper.JUnit4ZKTestRunner$LoggedInvokeMethod.evaluate(JUnit4ZKTestRunner.java:79)
	at java.util.concurrent.FutureTask.run(FutureTask.java:262)
	at java.lang.Thread.run(Thread.java:745)


FAILED:  org.apache.zookeeper.test.ReconfigExceptionTest.testReconfigDisabledByDefault

Error Message:
null

Stack Trace:
junit.framework.AssertionFailedError
	at org.apache.zookeeper.test.ReconfigExceptionTest.testReconfigDisabledByDefault(ReconfigExceptionTest.java:96)
	at org.apache.zookeeper.JUnit4ZKTestRunner$LoggedInvokeMethod.evaluate(JUnit4ZKTestRunner.java:79)
	at java.util.concurrent.FutureTask.run(FutureTask.java:262)
	at java.lang.Thread.run(Thread.java:745)


FAILED:  org.apache.zookeeper.test.ReconfigExceptionTest.testReconfigEnabledWithAuthAndACL

Error Message:
test timed out after 10000 milliseconds

Stack Trace:
org.junit.runners.model.TestTimedOutException: test timed out after 10000 milliseconds
	at java.lang.Object.wait(Native Method)
	at org.apache.zookeeper.test.ClientBase$CountdownWatcher.waitForConnected(ClientBase.java:145)
	at org.apache.zookeeper.test.ReconfigExceptionTest.resetZKAdmin(ReconfigExceptionTest.java:201)
	at org.apache.zookeeper.test.ReconfigExceptionTest.testReconfigEnabledWithAuthAndACL(ReconfigExceptionTest.java:165)
	at org.apache.zookeeper.JUnit4ZKTestRunner$LoggedInvokeMethod.evaluate(JUnit4ZKTestRunner.java:79)
	at java.util.concurrent.FutureTask.run(FutureTask.java:262)
	at java.lang.Thread.run(Thread.java:745)


FAILED:  org.apache.zookeeper.test.ReconfigExceptionTest.testReconfigFailWithoutAuth

Error Message:
null

Stack Trace:
junit.framework.AssertionFailedError
	at org.apache.zookeeper.test.ReconfigExceptionTest.testReconfigFailWithoutAuth(ReconfigExceptionTest.java:110)
	at org.apache.zookeeper.JUnit4ZKTestRunner$LoggedInvokeMethod.evaluate(JUnit4ZKTestRunner.java:79)
	at java.util.concurrent.FutureTask.run(FutureTask.java:262)
	at java.lang.Thread.run(Thread.java:745)


FAILED:  org.apache.zookeeper.test.ReconfigExceptionTest.testReconfigEnabledWithSuperUser

Error Message:
Reconfig should not fail, but failed with exception : KeeperErrorCode = ConnectionLoss

Stack Trace:
junit.framework.AssertionFailedError: Reconfig should not fail, but failed with exception : KeeperErrorCode = ConnectionLoss
	at org.apache.zookeeper.test.ReconfigExceptionTest.testReconfigEnabledWithSuperUser(ReconfigExceptionTest.java:122)
	at org.apache.zookeeper.JUnit4ZKTestRunner$LoggedInvokeMethod.evaluate(JUnit4ZKTestRunner.java:79)
	at java.util.concurrent.FutureTask.run(FutureTask.java:262)
	at java.lang.Thread.run(Thread.java:745)


FAILED:  org.apache.zookeeper.test.ReconfigMisconfigTest.testReconfigFailWithoutSuperuserPasswordConfiguredOnServer

Error Message:
null

Stack Trace:
junit.framework.AssertionFailedError
	at org.apache.zookeeper.test.ReconfigMisconfigTest.testReconfigFailWithoutSuperuserPasswordConfiguredOnServer(ReconfigMisconfigTest.java:85)
	at org.apache.zookeeper.JUnit4ZKTestRunner$LoggedInvokeMethod.evaluate(JUnit4ZKTestRunner.java:79)
	at java.util.concurrent.FutureTask.run(FutureTask.java:262)
	at java.lang.Thread.run(Thread.java:745)


FAILED:  org.apache.zookeeper.test.ReconfigTest.testQuorumSystemChange

Error Message:
client could not connect to reestablished quorum: giving up after 30+ seconds.

Stack Trace:
junit.framework.AssertionFailedError: client could not connect to reestablished quorum: giving up after 30+ seconds.
	at org.apache.zookeeper.test.ReconfigTest.reconfig(ReconfigTest.java:93)
	at org.apache.zookeeper.test.ReconfigTest.testQuorumSystemChange(ReconfigTest.java:838)
	at org.apache.zookeeper.JUnit4ZKTestRunner$LoggedInvokeMethod.evaluate(JUnit4ZKTestRunner.java:79)


FAILED:  org.apache.zookeeper.test.ReconfigTest.testPortChange

Error Message:
client could not connect to reestablished quorum: giving up after 30+ seconds.

Stack Trace:
junit.framework.AssertionFailedError: client could not connect to reestablished quorum: giving up after 30+ seconds.
	at org.apache.zookeeper.test.ReconfigTest.testNormalOperation(ReconfigTest.java:183)
	at org.apache.zookeeper.test.ReconfigTest.testPortChange(ReconfigTest.java:611)
	at org.apache.zookeeper.JUnit4ZKTestRunner$LoggedInvokeMethod.evaluate(JUnit4ZKTestRunner.java:79)


FAILED:  org.apache.zookeeper.test.ReconfigTest.testPortChangeToBlockedPortLeader

Error Message:
client could not connect to reestablished quorum: giving up after 30+ seconds.

Stack Trace:
junit.framework.AssertionFailedError: client could not connect to reestablished quorum: giving up after 30+ seconds.
	at org.apache.zookeeper.test.ReconfigTest.testNormalOperation(ReconfigTest.java:183)
	at org.apache.zookeeper.test.ReconfigTest.testPortChangeToBlockedPort(ReconfigTest.java:749)
	at org.apache.zookeeper.test.ReconfigTest.testPortChangeToBlockedPortLeader(ReconfigTest.java:718)
	at org.apache.zookeeper.JUnit4ZKTestRunner$LoggedInvokeMethod.evaluate(JUnit4ZKTestRunner.java:79)


FAILED:  org.apache.zookeeper.test.ReconfigTest.testInitialConfigHasPositiveVersion

Error Message:
client could not connect to reestablished quorum: giving up after 30+ seconds.

Stack Trace:
junit.framework.AssertionFailedError: client could not connect to reestablished quorum: giving up after 30+ seconds.
	at org.apache.zookeeper.test.ReconfigTest.testNormalOperation(ReconfigTest.java:183)
	at org.apache.zookeeper.test.ReconfigTest.testInitialConfigHasPositiveVersion(ReconfigTest.java:897)
	at org.apache.zookeeper.JUnit4ZKTestRunner$LoggedInvokeMethod.evaluate(JUnit4ZKTestRunner.java:79)


FAILED:  org.apache.zookeeper.test.ReconfigTest.testRemoveAddOne

Error Message:
client could not connect to reestablished quorum: giving up after 30+ seconds.

Stack Trace:
junit.framework.AssertionFailedError: client could not connect to reestablished quorum: giving up after 30+ seconds.
	at org.apache.zookeeper.test.ReconfigTest.reconfig(ReconfigTest.java:93)
	at org.apache.zookeeper.test.ReconfigTest.testRemoveAddOne(ReconfigTest.java:294)
	at org.apache.zookeeper.JUnit4ZKTestRunner$LoggedInvokeMethod.evaluate(JUnit4ZKTestRunner.java:79)


FAILED:  org.apache.zookeeper.test.ReconfigTest.testRemoveAddTwo

Error Message:
client could not connect to reestablished quorum: giving up after 30+ seconds.

Stack Trace:
junit.framework.AssertionFailedError: client could not connect to reestablished quorum: giving up after 30+ seconds.
	at org.apache.zookeeper.test.ReconfigTest.reconfig(ReconfigTest.java:93)
	at org.apache.zookeeper.test.ReconfigTest.testRemoveAddTwo(ReconfigTest.java:384)
	at org.apache.zookeeper.JUnit4ZKTestRunner$LoggedInvokeMethod.evaluate(JUnit4ZKTestRunner.java:79)


FAILED:  org.apache.zookeeper.test.ReconfigTest.testPortChangeToBlockedPortFollower

Error Message:
client could not connect to reestablished quorum: giving up after 30+ seconds.

Stack Trace:
junit.framework.AssertionFailedError: client could not connect to reestablished quorum: giving up after 30+ seconds.
	at org.apache.zookeeper.test.ReconfigTest.testNormalOperation(ReconfigTest.java:183)
	at org.apache.zookeeper.test.ReconfigTest.testPortChangeToBlockedPort(ReconfigTest.java:749)
	at org.apache.zookeeper.test.ReconfigTest.testPortChangeToBlockedPortFollower(ReconfigTest.java:714)
	at org.apache.zookeeper.JUnit4ZKTestRunner$LoggedInvokeMethod.evaluate(JUnit4ZKTestRunner.java:79)


FAILED:  org.apache.zookeeper.test.ReconfigTest.testJMXBeanAfterRemoveAddOne

Error Message:
client could not connect to reestablished quorum: giving up after 30+ seconds.

Stack Trace:
junit.framework.AssertionFailedError: client could not connect to reestablished quorum: giving up after 30+ seconds.
	at org.apache.zookeeper.test.ReconfigTest.reconfig(ReconfigTest.java:93)
	at org.apache.zookeeper.test.ReconfigTest.testJMXBeanAfterRemoveAddOne(ReconfigTest.java:954)
	at org.apache.zookeeper.JUnit4ZKTestRunner$LoggedInvokeMethod.evaluate(JUnit4ZKTestRunner.java:79)


FAILED:  org.apache.zookeeper.test.ReconfigTest.testRoleChange

Error Message:
client could not connect to reestablished quorum: giving up after 30+ seconds.

Stack Trace:
junit.framework.AssertionFailedError: client could not connect to reestablished quorum: giving up after 30+ seconds.
	at org.apache.zookeeper.test.ReconfigTest.reconfig(ReconfigTest.java:93)
	at org.apache.zookeeper.test.ReconfigTest.testRoleChange(ReconfigTest.java:557)
	at org.apache.zookeeper.JUnit4ZKTestRunner$LoggedInvokeMethod.evaluate(JUnit4ZKTestRunner.java:79)


FAILED:  org.apache.zookeeper.test.ReconfigTest.testBulkReconfig

Error Message:
client could not connect to reestablished quorum: giving up after 30+ seconds.

Stack Trace:
junit.framework.AssertionFailedError: client could not connect to reestablished quorum: giving up after 30+ seconds.
	at org.apache.zookeeper.test.ReconfigTest.reconfig(ReconfigTest.java:93)
	at org.apache.zookeeper.test.ReconfigTest.testBulkReconfig(ReconfigTest.java:453)
	at org.apache.zookeeper.JUnit4ZKTestRunner$LoggedInvokeMethod.evaluate(JUnit4ZKTestRunner.java:79)


FAILED:  org.apache.zookeeper.test.ReconfigTest.testJMXBeanAfterRoleChange

Error Message:
client could not connect to reestablished quorum: giving up after 30+ seconds.

Stack Trace:
junit.framework.AssertionFailedError: client could not connect to reestablished quorum: giving up after 30+ seconds.
	at org.apache.zookeeper.test.ReconfigTest.reconfig(ReconfigTest.java:93)
	at org.apache.zookeeper.test.ReconfigTest.testJMXBeanAfterRoleChange(ReconfigTest.java:1033)
	at org.apache.zookeeper.JUnit4ZKTestRunner$LoggedInvokeMethod.evaluate(JUnit4ZKTestRunner.java:79)


FAILED:  org.apache.zookeeper.test.ReconfigTest.testRemoveOneAsynchronous

Error Message:
expected:<0> but was:<-4>

Stack Trace:
junit.framework.AssertionFailedError: expected:<0> but was:<-4>
	at org.apache.zookeeper.test.ReconfigTest.testRemoveOneAsynchronous(ReconfigTest.java:491)
	at org.apache.zookeeper.JUnit4ZKTestRunner$LoggedInvokeMethod.evaluate(JUnit4ZKTestRunner.java:79)


FAILED:  org.apache.zookeeper.test.RecoveryTest.testRecovery

Error Message:
KeeperErrorCode = ConnectionLoss for /0

Stack Trace:
org.apache.zookeeper.KeeperException$ConnectionLossException: KeeperErrorCode = ConnectionLoss for /0
	at org.apache.zookeeper.KeeperException.create(KeeperException.java:99)
	at org.apache.zookeeper.KeeperException.create(KeeperException.java:51)
	at org.apache.zookeeper.ZooKeeper.create(ZooKeeper.java:1445)
	at org.apache.zookeeper.test.RecoveryTest.testRecovery(RecoveryTest.java:92)
	at org.apache.zookeeper.JUnit4ZKTestRunner$LoggedInvokeMethod.evaluate(JUnit4ZKTestRunner.java:79)


FAILED:  org.apache.zookeeper.test.RepeatStartupTest.testFail

Error Message:
KeeperErrorCode = ConnectionLoss for /test

Stack Trace:
org.apache.zookeeper.KeeperException$ConnectionLossException: KeeperErrorCode = ConnectionLoss for /test
	at org.apache.zookeeper.KeeperException.create(KeeperException.java:99)
	at org.apache.zookeeper.KeeperException.create(KeeperException.java:51)
	at org.apache.zookeeper.ZooKeeper.create(ZooKeeper.java:1445)
	at org.apache.zookeeper.test.RepeatStartupTest.testFail(RepeatStartupTest.java:44)
	at org.apache.zookeeper.JUnit4ZKTestRunner$LoggedInvokeMethod.evaluate(JUnit4ZKTestRunner.java:79)


FAILED:  org.apache.zookeeper.test.RestoreCommittedLogTest.testRestoreCommittedLog

Error Message:
KeeperErrorCode = ConnectionLoss for /invalidsnap-0

Stack Trace:
org.apache.zookeeper.KeeperException$ConnectionLossException: KeeperErrorCode = ConnectionLoss for /invalidsnap-0
	at org.apache.zookeeper.KeeperException.create(KeeperException.java:99)
	at org.apache.zookeeper.KeeperException.create(KeeperException.java:51)
	at org.apache.zookeeper.ZooKeeper.create(ZooKeeper.java:1445)
	at org.apache.zookeeper.test.RestoreCommittedLogTest.testRestoreCommittedLog(RestoreCommittedLogTest.java:63)
	at org.apache.zookeeper.JUnit4ZKTestRunner$LoggedInvokeMethod.evaluate(JUnit4ZKTestRunner.java:79)


FAILED:  org.apache.zookeeper.test.SSLTest.testSecureStandaloneServer

Error Message:
Forked Java VM exited abnormally. Please note the time in the report does not reflect the time until the VM exit.

Stack Trace:
junit.framework.AssertionFailedError: Forked Java VM exited abnormally. Please note the time in the report does not reflect the time until the VM exit.
	at java.lang.Thread.run(Thread.java:745)


FAILED:  org.apache.zookeeper.test.SaslAuthDesignatedClientTest.testReadAccessUser

Error Message:
Unable to create znode

Stack Trace:
junit.framework.AssertionFailedError: Unable to create znode
	at org.apache.zookeeper.test.SaslAuthDesignatedClientTest.testReadAccessUser(SaslAuthDesignatedClientTest.java:122)
	at org.apache.zookeeper.JUnit4ZKTestRunner$LoggedInvokeMethod.evaluate(JUnit4ZKTestRunner.java:79)


FAILED:  org.apache.zookeeper.test.SaslAuthDesignatedClientTest.testAuth

Error Message:
test failed :org.apache.zookeeper.KeeperException$ConnectionLossException: KeeperErrorCode = ConnectionLoss for /path1

Stack Trace:
junit.framework.AssertionFailedError: test failed :org.apache.zookeeper.KeeperException$ConnectionLossException: KeeperErrorCode = ConnectionLoss for /path1
	at org.apache.zookeeper.test.SaslAuthDesignatedClientTest.testAuth(SaslAuthDesignatedClientTest.java:82)
	at org.apache.zookeeper.JUnit4ZKTestRunner$LoggedInvokeMethod.evaluate(JUnit4ZKTestRunner.java:79)


FAILED:  org.apache.zookeeper.test.SaslAuthDesignatedServerTest.testAuth

Error Message:
test failed :org.apache.zookeeper.KeeperException$ConnectionLossException: KeeperErrorCode = ConnectionLoss for /path1

Stack Trace:
junit.framework.AssertionFailedError: test failed :org.apache.zookeeper.KeeperException$ConnectionLossException: KeeperErrorCode = ConnectionLoss for /path1
	at org.apache.zookeeper.test.SaslAuthDesignatedServerTest.testAuth(SaslAuthDesignatedServerTest.java:98)
	at org.apache.zookeeper.JUnit4ZKTestRunner$LoggedInvokeMethod.evaluate(JUnit4ZKTestRunner.java:79)


FAILED:  org.apache.zookeeper.test.SessionInvalidationTest.testCreateAfterCloseShouldFail

Error Message:
Unable to connect to server

Stack Trace:
junit.framework.AssertionFailedError: Unable to connect to server
	at org.apache.zookeeper.test.ClientBase.createClient(ClientBase.java:231)
	at org.apache.zookeeper.test.ClientBase.createClient(ClientBase.java:220)
	at org.apache.zookeeper.test.ClientBase.createClient(ClientBase.java:205)
	at org.apache.zookeeper.test.ClientBase.createClient(ClientBase.java:198)
	at org.apache.zookeeper.test.SessionInvalidationTest.testCreateAfterCloseShouldFail(SessionInvalidationTest.java:100)
	at org.apache.zookeeper.JUnit4ZKTestRunner$LoggedInvokeMethod.evaluate(JUnit4ZKTestRunner.java:79)


FAILED:  org.apache.zookeeper.test.SessionTest.testSessionTimeout

Error Message:
KeeperErrorCode = ConnectionLoss for /stest

Stack Trace:
org.apache.zookeeper.KeeperException$ConnectionLossException: KeeperErrorCode = ConnectionLoss for /stest
	at org.apache.zookeeper.KeeperException.create(KeeperException.java:99)
	at org.apache.zookeeper.KeeperException.create(KeeperException.java:51)
	at org.apache.zookeeper.ZooKeeper.create(ZooKeeper.java:1445)
	at org.apache.zookeeper.test.SessionTest.testSessionTimeout(SessionTest.java:261)
	at org.apache.zookeeper.JUnit4ZKTestRunner$LoggedInvokeMethod.evaluate(JUnit4ZKTestRunner.java:79)


FAILED:  org.apache.zookeeper.test.SessionTest.testMinMaxSessionTimeout

Error Message:
Unable to connect to server

Stack Trace:
junit.framework.AssertionFailedError: Unable to connect to server
	at org.apache.zookeeper.test.SessionTest.createClient(SessionTest.java:125)
	at org.apache.zookeeper.test.SessionTest.createClient(SessionTest.java:115)
	at org.apache.zookeeper.test.SessionTest.testMinMaxSessionTimeout(SessionTest.java:447)
	at org.apache.zookeeper.JUnit4ZKTestRunner$LoggedInvokeMethod.evaluate(JUnit4ZKTestRunner.java:79)


FAILED:  org.apache.zookeeper.test.SessionTest.testSessionMove

Error Message:
KeeperErrorCode = ConnectionLoss for /sessionMoveTest

Stack Trace:
org.apache.zookeeper.KeeperException$ConnectionLossException: KeeperErrorCode = ConnectionLoss for /sessionMoveTest
	at org.apache.zookeeper.KeeperException.create(KeeperException.java:99)
	at org.apache.zookeeper.KeeperException.create(KeeperException.java:51)
	at org.apache.zookeeper.ZooKeeper.create(ZooKeeper.java:1445)
	at org.apache.zookeeper.test.SessionTest.testSessionMove(SessionTest.java:317)
	at org.apache.zookeeper.JUnit4ZKTestRunner$LoggedInvokeMethod.evaluate(JUnit4ZKTestRunner.java:79)


FAILED:  org.apache.zookeeper.test.SessionTest.testSessionTimeoutAccess

Error Message:
Unable to connect to server

Stack Trace:
junit.framework.AssertionFailedError: Unable to connect to server
	at org.apache.zookeeper.test.SessionTest.createClient(SessionTest.java:125)
	at org.apache.zookeeper.test.SessionTest.createClient(SessionTest.java:115)
	at org.apache.zookeeper.test.SessionTest.testSessionTimeoutAccess(SessionTest.java:402)
	at org.apache.zookeeper.JUnit4ZKTestRunner$LoggedInvokeMethod.evaluate(JUnit4ZKTestRunner.java:79)


FAILED:  org.apache.zookeeper.test.SessionTest.testSession

Error Message:
KeeperErrorCode = ConnectionLoss for /e

Stack Trace:
org.apache.zookeeper.KeeperException$ConnectionLossException: KeeperErrorCode = ConnectionLoss for /e
	at org.apache.zookeeper.KeeperException.create(KeeperException.java:99)
	at org.apache.zookeeper.KeeperException.create(KeeperException.java:51)
	at org.apache.zookeeper.ZooKeeper.create(ZooKeeper.java:1445)
	at org.apache.zookeeper.test.SessionTest.testSession(SessionTest.java:189)
	at org.apache.zookeeper.JUnit4ZKTestRunner$LoggedInvokeMethod.evaluate(JUnit4ZKTestRunner.java:79)


FAILED:  org.apache.zookeeper.test.SessionUpgradeTest.testLocalSessionsWithoutEphemeralOnFollower

Error Message:
KeeperErrorCode = ConnectionLoss for /testLocalSessions-followerTest-1

Stack Trace:
org.apache.zookeeper.KeeperException$ConnectionLossException: KeeperErrorCode = ConnectionLoss for /testLocalSessions-followerTest-1
	at org.apache.zookeeper.KeeperException.create(KeeperException.java:99)
	at org.apache.zookeeper.KeeperException.create(KeeperException.java:51)
	at org.apache.zookeeper.ZooKeeper.create(ZooKeeper.java:1445)
	at org.apache.zookeeper.test.SessionUpgradeTest.testLocalSessionsWithoutEphemeral(SessionUpgradeTest.java:89)
	at org.apache.zookeeper.test.SessionUpgradeTest.testLocalSessionsWithoutEphemeralOnFollower(SessionUpgradeTest.java:64)
	at org.apache.zookeeper.JUnit4ZKTestRunner$LoggedInvokeMethod.evaluate(JUnit4ZKTestRunner.java:79)


FAILED:  org.apache.zookeeper.test.SessionUpgradeTest.testLocalSessionsWithoutEphemeralOnLeader

Error Message:
KeeperErrorCode = ConnectionLoss for /testLocalSessions-leaderTest-1

Stack Trace:
org.apache.zookeeper.KeeperException$ConnectionLossException: KeeperErrorCode = ConnectionLoss for /testLocalSessions-leaderTest-1
	at org.apache.zookeeper.KeeperException.create(KeeperException.java:99)
	at org.apache.zookeeper.KeeperException.create(KeeperException.java:51)
	at org.apache.zookeeper.ZooKeeper.create(ZooKeeper.java:1445)
	at org.apache.zookeeper.test.SessionUpgradeTest.testLocalSessionsWithoutEphemeral(SessionUpgradeTest.java:89)
	at org.apache.zookeeper.test.SessionUpgradeTest.testLocalSessionsWithoutEphemeralOnLeader(SessionUpgradeTest.java:69)
	at org.apache.zookeeper.JUnit4ZKTestRunner$LoggedInvokeMethod.evaluate(JUnit4ZKTestRunner.java:79)


FAILED:  org.apache.zookeeper.test.SessionUpgradeTest.testUpgradeWithEphemeralOnLeader

Error Message:
KeeperErrorCode = ConnectionLoss for /testUpgrade-leaderTest-1

Stack Trace:
org.apache.zookeeper.KeeperException$ConnectionLossException: KeeperErrorCode = ConnectionLoss for /testUpgrade-leaderTest-1
	at org.apache.zookeeper.KeeperException.create(KeeperException.java:99)
	at org.apache.zookeeper.KeeperException.create(KeeperException.java:51)
	at org.apache.zookeeper.ZooKeeper.create(ZooKeeper.java:1445)
	at org.apache.zookeeper.test.SessionUpgradeTest.testUpgradeWithEphemeral(SessionUpgradeTest.java:188)
	at org.apache.zookeeper.test.SessionUpgradeTest.testUpgradeWithEphemeralOnLeader(SessionUpgradeTest.java:166)
	at org.apache.zookeeper.JUnit4ZKTestRunner$LoggedInvokeMethod.evaluate(JUnit4ZKTestRunner.java:79)


FAILED:  org.apache.zookeeper.test.SessionUpgradeTest.testUpgradeWithEphemeralOnFollower

Error Message:
KeeperErrorCode = ConnectionLoss for /testUpgrade-followerTest-1

Stack Trace:
org.apache.zookeeper.KeeperException$ConnectionLossException: KeeperErrorCode = ConnectionLoss for /testUpgrade-followerTest-1
	at org.apache.zookeeper.KeeperException.create(KeeperException.java:99)
	at org.apache.zookeeper.KeeperException.create(KeeperException.java:51)
	at org.apache.zookeeper.ZooKeeper.create(ZooKeeper.java:1445)
	at org.apache.zookeeper.test.SessionUpgradeTest.testUpgradeWithEphemeral(SessionUpgradeTest.java:188)
	at org.apache.zookeeper.test.SessionUpgradeTest.testUpgradeWithEphemeralOnFollower(SessionUpgradeTest.java:161)
	at org.apache.zookeeper.JUnit4ZKTestRunner$LoggedInvokeMethod.evaluate(JUnit4ZKTestRunner.java:79)


FAILED:  org.apache.zookeeper.test.StandaloneTest.testStandaloneReconfigFails

Error Message:
KeeperErrorCode = ConnectionLoss

Stack Trace:
org.apache.zookeeper.KeeperException$ConnectionLossException: KeeperErrorCode = ConnectionLoss
	at org.apache.zookeeper.KeeperException.create(KeeperException.java:99)
	at org.apache.zookeeper.KeeperException.create(KeeperException.java:51)
	at org.apache.zookeeper.admin.ZooKeeperAdmin.reconfigure(ZooKeeperAdmin.java:185)
	at org.apache.zookeeper.admin.ZooKeeperAdmin.reconfigure(ZooKeeperAdmin.java:202)
	at org.apache.zookeeper.test.StandaloneTest.testStandaloneReconfigFails(StandaloneTest.java:154)
	at org.apache.zookeeper.JUnit4ZKTestRunner$LoggedInvokeMethod.evaluate(JUnit4ZKTestRunner.java:79)


FAILED:  org.apache.zookeeper.test.StatTest.testChildren

Error Message:
KeeperErrorCode = ConnectionLoss for /foo

Stack Trace:
org.apache.zookeeper.KeeperException$ConnectionLossException: KeeperErrorCode = ConnectionLoss for /foo
	at org.apache.zookeeper.KeeperException.create(KeeperException.java:99)
	at org.apache.zookeeper.KeeperException.create(KeeperException.java:51)
	at org.apache.zookeeper.ZooKeeper.create(ZooKeeper.java:1445)
	at org.apache.zookeeper.test.StatTest.testChildren(StatTest.java:142)
	at org.apache.zookeeper.JUnit4ZKTestRunner$LoggedInvokeMethod.evaluate(JUnit4ZKTestRunner.java:79)


FAILED:  org.apache.zookeeper.test.StatTest.testBasic

Error Message:
KeeperErrorCode = ConnectionLoss for /foo

Stack Trace:
org.apache.zookeeper.KeeperException$ConnectionLossException: KeeperErrorCode = ConnectionLoss for /foo
	at org.apache.zookeeper.KeeperException.create(KeeperException.java:99)
	at org.apache.zookeeper.KeeperException.create(KeeperException.java:51)
	at org.apache.zookeeper.ZooKeeper.create(ZooKeeper.java:1445)
	at org.apache.zookeeper.test.StatTest.testBasic(StatTest.java:77)
	at org.apache.zookeeper.JUnit4ZKTestRunner$LoggedInvokeMethod.evaluate(JUnit4ZKTestRunner.java:79)


FAILED:  org.apache.zookeeper.test.StatTest.testChild

Error Message:
KeeperErrorCode = ConnectionLoss for /foo

Stack Trace:
org.apache.zookeeper.KeeperException$ConnectionLossException: KeeperErrorCode = ConnectionLoss for /foo
	at org.apache.zookeeper.KeeperException.create(KeeperException.java:99)
	at org.apache.zookeeper.KeeperException.create(KeeperException.java:51)
	at org.apache.zookeeper.ZooKeeper.create(ZooKeeper.java:1445)
	at org.apache.zookeeper.test.StatTest.testChild(StatTest.java:101)
	at org.apache.zookeeper.JUnit4ZKTestRunner$LoggedInvokeMethod.evaluate(JUnit4ZKTestRunner.java:79)


FAILED:  org.apache.zookeeper.test.StatTest.testDataSizeChange

Error Message:
KeeperErrorCode = ConnectionLoss for /foo

Stack Trace:
org.apache.zookeeper.KeeperException$ConnectionLossException: KeeperErrorCode = ConnectionLoss for /foo
	at org.apache.zookeeper.KeeperException.create(KeeperException.java:99)
	at org.apache.zookeeper.KeeperException.create(KeeperException.java:51)
	at org.apache.zookeeper.ZooKeeper.create(ZooKeeper.java:1445)
	at org.apache.zookeeper.test.StatTest.testDataSizeChange(StatTest.java:172)
	at org.apache.zookeeper.JUnit4ZKTestRunner$LoggedInvokeMethod.evaluate(JUnit4ZKTestRunner.java:79)


FAILED:  org.apache.zookeeper.test.SyncCallTest.testSync

Error Message:
expected:<0> but was:<-4>

Stack Trace:
junit.framework.AssertionFailedError: expected:<0> but was:<-4>
	at org.apache.zookeeper.test.SyncCallTest.testSync(SyncCallTest.java:80)
	at org.apache.zookeeper.JUnit4ZKTestRunner$LoggedInvokeMethod.evaluate(JUnit4ZKTestRunner.java:79)


FAILED:  org.apache.zookeeper.test.TruncateTest.testTruncate

Error Message:
KeeperErrorCode = ConnectionLoss for /0

Stack Trace:
org.apache.zookeeper.KeeperException$ConnectionLossException: KeeperErrorCode = ConnectionLoss for /0
	at org.apache.zookeeper.KeeperException.create(KeeperException.java:99)
	at org.apache.zookeeper.KeeperException.create(KeeperException.java:51)
	at org.apache.zookeeper.ZooKeeper.create(ZooKeeper.java:1445)
	at org.apache.zookeeper.test.TruncateTest.testTruncate(TruncateTest.java:168)
	at org.apache.zookeeper.JUnit4ZKTestRunner$LoggedInvokeMethod.evaluate(JUnit4ZKTestRunner.java:79)


FAILED:  org.apache.zookeeper.test.TruncateTest.testTruncationStreamReset

Error Message:
null

Stack Trace:
java.nio.channels.ClosedChannelException
	at sun.nio.ch.FileChannelImpl.ensureOpen(FileChannelImpl.java:99)
	at sun.nio.ch.FileChannelImpl.position(FileChannelImpl.java:250)
	at org.apache.zookeeper.server.persistence.Util.padLogFile(Util.java:212)
	at org.apache.zookeeper.server.persistence.FileTxnLog.padFile(FileTxnLog.java:243)
	at org.apache.zookeeper.server.persistence.FileTxnLog.append(FileTxnLog.java:221)
	at org.apache.zookeeper.server.persistence.FileTxnSnapLog.append(FileTxnSnapLog.java:421)
	at org.apache.zookeeper.server.ZKDatabase.append(ZKDatabase.java:542)
	at org.apache.zookeeper.test.TruncateTest.append(TruncateTest.java:144)
	at org.apache.zookeeper.test.TruncateTest.testTruncationStreamReset(TruncateTest.java:81)
	at org.apache.zookeeper.JUnit4ZKTestRunner$LoggedInvokeMethod.evaluate(JUnit4ZKTestRunner.java:79)


FAILED:  org.apache.zookeeper.test.TruncateTest.testTruncationNullLog

Error Message:
null

Stack Trace:
java.nio.channels.ClosedChannelException
	at sun.nio.ch.FileChannelImpl.ensureOpen(FileChannelImpl.java:99)
	at sun.nio.ch.FileChannelImpl.position(FileChannelImpl.java:250)
	at org.apache.zookeeper.server.persistence.Util.padLogFile(Util.java:212)
	at org.apache.zookeeper.server.persistence.FileTxnLog.padFile(FileTxnLog.java:243)
	at org.apache.zookeeper.server.persistence.FileTxnLog.append(FileTxnLog.java:221)
	at org.apache.zookeeper.server.persistence.FileTxnSnapLog.append(FileTxnSnapLog.java:421)
	at org.apache.zookeeper.server.ZKDatabase.append(ZKDatabase.java:542)
	at org.apache.zookeeper.test.TruncateTest.append(TruncateTest.java:144)
	at org.apache.zookeeper.test.TruncateTest.testTruncationNullLog(TruncateTest.java:117)
	at org.apache.zookeeper.JUnit4ZKTestRunner$LoggedInvokeMethod.evaluate(JUnit4ZKTestRunner.java:79)


FAILED:  org.apache.zookeeper.test.WatchEventWhenAutoResetTest.testNodeChildrenChanged

Error Message:
can not connect to 127.0.0.1:16611

Stack Trace:
junit.framework.AssertionFailedError: can not connect to 127.0.0.1:16611
	at org.apache.zookeeper.test.WatchEventWhenAutoResetTest.createClient(WatchEventWhenAutoResetTest.java:83)
	at org.apache.zookeeper.test.WatchEventWhenAutoResetTest.createClient(WatchEventWhenAutoResetTest.java:89)
	at org.apache.zookeeper.test.WatchEventWhenAutoResetTest.testNodeChildrenChanged(WatchEventWhenAutoResetTest.java:201)
	at org.apache.zookeeper.JUnit4ZKTestRunner$LoggedInvokeMethod.evaluate(JUnit4ZKTestRunner.java:79)


FAILED:  org.apache.zookeeper.test.WatchEventWhenAutoResetTest.testNodeDataChanged

Error Message:
can not connect to 127.0.0.1:16620

Stack Trace:
junit.framework.AssertionFailedError: can not connect to 127.0.0.1:16620
	at org.apache.zookeeper.test.WatchEventWhenAutoResetTest.createClient(WatchEventWhenAutoResetTest.java:83)
	at org.apache.zookeeper.test.WatchEventWhenAutoResetTest.createClient(WatchEventWhenAutoResetTest.java:89)
	at org.apache.zookeeper.test.WatchEventWhenAutoResetTest.testNodeDataChanged(WatchEventWhenAutoResetTest.java:104)
	at org.apache.zookeeper.JUnit4ZKTestRunner$LoggedInvokeMethod.evaluate(JUnit4ZKTestRunner.java:79)


FAILED:  org.apache.zookeeper.test.WatchEventWhenAutoResetTest.testNodeCreated

Error Message:
can not connect to 127.0.0.1:16629

Stack Trace:
junit.framework.AssertionFailedError: can not connect to 127.0.0.1:16629
	at org.apache.zookeeper.test.WatchEventWhenAutoResetTest.createClient(WatchEventWhenAutoResetTest.java:83)
	at org.apache.zookeeper.test.WatchEventWhenAutoResetTest.createClient(WatchEventWhenAutoResetTest.java:89)
	at org.apache.zookeeper.test.WatchEventWhenAutoResetTest.testNodeCreated(WatchEventWhenAutoResetTest.java:138)
	at org.apache.zookeeper.JUnit4ZKTestRunner$LoggedInvokeMethod.evaluate(JUnit4ZKTestRunner.java:79)


FAILED:  org.apache.zookeeper.test.WatchEventWhenAutoResetTest.testNodeDeleted

Error Message:
can not connect to 127.0.0.1:16638

Stack Trace:
junit.framework.AssertionFailedError: can not connect to 127.0.0.1:16638
	at org.apache.zookeeper.test.WatchEventWhenAutoResetTest.createClient(WatchEventWhenAutoResetTest.java:83)
	at org.apache.zookeeper.test.WatchEventWhenAutoResetTest.createClient(WatchEventWhenAutoResetTest.java:89)
	at org.apache.zookeeper.test.WatchEventWhenAutoResetTest.testNodeDeleted(WatchEventWhenAutoResetTest.java:160)
	at org.apache.zookeeper.JUnit4ZKTestRunner$LoggedInvokeMethod.evaluate(JUnit4ZKTestRunner.java:79)


FAILED:  org.apache.zookeeper.test.WatcherFuncTest.testGetDataSync

Error Message:
null

Stack Trace:
java.lang.NullPointerException
	at org.apache.zookeeper.test.WatcherFuncTest.tearDown(WatcherFuncTest.java:105)


FAILED:  org.apache.zookeeper.test.WatcherFuncTest.testExistsSync

Error Message:
null

Stack Trace:
java.lang.NullPointerException
	at org.apache.zookeeper.test.WatcherFuncTest.tearDown(WatcherFuncTest.java:104)


FAILED:  org.apache.zookeeper.test.WatcherFuncTest.testGetDataSyncWObj

Error Message:
null

Stack Trace:
java.lang.NullPointerException
	at org.apache.zookeeper.test.WatcherFuncTest.tearDown(WatcherFuncTest.java:104)


FAILED:  org.apache.zookeeper.test.WatcherFuncTest.testGetChildrenSyncWObj

Error Message:
null

Stack Trace:
java.lang.NullPointerException
	at org.apache.zookeeper.test.WatcherFuncTest.tearDown(WatcherFuncTest.java:104)


FAILED:  org.apache.zookeeper.test.WatcherFuncTest.testGetChildrenSync

Error Message:
null

Stack Trace:
java.lang.NullPointerException
	at org.apache.zookeeper.test.WatcherFuncTest.tearDown(WatcherFuncTest.java:104)


FAILED:  org.apache.zookeeper.test.WatcherFuncTest.testExistsSyncWObj

Error Message:
null

Stack Trace:
java.lang.NullPointerException
	at org.apache.zookeeper.test.WatcherFuncTest.tearDown(WatcherFuncTest.java:104)


FAILED:  org.apache.zookeeper.test.WatcherTest.testWatchAutoResetWithPending

Error Message:
Unable to connect to server

Stack Trace:
junit.framework.AssertionFailedError: Unable to connect to server
	at org.apache.zookeeper.test.ClientBase.createClient(ClientBase.java:231)
	at org.apache.zookeeper.test.WatcherTest.testWatchAutoResetWithPending(WatcherTest.java:191)
	at org.apache.zookeeper.JUnit4ZKTestRunner$LoggedInvokeMethod.evaluate(JUnit4ZKTestRunner.java:79)


FAILED:  org.apache.zookeeper.test.WatcherTest.testWatcherCorrectness

Error Message:
KeeperErrorCode = ConnectionLoss for /tc-

Stack Trace:
org.apache.zookeeper.KeeperException$ConnectionLossException: KeeperErrorCode = ConnectionLoss for /tc-
	at org.apache.zookeeper.KeeperException.create(KeeperException.java:99)
	at org.apache.zookeeper.KeeperException.create(KeeperException.java:51)
	at org.apache.zookeeper.ZooKeeper.create(ZooKeeper.java:1445)
	at org.apache.zookeeper.test.WatcherTest.testWatcherCorrectness(WatcherTest.java:115)
	at org.apache.zookeeper.JUnit4ZKTestRunner$LoggedInvokeMethod.evaluate(JUnit4ZKTestRunner.java:79)


FAILED:  org.apache.zookeeper.test.WatcherTest.testWatcherAutoResetDisabledWithLocal

Error Message:
KeeperErrorCode = ConnectionLoss for /watchtest

Stack Trace:
org.apache.zookeeper.KeeperException$ConnectionLossException: KeeperErrorCode = ConnectionLoss for /watchtest
	at org.apache.zookeeper.KeeperException.create(KeeperException.java:99)
	at org.apache.zookeeper.KeeperException.create(KeeperException.java:51)
	at org.apache.zookeeper.ZooKeeper.create(ZooKeeper.java:1445)
	at org.apache.zookeeper.test.WatcherTest.testWatcherAutoReset(WatcherTest.java:277)
	at org.apache.zookeeper.test.WatcherTest.testWatcherAutoResetWithLocal(WatcherTest.java:254)
	at org.apache.zookeeper.test.WatcherTest.testWatcherAutoResetDisabledWithLocal(WatcherTest.java:270)
	at org.apache.zookeeper.JUnit4ZKTestRunner$LoggedInvokeMethod.evaluate(JUnit4ZKTestRunner.java:79)


FAILED:  org.apache.zookeeper.test.WatcherTest.testWatcherAutoResetWithGlobal

Error Message:
KeeperErrorCode = ConnectionLoss for /watchtest

Stack Trace:
org.apache.zookeeper.KeeperException$ConnectionLossException: KeeperErrorCode = ConnectionLoss for /watchtest
	at org.apache.zookeeper.KeeperException.create(KeeperException.java:99)
	at org.apache.zookeeper.KeeperException.create(KeeperException.java:51)
	at org.apache.zookeeper.ZooKeeper.create(ZooKeeper.java:1445)
	at org.apache.zookeeper.test.WatcherTest.testWatcherAutoReset(WatcherTest.java:277)
	at org.apache.zookeeper.test.WatcherTest.testWatcherAutoResetWithGlobal(WatcherTest.java:245)
	at org.apache.zookeeper.JUnit4ZKTestRunner$LoggedInvokeMethod.evaluate(JUnit4ZKTestRunner.java:79)


FAILED:  org.apache.zookeeper.test.WatcherTest.testWatcherCount

Error Message:
Unable to connect to server

Stack Trace:
junit.framework.AssertionFailedError: Unable to connect to server
	at org.apache.zookeeper.test.ClientBase.createClient(ClientBase.java:231)
	at org.apache.zookeeper.test.ClientBase.createClient(ClientBase.java:220)
	at org.apache.zookeeper.test.WatcherTest.testWatcherCount(WatcherTest.java:153)
	at org.apache.zookeeper.JUnit4ZKTestRunner$LoggedInvokeMethod.evaluate(JUnit4ZKTestRunner.java:79)


FAILED:  org.apache.zookeeper.test.WatcherTest.testWatcherAutoResetDisabledWithGlobal

Error Message:
KeeperErrorCode = ConnectionLoss for /watchtest

Stack Trace:
org.apache.zookeeper.KeeperException$ConnectionLossException: KeeperErrorCode = ConnectionLoss for /watchtest
	at org.apache.zookeeper.KeeperException.create(KeeperException.java:99)
	at org.apache.zookeeper.KeeperException.create(KeeperException.java:51)
	at org.apache.zookeeper.ZooKeeper.create(ZooKeeper.java:1445)
	at org.apache.zookeeper.test.WatcherTest.testWatcherAutoReset(WatcherTest.java:277)
	at org.apache.zookeeper.test.WatcherTest.testWatcherAutoResetWithGlobal(WatcherTest.java:245)
	at org.apache.zookeeper.test.WatcherTest.testWatcherAutoResetDisabledWithGlobal(WatcherTest.java:264)
	at org.apache.zookeeper.JUnit4ZKTestRunner$LoggedInvokeMethod.evaluate(JUnit4ZKTestRunner.java:79)


FAILED:  org.apache.zookeeper.test.WatcherTest.testWatcherAutoResetWithLocal

Error Message:
KeeperErrorCode = ConnectionLoss for /watchtest

Stack Trace:
org.apache.zookeeper.KeeperException$ConnectionLossException: KeeperErrorCode = ConnectionLoss for /watchtest
	at org.apache.zookeeper.KeeperException.create(KeeperException.java:99)
	at org.apache.zookeeper.KeeperException.create(KeeperException.java:51)
	at org.apache.zookeeper.ZooKeeper.create(ZooKeeper.java:1445)
	at org.apache.zookeeper.test.WatcherTest.testWatcherAutoReset(WatcherTest.java:277)
	at org.apache.zookeeper.test.WatcherTest.testWatcherAutoResetWithLocal(WatcherTest.java:254)
	at org.apache.zookeeper.JUnit4ZKTestRunner$LoggedInvokeMethod.evaluate(JUnit4ZKTestRunner.java:79)


FAILED:  org.apache.zookeeper.test.ZooKeeperQuotaTest.testQuota

Error Message:
KeeperErrorCode = ConnectionLoss for /

Stack Trace:
org.apache.zookeeper.KeeperException$ConnectionLossException: KeeperErrorCode = ConnectionLoss for /
	at org.apache.zookeeper.KeeperException.create(KeeperException.java:99)
	at org.apache.zookeeper.KeeperException.create(KeeperException.java:51)
	at org.apache.zookeeper.ZooKeeper.setData(ZooKeeper.java:2256)
	at org.apache.zookeeper.test.ZooKeeperQuotaTest.testQuota(ZooKeeperQuotaTest.java:43)
	at org.apache.zookeeper.JUnit4ZKTestRunner$LoggedInvokeMethod.evaluate(JUnit4ZKTestRunner.java:79)
Mime
  • Unnamed multipart/mixed (inline, None, 0 bytes)
View raw message