zookeeper-dev mailing list archives

Site index · List index
Message view « Date » · « Thread »
Top « Date » · « Thread »
From Apache Jenkins Server <jenk...@builds.apache.org>
Subject ZooKeeper_branch35_jdk7 - Build # 1011 - Still Failing
Date Wed, 21 Jun 2017 08:48:24 GMT
See https://builds.apache.org/job/ZooKeeper_branch35_jdk7/1011/

###################################################################################
########################## LAST 60 LINES OF THE CONSOLE ###########################
[...truncated 96.96 MB...]
    [junit] 2017-06-21 08:48:18,854 [myid:127.0.0.1:24813] - WARN  [main-SendThread(127.0.0.1:24813):ClientCnxn$SendThread@1235]
- Session 0x204f505db600000 for server 127.0.0.1/127.0.0.1:24813, unexpected error, closing
socket connection and attempting reconnect
    [junit] java.net.ConnectException: Connection refused
    [junit] 	at sun.nio.ch.SocketChannelImpl.checkConnect(Native Method)
    [junit] 	at sun.nio.ch.SocketChannelImpl.finishConnect(SocketChannelImpl.java:744)
    [junit] 	at org.apache.zookeeper.ClientCnxnSocketNIO.doTransport(ClientCnxnSocketNIO.java:357)
    [junit] 	at org.apache.zookeeper.ClientCnxn$SendThread.run(ClientCnxn.java:1214)
    [junit] 2017-06-21 08:48:18,938 [myid:] - INFO  [ProcessThread(sid:0 cport:24933)::PrepRequestProcessor@613]
- Processed session termination for sessionid: 0x104f50904470000
    [junit] 2017-06-21 08:48:18,939 [myid:] - INFO  [SyncThread:0:MBeanRegistry@128] - Unregister
MBean [org.apache.ZooKeeperService:name0=StandaloneServer_port24933,name1=Connections,name2=127.0.0.1,name3=0x104f50904470000]
    [junit] 2017-06-21 08:48:18,939 [myid:] - INFO  [main:ZooKeeper@1331] - Session: 0x104f50904470000
closed
    [junit] 2017-06-21 08:48:18,939 [myid:] - INFO  [main-EventThread:ClientCnxn$EventThread@513]
- EventThread shut down for session: 0x104f50904470000
    [junit] 2017-06-21 08:48:18,940 [myid:] - INFO  [main:JUnit4ZKTestRunner$LoggedInvokeMethod@82]
- Memory used 232276
    [junit] 2017-06-21 08:48:18,940 [myid:] - INFO  [main:JUnit4ZKTestRunner$LoggedInvokeMethod@87]
- Number of threads 2428
    [junit] 2017-06-21 08:48:18,940 [myid:] - INFO  [main:JUnit4ZKTestRunner$LoggedInvokeMethod@102]
- FINISHED TEST METHOD testWatcherAutoResetWithLocal
    [junit] 2017-06-21 08:48:18,940 [myid:] - INFO  [main:ClientBase@586] - tearDown starting
    [junit] 2017-06-21 08:48:18,941 [myid:] - INFO  [main:ClientBase@556] - STOPPING server
    [junit] 2017-06-21 08:48:18,941 [myid:] - INFO  [main:NettyServerCnxnFactory@464] - shutdown
called 0.0.0.0/0.0.0.0:24933
    [junit] 2017-06-21 08:48:18,948 [myid:] - INFO  [main:ZooKeeperServer@541] - shutting
down
    [junit] 2017-06-21 08:48:18,948 [myid:] - ERROR [main:ZooKeeperServer@505] - ZKShutdownHandler
is not registered, so ZooKeeper server won't take any action on ERROR or SHUTDOWN server state
changes
    [junit] 2017-06-21 08:48:18,948 [myid:] - INFO  [main:SessionTrackerImpl@232] - Shutting
down
    [junit] 2017-06-21 08:48:18,949 [myid:] - INFO  [main:PrepRequestProcessor@1010] - Shutting
down
    [junit] 2017-06-21 08:48:18,949 [myid:] - INFO  [main:SyncRequestProcessor@191] - Shutting
down
    [junit] 2017-06-21 08:48:18,949 [myid:] - INFO  [ProcessThread(sid:0 cport:24933)::PrepRequestProcessor@156]
- PrepRequestProcessor exited loop!
    [junit] 2017-06-21 08:48:18,949 [myid:] - INFO  [SyncThread:0:SyncRequestProcessor@169]
- SyncRequestProcessor exited!
    [junit] 2017-06-21 08:48:18,950 [myid:] - INFO  [main:FinalRequestProcessor@481] - shutdown
of request processor complete
    [junit] 2017-06-21 08:48:18,950 [myid:] - INFO  [main:MBeanRegistry@128] - Unregister
MBean [org.apache.ZooKeeperService:name0=StandaloneServer_port24933,name1=InMemoryDataTree]
    [junit] 2017-06-21 08:48:18,950 [myid:] - INFO  [main:MBeanRegistry@128] - Unregister
MBean [org.apache.ZooKeeperService:name0=StandaloneServer_port24933]
    [junit] 2017-06-21 08:48:18,951 [myid:] - INFO  [main:FourLetterWordMain@85] - connecting
to 127.0.0.1 24933
    [junit] 2017-06-21 08:48:18,952 [myid:] - INFO  [main:JMXEnv@146] - ensureOnly:[]
    [junit] 2017-06-21 08:48:18,963 [myid:] - INFO  [main:ClientBase@611] - fdcount after
test is: 7142 at start it was 7142
    [junit] 2017-06-21 08:48:18,964 [myid:] - INFO  [main:ZKTestCase$1@68] - SUCCEEDED testWatcherAutoResetWithLocal
    [junit] 2017-06-21 08:48:18,964 [myid:] - INFO  [main:ZKTestCase$1@63] - FINISHED testWatcherAutoResetWithLocal
    [junit] Tests run: 103, Failures: 1, Errors: 0, Skipped: 0, Time elapsed: 409.786 sec,
Thread: 6, Class: org.apache.zookeeper.test.NioNettySuiteTest
    [junit] 2017-06-21 08:48:19,080 [myid:127.0.0.1:24687] - INFO  [main-SendThread(127.0.0.1:24687):ClientCnxn$SendThread@1113]
- Opening socket connection to server 127.0.0.1/127.0.0.1:24687. Will not attempt to authenticate
using SASL (unknown error)
    [junit] 2017-06-21 08:48:19,081 [myid:127.0.0.1:24687] - WARN  [main-SendThread(127.0.0.1:24687):ClientCnxn$SendThread@1235]
- Session 0x104f502dd940000 for server 127.0.0.1/127.0.0.1:24687, unexpected error, closing
socket connection and attempting reconnect
    [junit] java.net.ConnectException: Connection refused
    [junit] 	at sun.nio.ch.SocketChannelImpl.checkConnect(Native Method)
    [junit] 	at sun.nio.ch.SocketChannelImpl.finishConnect(SocketChannelImpl.java:744)
    [junit] 	at org.apache.zookeeper.ClientCnxnSocketNIO.doTransport(ClientCnxnSocketNIO.java:357)
    [junit] 	at org.apache.zookeeper.ClientCnxn$SendThread.run(ClientCnxn.java:1214)
    [junit] 2017-06-21 08:48:19,219 [myid:127.0.0.1:24744] - INFO  [VCC1-SendThread(127.0.0.1:24744):ClientCnxn$SendThread@1113]
- Opening socket connection to server 127.0.0.1/127.0.0.1:24744. Will not attempt to authenticate
using SASL (unknown error)
    [junit] 2017-06-21 08:48:19,220 [myid:127.0.0.1:24744] - WARN  [VCC1-SendThread(127.0.0.1:24744):ClientCnxn$SendThread@1235]
- Session 0x104f50367d90008 for server 127.0.0.1/127.0.0.1:24744, unexpected error, closing
socket connection and attempting reconnect
    [junit] java.net.ConnectException: Connection refused
    [junit] 	at sun.nio.ch.SocketChannelImpl.checkConnect(Native Method)
    [junit] 	at sun.nio.ch.SocketChannelImpl.finishConnect(SocketChannelImpl.java:744)
    [junit] 	at org.apache.zookeeper.ClientCnxnSocketNIO.doTransport(ClientCnxnSocketNIO.java:357)
    [junit] 	at org.apache.zookeeper.ClientCnxn$SendThread.run(ClientCnxn.java:1214)
    [junit] Test org.apache.zookeeper.test.NioNettySuiteTest FAILED

fail.build.on.test.failure:

BUILD FAILED
/home/jenkins/jenkins-slave/workspace/ZooKeeper_branch35_jdk7/build.xml:1219: The following
error occurred while executing this line:
/home/jenkins/jenkins-slave/workspace/ZooKeeper_branch35_jdk7/build.xml:1223: Tests failed!

Total time: 9 minutes 51 seconds
Build step 'Invoke Ant' marked build as failure
Recording test results
Email was triggered for: Failure - Any
Sending email for trigger: Failure - Any



###################################################################################
############################## FAILED TESTS (if any) ##############################
2 tests failed.
FAILED:  org.apache.zookeeper.test.ReconfigTest.testQuorumSystemChange

Error Message:
client could not connect to reestablished quorum: giving up after 30+ seconds.

Stack Trace:
junit.framework.AssertionFailedError: client could not connect to reestablished quorum: giving
up after 30+ seconds.
	at org.apache.zookeeper.test.ReconfigTest.testNormalOperation(ReconfigTest.java:183)
	at org.apache.zookeeper.test.ReconfigTest.testQuorumSystemChange(ReconfigTest.java:873)
	at org.apache.zookeeper.JUnit4ZKTestRunner$LoggedInvokeMethod.evaluate(JUnit4ZKTestRunner.java:79)


FAILED:  org.apache.zookeeper.test.ClientTest.testClientCleanup

Error Message:
null

Stack Trace:
junit.framework.AssertionFailedError
	at org.apache.zookeeper.test.ClientTest.testClientCleanup(ClientTest.java:807)
	at org.apache.zookeeper.JUnit4ZKTestRunner$LoggedInvokeMethod.evaluate(JUnit4ZKTestRunner.java:79)
Mime
  • Unnamed multipart/mixed (inline, None, 0 bytes)
View raw message