zookeeper-dev mailing list archives

Site index · List index
Message view « Date » · « Thread »
Top « Date » · « Thread »
From Apache Jenkins Server <jenk...@builds.apache.org>
Subject ZooKeeper-trunk-jdk8 - Build # 1069 - Still Failing
Date Thu, 01 Jun 2017 06:16:18 GMT
See https://builds.apache.org/job/ZooKeeper-trunk-jdk8/1069/

###################################################################################
########################## LAST 60 LINES OF THE CONSOLE ###########################
[...truncated 62.28 MB...]
    [junit] 2017-06-01 06:15:43,129 [myid:127.0.0.1:22240] - INFO  [main-SendThread(127.0.0.1:22240):ClientCnxn$SendThread@1113]
- Opening socket connection to server 127.0.0.1/127.0.0.1:22240. Will not attempt to authenticate
using SASL (unknown error)
    [junit] 2017-06-01 06:15:43,129 [myid:127.0.0.1:22240] - INFO  [main-SendThread(127.0.0.1:22240):ClientCnxn$SendThread@948]
- Socket connection established, initiating session, client: /127.0.0.1:46660, server: 127.0.0.1/127.0.0.1:22240
    [junit] 2017-06-01 06:15:43,130 [myid:] - INFO  [New I/O worker #3453:ZooKeeperServer@1026]
- Client attempting to renew session 0x1011f72b97f0000 at /127.0.0.1:46660
    [junit] 2017-06-01 06:15:43,130 [myid:] - INFO  [New I/O worker #3453:ZooKeeperServer@728]
- Established session 0x1011f72b97f0000 with negotiated timeout 6000 for client /127.0.0.1:46660
    [junit] 2017-06-01 06:15:43,131 [myid:127.0.0.1:22240] - INFO  [main-SendThread(127.0.0.1:22240):ClientCnxn$SendThread@1381]
- Session establishment complete on server 127.0.0.1/127.0.0.1:22240, sessionid = 0x1011f72b97f0000,
negotiated timeout = 6000
    [junit] 2017-06-01 06:15:43,136 [myid:] - INFO  [SyncThread:0:FileTxnLog@206] - Creating
new log file: log.7
    [junit] 2017-06-01 06:15:43,703 [myid:127.0.0.1:21994] - INFO  [main-SendThread(127.0.0.1:21994):ClientCnxn$SendThread@1113]
- Opening socket connection to server 127.0.0.1/127.0.0.1:21994. Will not attempt to authenticate
using SASL (unknown error)
    [junit] 2017-06-01 06:15:43,703 [myid:127.0.0.1:21994] - WARN  [main-SendThread(127.0.0.1:21994):ClientCnxn$SendThread@1235]
- Session 0x1011f6b78860000 for server 127.0.0.1/127.0.0.1:21994, unexpected error, closing
socket connection and attempting reconnect
    [junit] java.net.ConnectException: Connection refused
    [junit] 	at sun.nio.ch.SocketChannelImpl.checkConnect(Native Method)
    [junit] 	at sun.nio.ch.SocketChannelImpl.finishConnect(SocketChannelImpl.java:717)
    [junit] 	at org.apache.zookeeper.ClientCnxnSocketNIO.doTransport(ClientCnxnSocketNIO.java:357)
    [junit] 	at org.apache.zookeeper.ClientCnxn$SendThread.run(ClientCnxn.java:1214)
    [junit] 2017-06-01 06:15:44,150 [myid:] - INFO  [ProcessThread(sid:0 cport:22240)::PrepRequestProcessor@617]
- Processed session termination for sessionid: 0x1011f72b97f0000
    [junit] 2017-06-01 06:15:44,151 [myid:] - INFO  [SyncThread:0:MBeanRegistry@128] - Unregister
MBean [org.apache.ZooKeeperService:name0=StandaloneServer_port22240,name1=Connections,name2=127.0.0.1,name3=0x1011f72b97f0000]
    [junit] 2017-06-01 06:15:44,151 [myid:] - INFO  [main-EventThread:ClientCnxn$EventThread@513]
- EventThread shut down for session: 0x1011f72b97f0000
    [junit] 2017-06-01 06:15:44,151 [myid:] - INFO  [main:ZooKeeper@1329] - Session: 0x1011f72b97f0000
closed
    [junit] 2017-06-01 06:15:44,152 [myid:] - INFO  [main:JUnit4ZKTestRunner$LoggedInvokeMethod@82]
- Memory used 162979
    [junit] 2017-06-01 06:15:44,152 [myid:] - INFO  [main:JUnit4ZKTestRunner$LoggedInvokeMethod@87]
- Number of threads 859
    [junit] 2017-06-01 06:15:44,152 [myid:] - INFO  [main:JUnit4ZKTestRunner$LoggedInvokeMethod@102]
- FINISHED TEST METHOD testWatcherAutoResetWithLocal
    [junit] 2017-06-01 06:15:44,152 [myid:] - INFO  [main:ClientBase@582] - tearDown starting
    [junit] 2017-06-01 06:15:44,153 [myid:] - INFO  [main:ClientBase@552] - STOPPING server
    [junit] 2017-06-01 06:15:44,153 [myid:] - INFO  [main:NettyServerCnxnFactory@464] - shutdown
called 0.0.0.0/0.0.0.0:22240
    [junit] 2017-06-01 06:15:44,154 [myid:] - INFO  [main:ZooKeeperServer@542] - shutting
down
    [junit] 2017-06-01 06:15:44,154 [myid:] - ERROR [main:ZooKeeperServer@506] - ZKShutdownHandler
is not registered, so ZooKeeper server won't take any action on ERROR or SHUTDOWN server state
changes
    [junit] 2017-06-01 06:15:44,155 [myid:] - INFO  [main:SessionTrackerImpl@232] - Shutting
down
    [junit] 2017-06-01 06:15:44,155 [myid:] - INFO  [main:PrepRequestProcessor@1014] - Shutting
down
    [junit] 2017-06-01 06:15:44,155 [myid:] - INFO  [main:SyncRequestProcessor@191] - Shutting
down
    [junit] 2017-06-01 06:15:44,155 [myid:] - INFO  [SyncThread:0:SyncRequestProcessor@169]
- SyncRequestProcessor exited!
    [junit] 2017-06-01 06:15:44,155 [myid:] - INFO  [ProcessThread(sid:0 cport:22240)::PrepRequestProcessor@157]
- PrepRequestProcessor exited loop!
    [junit] 2017-06-01 06:15:44,155 [myid:] - INFO  [main:FinalRequestProcessor@481] - shutdown
of request processor complete
    [junit] 2017-06-01 06:15:44,156 [myid:] - INFO  [main:MBeanRegistry@128] - Unregister
MBean [org.apache.ZooKeeperService:name0=StandaloneServer_port22240,name1=InMemoryDataTree]
    [junit] 2017-06-01 06:15:44,156 [myid:] - INFO  [main:MBeanRegistry@128] - Unregister
MBean [org.apache.ZooKeeperService:name0=StandaloneServer_port22240]
    [junit] 2017-06-01 06:15:44,156 [myid:] - INFO  [main:FourLetterWordMain@85] - connecting
to 127.0.0.1 22240
    [junit] 2017-06-01 06:15:44,156 [myid:] - INFO  [main:JMXEnv@146] - ensureOnly:[]
    [junit] 2017-06-01 06:15:44,161 [myid:] - INFO  [main:ClientBase@607] - fdcount after
test is: 2547 at start it was 2547
    [junit] 2017-06-01 06:15:44,161 [myid:] - INFO  [main:ZKTestCase$1@68] - SUCCEEDED testWatcherAutoResetWithLocal
    [junit] 2017-06-01 06:15:44,161 [myid:] - INFO  [main:ZKTestCase$1@63] - FINISHED testWatcherAutoResetWithLocal
    [junit] Tests run: 103, Failures: 0, Errors: 0, Skipped: 0, Time elapsed: 481.888 sec,
Thread: 5, Class: org.apache.zookeeper.test.NioNettySuiteTest
    [junit] 2017-06-01 06:15:44,243 [myid:127.0.0.1:22123] - INFO  [main-SendThread(127.0.0.1:22123):ClientCnxn$SendThread@1113]
- Opening socket connection to server 127.0.0.1/127.0.0.1:22123. Will not attempt to authenticate
using SASL (unknown error)
    [junit] 2017-06-01 06:15:44,243 [myid:127.0.0.1:22123] - WARN  [main-SendThread(127.0.0.1:22123):ClientCnxn$SendThread@1235]
- Session 0x3011f6f7a1a0000 for server 127.0.0.1/127.0.0.1:22123, unexpected error, closing
socket connection and attempting reconnect
    [junit] java.net.ConnectException: Connection refused
    [junit] 	at sun.nio.ch.SocketChannelImpl.checkConnect(Native Method)
    [junit] 	at sun.nio.ch.SocketChannelImpl.finishConnect(SocketChannelImpl.java:717)
    [junit] 	at org.apache.zookeeper.ClientCnxnSocketNIO.doTransport(ClientCnxnSocketNIO.java:357)
    [junit] 	at org.apache.zookeeper.ClientCnxn$SendThread.run(ClientCnxn.java:1214)

fail.build.on.test.failure:

BUILD FAILED
/home/jenkins/jenkins-slave/workspace/ZooKeeper-trunk-jdk8/build.xml:1219: The following error
occurred while executing this line:
/home/jenkins/jenkins-slave/workspace/ZooKeeper-trunk-jdk8/build.xml:1223: Tests failed!

Total time: 12 minutes 31 seconds
Build step 'Invoke Ant' marked build as failure
[WARNINGS] Skipping publisher since build result is FAILURE
Recording test results
Email was triggered for: Failure - Any
Sending email for trigger: Failure - Any



###################################################################################
############################## FAILED TESTS (if any) ##############################
2 tests failed.
FAILED:  org.apache.zookeeper.server.quorum.ReconfigDuringLeaderSyncTest.testDuringLeaderSync

Error Message:
zoo.cfg.dynamic.next is not deleted.

Stack Trace:
junit.framework.AssertionFailedError: zoo.cfg.dynamic.next is not deleted.
	at org.apache.zookeeper.server.quorum.ReconfigDuringLeaderSyncTest.testDuringLeaderSync(ReconfigDuringLeaderSyncTest.java:165)
	at org.apache.zookeeper.JUnit4ZKTestRunner$LoggedInvokeMethod.evaluate(JUnit4ZKTestRunner.java:79)


FAILED:  org.apache.zookeeper.test.WatchEventWhenAutoResetTest.testNodeDataChanged

Error Message:
expected:<NodeDataChanged> but was:<NodeDeleted>

Stack Trace:
junit.framework.AssertionFailedError: expected:<NodeDataChanged> but was:<NodeDeleted>
	at org.apache.zookeeper.test.WatchEventWhenAutoResetTest$EventsWatcher.assertEvent(WatchEventWhenAutoResetTest.java:67)
	at org.apache.zookeeper.test.WatchEventWhenAutoResetTest.testNodeDataChanged(WatchEventWhenAutoResetTest.java:117)
	at org.apache.zookeeper.JUnit4ZKTestRunner$LoggedInvokeMethod.evaluate(JUnit4ZKTestRunner.java:79)
Mime
  • Unnamed multipart/mixed (inline, None, 0 bytes)
View raw message