zookeeper-dev mailing list archives

Site index · List index
Message view « Date » · « Thread »
Top « Date » · « Thread »
From Apache Jenkins Server <jenk...@builds.apache.org>
Subject ZooKeeper-trunk-openjdk7 - Build # 1518 - Still Failing
Date Wed, 21 Jun 2017 20:33:03 GMT
See https://builds.apache.org/job/ZooKeeper-trunk-openjdk7/1518/

###################################################################################
########################## LAST 60 LINES OF THE CONSOLE ###########################
[...truncated 60.37 MB...]
    [junit] 2017-06-21 20:32:20,260 [myid:127.0.0.1:30303] - INFO  [main-SendThread(127.0.0.1:30303):ClientCnxn$SendThread@1113]
- Opening socket connection to server 127.0.0.1/127.0.0.1:30303. Will not attempt to authenticate
using SASL (unknown error)
    [junit] 2017-06-21 20:32:20,260 [myid:127.0.0.1:30303] - INFO  [main-SendThread(127.0.0.1:30303):ClientCnxn$SendThread@946]
- Socket connection established, initiating session, client: /127.0.0.1:47728, server: 127.0.0.1/127.0.0.1:30303
    [junit] 2017-06-21 20:32:20,261 [myid:] - INFO  [New I/O worker #2960:ZooKeeperServer@1021]
- Client attempting to establish new session at /127.0.0.1:47728
    [junit] 2017-06-21 20:32:20,261 [myid:] - INFO  [main:ZooKeeper@863] - Initiating client
connection, connectString=127.0.0.1:30306 sessionTimeout=30000 watcher=org.apache.zookeeper.test.ReconfigTest$1@937da75
    [junit] 2017-06-21 20:32:20,262 [myid:] - INFO  [main:ClientCnxnSocket@236] - jute.maxbuffer
value is 4194304 Bytes
    [junit] 2017-06-21 20:32:20,265 [myid:127.0.0.1:30306] - INFO  [main-SendThread(127.0.0.1:30306):ClientCnxn$SendThread@1113]
- Opening socket connection to server 127.0.0.1/127.0.0.1:30306. Will not attempt to authenticate
using SASL (unknown error)
    [junit] 2017-06-21 20:32:20,266 [myid:127.0.0.1:30306] - INFO  [main-SendThread(127.0.0.1:30306):ClientCnxn$SendThread@946]
- Socket connection established, initiating session, client: /127.0.0.1:55796, server: 127.0.0.1/127.0.0.1:30306
    [junit] 2017-06-21 20:32:20,266 [myid:] - INFO  [New I/O worker #2977:ZooKeeperServer@1021]
- Client attempting to establish new session at /127.0.0.1:55796
    [junit] 2017-06-21 20:32:20,267 [myid:] - INFO  [main:ZooKeeper@863] - Initiating client
connection, connectString=127.0.0.1:30309 sessionTimeout=30000 watcher=org.apache.zookeeper.test.ReconfigTest$1@5c0bb1d5
    [junit] 2017-06-21 20:32:20,295 [myid:127.0.0.1:30288] - INFO  [main-SendThread(127.0.0.1:30288):ClientCnxn$SendThread@1113]
- Opening socket connection to server 127.0.0.1/127.0.0.1:30288. Will not attempt to authenticate
using SASL (unknown error)
    [junit] 2017-06-21 20:32:20,280 [myid:127.0.0.1:30306] - INFO  [main-SendThread(127.0.0.1:30306):ClientCnxn$SendThread@1381]
- Session establishment complete on server 127.0.0.1/127.0.0.1:30306, sessionid = 0x40445cc9e330000,
negotiated timeout = 30000
    [junit] 2017-06-21 20:32:20,280 [myid:] - INFO  [CommitProcWorkThread-1:ZooKeeperServer@728]
- Established session 0x40445cc9e330000 with negotiated timeout 30000 for client /127.0.0.1:55796
    [junit] 2017-06-21 20:32:20,274 [myid:127.0.0.1:30303] - INFO  [main-SendThread(127.0.0.1:30303):ClientCnxn$SendThread@1381]
- Session establishment complete on server 127.0.0.1/127.0.0.1:30303, sessionid = 0x30445cc9dd20000,
negotiated timeout = 30000
    [junit] 2017-06-21 20:32:20,273 [myid:] - INFO  [CommitProcWorkThread-1:ZooKeeperServer@728]
- Established session 0x30445cc9dd20000 with negotiated timeout 30000 for client /127.0.0.1:47728
    [junit] 2017-06-21 20:32:20,268 [myid:127.0.0.1:30300] - INFO  [main-SendThread(127.0.0.1:30300):ClientCnxn$SendThread@1381]
- Session establishment complete on server 127.0.0.1/127.0.0.1:30300, sessionid = 0x20445cc9dcf0000,
negotiated timeout = 30000
    [junit] 2017-06-21 20:32:20,268 [myid:] - INFO  [CommitProcWorkThread-1:ZooKeeperServer@728]
- Established session 0x20445cc9dcf0000 with negotiated timeout 30000 for client /127.0.0.1:40442
    [junit] 2017-06-21 20:32:20,324 [myid:127.0.0.1:30288] - WARN  [main-SendThread(127.0.0.1:30288):ClientCnxn$SendThread@1235]
- Session 0x10445c4c5610001 for server 127.0.0.1/127.0.0.1:30288, unexpected error, closing
socket connection and attempting reconnect
    [junit] java.net.ConnectException: Connection refused
    [junit] 	at sun.nio.ch.SocketChannelImpl.checkConnect(Native Method)
    [junit] 	at sun.nio.ch.SocketChannelImpl.finishConnect(SocketChannelImpl.java:739)
    [junit] 	at org.apache.zookeeper.ClientCnxnSocketNIO.doTransport(ClientCnxnSocketNIO.java:357)
    [junit] 	at org.apache.zookeeper.ClientCnxn$SendThread.run(ClientCnxn.java:1214)
    [junit] 2017-06-21 20:32:20,324 [myid:] - INFO  [main:ClientCnxnSocket@236] - jute.maxbuffer
value is 4194304 Bytes
    [junit] 2017-06-21 20:32:20,331 [myid:127.0.0.1:30309] - INFO  [main-SendThread(127.0.0.1:30309):ClientCnxn$SendThread@1113]
- Opening socket connection to server 127.0.0.1/127.0.0.1:30309. Will not attempt to authenticate
using SASL (unknown error)
    [junit] 2017-06-21 20:32:20,332 [myid:127.0.0.1:30309] - INFO  [main-SendThread(127.0.0.1:30309):ClientCnxn$SendThread@946]
- Socket connection established, initiating session, client: /127.0.0.1:33720, server: 127.0.0.1/127.0.0.1:30309
    [junit] 2017-06-21 20:32:20,333 [myid:] - INFO  [New I/O worker #2994:ZooKeeperServer@1021]
- Client attempting to establish new session at /127.0.0.1:33720
    [junit] 2017-06-21 20:32:20,333 [myid:] - INFO  [main:ZooKeeper@863] - Initiating client
connection, connectString=127.0.0.1:30297 sessionTimeout=30000 watcher=org.apache.zookeeper.test.ReconfigTest$2@68407cdd
    [junit] 2017-06-21 20:32:20,334 [myid:] - INFO  [main:ClientCnxnSocket@236] - jute.maxbuffer
value is 4194304 Bytes
    [junit] 2017-06-21 20:32:20,336 [myid:] - INFO  [main:ZooKeeper@863] - Initiating client
connection, connectString=127.0.0.1:30300 sessionTimeout=30000 watcher=org.apache.zookeeper.test.ReconfigTest$2@2a8085ef
    [junit] 2017-06-21 20:32:20,337 [myid:] - INFO  [main:ClientCnxnSocket@236] - jute.maxbuffer
value is 4194304 Bytes
    [junit] 2017-06-21 20:32:20,338 [myid:127.0.0.1:30297] - INFO  [main-SendThread(127.0.0.1:30297):ClientCnxn$SendThread@1113]
- Opening socket connection to server 127.0.0.1/127.0.0.1:30297. Will not attempt to authenticate
using SASL (unknown error)
    [junit] 2017-06-21 20:32:20,342 [myid:127.0.0.1:30297] - INFO  [main-SendThread(127.0.0.1:30297):ClientCnxn$SendThread@946]
- Socket connection established, initiating session, client: /127.0.0.1:34110, server: 127.0.0.1/127.0.0.1:30297
    [junit] 2017-06-21 20:32:20,342 [myid:] - INFO  [main:ZooKeeper@863] - Initiating client
connection, connectString=127.0.0.1:30303 sessionTimeout=30000 watcher=org.apache.zookeeper.test.ReconfigTest$2@60667262
    [junit] 2017-06-21 20:32:20,343 [myid:] - INFO  [main:ClientCnxnSocket@236] - jute.maxbuffer
value is 4194304 Bytes
    [junit] 2017-06-21 20:32:20,343 [myid:] - INFO  [CommitProcWorkThread-1:ZooKeeperServer@728]
- Established session 0x50445cc9ddb0000 with negotiated timeout 30000 for client /127.0.0.1:33720
    [junit] 2017-06-21 20:32:20,340 [myid:127.0.0.1:30300] - INFO  [main-SendThread(127.0.0.1:30300):ClientCnxn$SendThread@1113]
- Opening socket connection to server 127.0.0.1/127.0.0.1:30300. Will not attempt to authenticate
using SASL (unknown error)
    [junit] 2017-06-21 20:32:20,342 [myid:] - INFO  [New I/O worker #2934:ZooKeeperServer@1021]
- Client attempting to establish new session at /127.0.0.1:34110
    [junit] 2017-06-21 20:32:20,344 [myid:127.0.0.1:30309] - INFO  [main-SendThread(127.0.0.1:30309):ClientCnxn$SendThread@1381]
- Session establishment complete on server 127.0.0.1/127.0.0.1:30309, sessionid = 0x50445cc9ddb0000,
negotiated timeout = 30000
    [junit] 2017-06-21 20:32:20,344 [myid:127.0.0.1:30300] - INFO  [main-SendThread(127.0.0.1:30300):ClientCnxn$SendThread@946]
- Socket connection established, initiating session, client: /127.0.0.1:40454, server: 127.0.0.1/127.0.0.1:30300
    [junit] 2017-06-21 20:32:20,347 [myid:] - INFO  [New I/O worker #2944:ZooKeeperServer@1021]
- Client attempting to establish new session at /127.0.0.1:40454
    [junit] 2017-06-21 20:32:20,351 [myid:127.0.0.1:30303] - INFO  [main-SendThread(127.0.0.1:30303):ClientCnxn$SendThread@1113]
- Opening socket connection to server 127.0.0.1/127.0.0.1:30303. Will not attempt to authenticate
using SASL (unknown error)
    [junit] 2017-06-21 20:32:20,422 [myid:127.0.0.1:30291] - INFO  [main-SendThread(127.0.0.1:30291):ClientCnxn$SendThread@1113]
- Opening socket connection to server 127.0.0.1/127.0.0.1:30291. Will not attempt to authenticate
using SASL (unknown error)
    [junit] 2017-06-21 20:32:20,388 [myid:] - INFO  [CommitProcWorkThread-2:ZooKeeperServer@728]
- Established session 0x10445cc9e810001 with negotiated timeout 30000 for client /127.0.0.1:34110
    [junit] 2017-06-21 20:32:20,387 [myid:127.0.0.1:30297] - INFO  [main-SendThread(127.0.0.1:30297):ClientCnxn$SendThread@1381]
- Session establishment complete on server 127.0.0.1/127.0.0.1:30297, sessionid = 0x10445cc9e810001,
negotiated timeout = 30000
    [junit] Running org.apache.zookeeper.test.NioNettySuiteTest in thread 8
    [junit] Tests run: 1, Failures: 0, Errors: 1, Skipped: 0, Time elapsed: 0 sec, Thread:
8, Class: org.apache.zookeeper.test.NioNettySuiteTest
    [junit] Test org.apache.zookeeper.test.NioNettySuiteTest FAILED (timeout)

fail.build.on.test.failure:

BUILD FAILED
/home/jenkins/jenkins-slave/workspace/ZooKeeper-trunk-openjdk7/build.xml:1219: The following
error occurred while executing this line:
/home/jenkins/jenkins-slave/workspace/ZooKeeper-trunk-openjdk7/build.xml:1223: Tests failed!

Total time: 20 minutes 3 seconds
Build step 'Invoke Ant' marked build as failure
Recording test results
Email was triggered for: Failure - Any
Sending email for trigger: Failure - Any



###################################################################################
############################## FAILED TESTS (if any) ##############################
2 tests failed.
FAILED:  org.apache.zookeeper.server.quorum.Zab1_0Test.testNormalFollowerRunWithDiff

Error Message:
expected:<4294967298> but was:<4294967297>

Stack Trace:
junit.framework.AssertionFailedError: expected:<4294967298> but was:<4294967297>
	at org.apache.zookeeper.server.quorum.Zab1_0Test$5.converseWithFollower(Zab1_0Test.java:869)
	at org.apache.zookeeper.server.quorum.Zab1_0Test.testFollowerConversation(Zab1_0Test.java:517)
	at org.apache.zookeeper.server.quorum.Zab1_0Test.testNormalFollowerRunWithDiff(Zab1_0Test.java:784)
	at org.apache.zookeeper.JUnit4ZKTestRunner$LoggedInvokeMethod.evaluate(JUnit4ZKTestRunner.java:79)


FAILED:  org.apache.zookeeper.test.NioNettySuiteTest.testRemoveOneAsynchronous

Error Message:
Timeout occurred. Please note the time in the report does not reflect the time until the timeout.

Stack Trace:
junit.framework.AssertionFailedError: Timeout occurred. Please note the time in the report
does not reflect the time until the timeout.
	at java.lang.Thread.run(Thread.java:745)
Mime
  • Unnamed multipart/mixed (inline, None, 0 bytes)
View raw message