zookeeper-dev mailing list archives

Site index · List index
Message view « Date » · « Thread »
Top « Date » · « Thread »
From Apache Jenkins Server <jenk...@builds.apache.org>
Subject ZooKeeper_branch34 - Build # 1992 - Failure
Date Thu, 22 Jun 2017 02:26:34 GMT
See https://builds.apache.org/job/ZooKeeper_branch34/1992/

###################################################################################
########################## LAST 60 LINES OF THE CONSOLE ###########################
[...truncated 31.30 MB...]
    [junit] 2017-06-22 02:26:31,277 [myid:] - INFO  [main:SyncRequestProcessor@208] - Shutting
down
    [junit] 2017-06-22 02:26:31,278 [myid:] - INFO  [ProcessThread(sid:0 cport:11221)::PrepRequestProcessor@144]
- PrepRequestProcessor exited loop!
    [junit] 2017-06-22 02:26:31,278 [myid:] - INFO  [SyncThread:0:SyncRequestProcessor@186]
- SyncRequestProcessor exited!
    [junit] 2017-06-22 02:26:31,278 [myid:] - INFO  [main:FinalRequestProcessor@403] - shutdown
of request processor complete
    [junit] 2017-06-22 02:26:31,279 [myid:] - INFO  [main:FourLetterWordMain@62] - connecting
to 127.0.0.1 11221
    [junit] 2017-06-22 02:26:31,279 [myid:] - INFO  [main:JMXEnv@147] - ensureOnly:[]
    [junit] 2017-06-22 02:26:31,281 [myid:] - INFO  [main:ClientBase@489] - STARTING server
    [junit] 2017-06-22 02:26:31,281 [myid:] - INFO  [main:ClientBase@410] - CREATING server
instance 127.0.0.1:11221
    [junit] 2017-06-22 02:26:31,282 [myid:] - INFO  [main:ServerCnxnFactory@111] - Using org.apache.zookeeper.server.NIOServerCnxnFactory
as server connection factory
    [junit] 2017-06-22 02:26:31,282 [myid:] - INFO  [main:NIOServerCnxnFactory@89] - binding
to port 0.0.0.0/0.0.0.0:11221
    [junit] 2017-06-22 02:26:31,282 [myid:] - INFO  [main:ClientBase@385] - STARTING server
instance 127.0.0.1:11221
    [junit] 2017-06-22 02:26:31,283 [myid:] - INFO  [main:ZooKeeperServer@173] - Created server
with tickTime 3000 minSessionTimeout 6000 maxSessionTimeout 60000 datadir /home/jenkins/jenkins-slave/workspace/ZooKeeper_branch34/build/test/tmp/test2104433024321857789.junit.dir/version-2
snapdir /home/jenkins/jenkins-slave/workspace/ZooKeeper_branch34/build/test/tmp/test2104433024321857789.junit.dir/version-2
    [junit] 2017-06-22 02:26:31,288 [myid:] - ERROR [main:ZooKeeperServer@468] - ZKShutdownHandler
is not registered, so ZooKeeper server won't take any action on ERROR or SHUTDOWN server state
changes
    [junit] 2017-06-22 02:26:31,288 [myid:] - INFO  [main:FourLetterWordMain@62] - connecting
to 127.0.0.1 11221
    [junit] 2017-06-22 02:26:31,289 [myid:] - INFO  [NIOServerCxn.Factory:0.0.0.0/0.0.0.0:11221:NIOServerCnxnFactory@192]
- Accepted socket connection from /127.0.0.1:49289
    [junit] 2017-06-22 02:26:31,289 [myid:] - INFO  [NIOServerCxn.Factory:0.0.0.0/0.0.0.0:11221:NIOServerCnxn@883]
- Processing stat command from /127.0.0.1:49289
    [junit] 2017-06-22 02:26:31,290 [myid:] - INFO  [Thread-4:NIOServerCnxn$StatCommand@674]
- Stat command output
    [junit] 2017-06-22 02:26:31,290 [myid:] - INFO  [Thread-4:NIOServerCnxn@1044] - Closed
socket connection for client /127.0.0.1:49289 (no session established for client)
    [junit] 2017-06-22 02:26:31,291 [myid:] - INFO  [main:JMXEnv@230] - ensureParent:[InMemoryDataTree,
StandaloneServer_port]
    [junit] 2017-06-22 02:26:31,293 [myid:] - INFO  [main:JMXEnv@247] - expect:InMemoryDataTree
    [junit] 2017-06-22 02:26:31,293 [myid:] - INFO  [main:JMXEnv@251] - found:InMemoryDataTree
org.apache.ZooKeeperService:name0=StandaloneServer_port11221,name1=InMemoryDataTree
    [junit] 2017-06-22 02:26:31,293 [myid:] - INFO  [main:JMXEnv@247] - expect:StandaloneServer_port
    [junit] 2017-06-22 02:26:31,293 [myid:] - INFO  [main:JMXEnv@251] - found:StandaloneServer_port
org.apache.ZooKeeperService:name0=StandaloneServer_port11221
    [junit] 2017-06-22 02:26:31,294 [myid:] - INFO  [main:JUnit4ZKTestRunner$LoggedInvokeMethod@58]
- Memory used 35692
    [junit] 2017-06-22 02:26:31,294 [myid:] - INFO  [main:JUnit4ZKTestRunner$LoggedInvokeMethod@63]
- Number of threads 20
    [junit] 2017-06-22 02:26:31,294 [myid:] - INFO  [main:JUnit4ZKTestRunner$LoggedInvokeMethod@78]
- FINISHED TEST METHOD testQuota
    [junit] 2017-06-22 02:26:31,295 [myid:] - INFO  [main:ClientBase@566] - tearDown starting
    [junit] 2017-06-22 02:26:31,358 [myid:] - INFO  [main:ZooKeeper@684] - Session: 0x101250ccbd80000
closed
    [junit] 2017-06-22 02:26:31,358 [myid:] - INFO  [main:ClientBase@536] - STOPPING server
    [junit] 2017-06-22 02:26:31,358 [myid:] - INFO  [main-EventThread:ClientCnxn$EventThread@520]
- EventThread shut down for session: 0x101250ccbd80000
    [junit] 2017-06-22 02:26:31,358 [myid:] - INFO  [NIOServerCxn.Factory:0.0.0.0/0.0.0.0:11221:NIOServerCnxnFactory@219]
- NIOServerCnxn factory exited run method
    [junit] 2017-06-22 02:26:31,359 [myid:] - INFO  [main:ZooKeeperServer@501] - shutting
down
    [junit] 2017-06-22 02:26:31,359 [myid:] - ERROR [main:ZooKeeperServer@468] - ZKShutdownHandler
is not registered, so ZooKeeper server won't take any action on ERROR or SHUTDOWN server state
changes
    [junit] 2017-06-22 02:26:31,359 [myid:] - INFO  [main:SessionTrackerImpl@226] - Shutting
down
    [junit] 2017-06-22 02:26:31,359 [myid:] - INFO  [main:PrepRequestProcessor@769] - Shutting
down
    [junit] 2017-06-22 02:26:31,360 [myid:] - INFO  [main:SyncRequestProcessor@208] - Shutting
down
    [junit] 2017-06-22 02:26:31,360 [myid:] - INFO  [ProcessThread(sid:0 cport:11221)::PrepRequestProcessor@144]
- PrepRequestProcessor exited loop!
    [junit] 2017-06-22 02:26:31,360 [myid:] - INFO  [SyncThread:0:SyncRequestProcessor@186]
- SyncRequestProcessor exited!
    [junit] 2017-06-22 02:26:31,360 [myid:] - INFO  [main:FinalRequestProcessor@403] - shutdown
of request processor complete
    [junit] 2017-06-22 02:26:31,361 [myid:] - INFO  [main:FourLetterWordMain@62] - connecting
to 127.0.0.1 11221
    [junit] 2017-06-22 02:26:31,362 [myid:] - INFO  [main:JMXEnv@147] - ensureOnly:[]
    [junit] 2017-06-22 02:26:31,369 [myid:] - INFO  [main:ClientBase@591] - fdcount after
test is: 93 at start it was 81
    [junit] 2017-06-22 02:26:31,369 [myid:] - INFO  [main:ClientBase@593] - sleeping for 20
secs
    [junit] 2017-06-22 02:26:31,370 [myid:] - INFO  [main:ZKTestCase$1@69] - SUCCEEDED testQuota
    [junit] 2017-06-22 02:26:31,370 [myid:] - INFO  [main:ZKTestCase$1@64] - FINISHED testQuota
    [junit] Tests run: 1, Failures: 0, Errors: 0, Skipped: 0, Time elapsed: 0.717 sec

fail.build.on.test.failure:

BUILD FAILED
/home/jenkins/jenkins-slave/workspace/ZooKeeper_branch34/build.xml:1422: The following error
occurred while executing this line:
/home/jenkins/jenkins-slave/workspace/ZooKeeper_branch34/build.xml:1330: The following error
occurred while executing this line:
/home/jenkins/jenkins-slave/workspace/ZooKeeper_branch34/build.xml:1333: Tests failed!

Total time: 39 minutes 47 seconds
Build step 'Execute shell' marked build as failure
Recording test results
Email was triggered for: Failure - Any
Sending email for trigger: Failure - Any



###################################################################################
############################## FAILED TESTS (if any) ##############################
1 tests failed.
FAILED:  org.apache.zookeeper.test.FollowerTest.testNoLogBeforeLeaderEstablishment

Error Message:
Not following

Stack Trace:
junit.framework.AssertionFailedError: Not following
	at org.apache.zookeeper.test.FollowerTest.testNoLogBeforeLeaderEstablishment(FollowerTest.java:181)
	at org.apache.zookeeper.JUnit4ZKTestRunner$LoggedInvokeMethod.evaluate(JUnit4ZKTestRunner.java:55)
Mime
  • Unnamed multipart/mixed (inline, None, 0 bytes)
View raw message