zookeeper-dev mailing list archives

Site index · List index
Message view « Date » · « Thread »
Top « Date » · « Thread »
From Apache Jenkins Server <jenk...@builds.apache.org>
Subject ZooKeeper-trunk - Build # 3436 - Still Failing
Date Tue, 20 Jun 2017 23:26:48 GMT
See https://builds.apache.org/job/ZooKeeper-trunk/3436/

###################################################################################
########################## LAST 60 LINES OF THE CONSOLE ###########################
[...truncated 63.24 MB...]
    [junit] 	at org.jboss.netty.channel.DefaultChannelPipeline.sendDownstream(DefaultChannelPipeline.java:591)
    [junit] 	at org.jboss.netty.channel.DefaultChannelPipeline.sendDownstream(DefaultChannelPipeline.java:582)
    [junit] 	at org.jboss.netty.channel.Channels.close(Channels.java:812)
    [junit] 	at org.jboss.netty.channel.AbstractChannel.close(AbstractChannel.java:206)
    [junit] 	at org.apache.zookeeper.server.NettyServerCnxn.close(NettyServerCnxn.java:118)
    [junit] 	at org.apache.zookeeper.server.NettyServerCnxn.sendBuffer(NettyServerCnxn.java:221)
    [junit] 	at org.apache.zookeeper.server.NettyServerCnxn.sendCloseSession(NettyServerCnxn.java:460)
    [junit] 	at org.apache.zookeeper.server.FinalRequestProcessor.processRequest(FinalRequestProcessor.java:461)
    [junit] 	at org.apache.zookeeper.server.SyncRequestProcessor.flush(SyncRequestProcessor.java:182)
    [junit] 	at org.apache.zookeeper.server.SyncRequestProcessor.run(SyncRequestProcessor.java:113)
    [junit] 2017-06-20 23:26:37,068 [myid:] - INFO  [main:ZooKeeper@1329] - Session: 0x104f1847fff0000
closed
    [junit] 2017-06-20 23:26:37,069 [myid:] - INFO  [main:JUnit4ZKTestRunner$LoggedInvokeMethod@82]
- Memory used 241676
    [junit] 2017-06-20 23:26:37,069 [myid:] - INFO  [main:JUnit4ZKTestRunner$LoggedInvokeMethod@87]
- Number of threads 2427
    [junit] 2017-06-20 23:26:37,069 [myid:] - INFO  [main:JUnit4ZKTestRunner$LoggedInvokeMethod@102]
- FINISHED TEST METHOD testWatcherAutoResetWithLocal
    [junit] 2017-06-20 23:26:37,069 [myid:] - INFO  [main:ClientBase@601] - tearDown starting
    [junit] 2017-06-20 23:26:37,069 [myid:] - INFO  [main:ClientBase@571] - STOPPING server
    [junit] 2017-06-20 23:26:37,069 [myid:] - INFO  [main:NettyServerCnxnFactory@464] - shutdown
called 0.0.0.0/0.0.0.0:11468
    [junit] 2017-06-20 23:26:37,069 [myid:] - INFO  [main-EventThread:ClientCnxn$EventThread@513]
- EventThread shut down for session: 0x104f1847fff0000
    [junit] 2017-06-20 23:26:37,074 [myid:] - INFO  [main:ZooKeeperServer@542] - shutting
down
    [junit] 2017-06-20 23:26:37,074 [myid:] - ERROR [main:ZooKeeperServer@506] - ZKShutdownHandler
is not registered, so ZooKeeper server won't take any action on ERROR or SHUTDOWN server state
changes
    [junit] 2017-06-20 23:26:37,074 [myid:] - INFO  [main:SessionTrackerImpl@232] - Shutting
down
    [junit] 2017-06-20 23:26:37,074 [myid:] - INFO  [main:PrepRequestProcessor@1014] - Shutting
down
    [junit] 2017-06-20 23:26:37,075 [myid:] - INFO  [main:SyncRequestProcessor@191] - Shutting
down
    [junit] 2017-06-20 23:26:37,075 [myid:] - INFO  [SyncThread:0:SyncRequestProcessor@169]
- SyncRequestProcessor exited!
    [junit] 2017-06-20 23:26:37,075 [myid:] - INFO  [ProcessThread(sid:0 cport:11468)::PrepRequestProcessor@157]
- PrepRequestProcessor exited loop!
    [junit] 2017-06-20 23:26:37,075 [myid:] - INFO  [main:FinalRequestProcessor@481] - shutdown
of request processor complete
    [junit] 2017-06-20 23:26:37,075 [myid:] - INFO  [main:MBeanRegistry@128] - Unregister
MBean [org.apache.ZooKeeperService:name0=StandaloneServer_port11468,name1=InMemoryDataTree]
    [junit] 2017-06-20 23:26:37,075 [myid:] - INFO  [main:MBeanRegistry@128] - Unregister
MBean [org.apache.ZooKeeperService:name0=StandaloneServer_port11468]
    [junit] 2017-06-20 23:26:37,075 [myid:] - INFO  [main:FourLetterWordMain@85] - connecting
to 127.0.0.1 11468
    [junit] 2017-06-20 23:26:37,076 [myid:] - INFO  [main:JMXEnv@146] - ensureOnly:[]
    [junit] 2017-06-20 23:26:37,084 [myid:] - INFO  [main:ClientBase@626] - fdcount after
test is: 7137 at start it was 7137
    [junit] 2017-06-20 23:26:37,084 [myid:] - INFO  [main:ZKTestCase$1@68] - SUCCEEDED testWatcherAutoResetWithLocal
    [junit] 2017-06-20 23:26:37,084 [myid:] - INFO  [main:ZKTestCase$1@63] - FINISHED testWatcherAutoResetWithLocal
    [junit] Tests run: 103, Failures: 0, Errors: 0, Skipped: 0, Time elapsed: 423.973 sec,
Thread: 1, Class: org.apache.zookeeper.test.NioNettySuiteTest

fail.build.on.test.failure:

BUILD FAILED
/home/jenkins/jenkins-slave/workspace/ZooKeeper-trunk/build.xml:1338: The following error
occurred while executing this line:
/home/jenkins/jenkins-slave/workspace/ZooKeeper-trunk/build.xml:1219: The following error
occurred while executing this line:
/home/jenkins/jenkins-slave/workspace/ZooKeeper-trunk/build.xml:1223: Tests failed!

Total time: 10 minutes 19 seconds
Build step 'Execute shell' marked build as failure
[FINDBUGS] Skipping publisher since build result is FAILURE
[WARNINGS] Skipping publisher since build result is FAILURE
Archiving artifacts
Setting JDK_1_7_LATEST__HOME=/home/jenkins/tools/java/latest1.7
Recording fingerprints
Setting JDK_1_7_LATEST__HOME=/home/jenkins/tools/java/latest1.7
Recording test results
Setting JDK_1_7_LATEST__HOME=/home/jenkins/tools/java/latest1.7
Publishing Javadoc
Setting JDK_1_7_LATEST__HOME=/home/jenkins/tools/java/latest1.7
Setting JDK_1_7_LATEST__HOME=/home/jenkins/tools/java/latest1.7
Email was triggered for: Failure - Any
Sending email for trigger: Failure - Any
Setting JDK_1_7_LATEST__HOME=/home/jenkins/tools/java/latest1.7
Setting JDK_1_7_LATEST__HOME=/home/jenkins/tools/java/latest1.7



###################################################################################
############################## FAILED TESTS (if any) ##############################
1 tests failed.
FAILED:  org.apache.zookeeper.test.WatchEventWhenAutoResetTest.testNodeDataChanged

Error Message:
expected:<NodeDataChanged> but was:<NodeDeleted>

Stack Trace:
junit.framework.AssertionFailedError: expected:<NodeDataChanged> but was:<NodeDeleted>
	at org.apache.zookeeper.test.WatchEventWhenAutoResetTest$EventsWatcher.assertEvent(WatchEventWhenAutoResetTest.java:67)
	at org.apache.zookeeper.test.WatchEventWhenAutoResetTest.testNodeDataChanged(WatchEventWhenAutoResetTest.java:126)
	at org.apache.zookeeper.JUnit4ZKTestRunner$LoggedInvokeMethod.evaluate(JUnit4ZKTestRunner.java:79)
Mime
  • Unnamed multipart/mixed (inline, None, 0 bytes)
View raw message