zookeeper-dev mailing list archives

Site index · List index
Message view « Date » · « Thread »
Top « Date » · « Thread »
From Apache Jenkins Server <jenk...@builds.apache.org>
Subject ZooKeeper_branch34 - Build # 1976 - Failure
Date Fri, 09 Jun 2017 17:35:20 GMT
See https://builds.apache.org/job/ZooKeeper_branch34/1976/

###################################################################################
########################## LAST 60 LINES OF THE CONSOLE ###########################
[...truncated 15.76 KB...]
     [exec] final-check:
     [exec] 
     [exec] fetchplugin:
     [exec] Fetch-plugin Ok, installing !
     [exec] 
     [exec] unpack-plugin:
     [exec] 
     [exec] install-plugin:
     [exec] 
     [exec] configure-plugin:
     [exec] 
     [exec] configure-input-plugin:
     [exec] Mounting input plugin: org.apache.forrest.plugin.input.simplifiedDocbook
     [exec] Processing /home/jenkins/jenkins-slave/workspace/ZooKeeper_branch34/src/docs/build/tmp/input.xmap
to /home/jenkins/jenkins-slave/workspace/ZooKeeper_branch34/src/docs/build/tmp/input.xmap.new
     [exec] Loading stylesheet /home/jenkins/tools/forrest/latest/main/var/pluginMountSnippet.xsl
     [exec] Moving 1 file to /home/jenkins/jenkins-slave/workspace/ZooKeeper_branch34/src/docs/build/tmp
     [exec] Processing /home/jenkins/jenkins-slave/workspace/ZooKeeper_branch34/src/docs/build/tmp/resources.xmap
to /home/jenkins/jenkins-slave/workspace/ZooKeeper_branch34/src/docs/build/tmp/resources.xmap.new
     [exec] Loading stylesheet /home/jenkins/tools/forrest/latest/main/var/pluginMountSnippet.xsl
     [exec] Moving 1 file to /home/jenkins/jenkins-slave/workspace/ZooKeeper_branch34/src/docs/build/tmp
     [exec] 
     [exec] configure-plugin-locationmap:
     [exec] Mounting plugin locationmap for org.apache.forrest.plugin.input.simplifiedDocbook
     [exec] Processing /home/jenkins/jenkins-slave/workspace/ZooKeeper_branch34/src/docs/build/tmp/locationmap.xml
to /home/jenkins/jenkins-slave/workspace/ZooKeeper_branch34/src/docs/build/tmp/locationmap.xml.new
     [exec] Loading stylesheet /home/jenkins/tools/forrest/latest/main/var/pluginLmMountSnippet.xsl
     [exec] Moving 1 file to /home/jenkins/jenkins-slave/workspace/ZooKeeper_branch34/src/docs/build/tmp
     [exec] 
     [exec] init:
     [exec] 
     [exec] -prepare-classpath:
     [exec] 
     [exec] check-contentdir:
     [exec] 
     [exec] examine-proj:
     [exec] 
     [exec] validation-props:
     [exec] Using these catalog descriptors: /home/jenkins/tools/forrest/latest/main/webapp/resources/schema/catalog.xcat:/home/jenkins/tools/forrest/latest/build/plugins/catalog.xcat:/home/jenkins/jenkins-slave/workspace/ZooKeeper_branch34/src/docs/src/documentation/resources/schema/catalog.xcat
     [exec] 
     [exec] validate-xdocs:
     [exec] /home/jenkins/jenkins-slave/workspace/ZooKeeper_branch34/src/docs/src/documentation/content/xdocs/zookeeperAdmin.xml:1104:67:
The end-tag for element type "emphasis" must end with a '>' delimiter.
     [exec] 
     [exec] BUILD FAILED
     [exec] /home/jenkins/tools/forrest/latest/main/targets/validate.xml:135: Could not validate
document /home/jenkins/jenkins-slave/workspace/ZooKeeper_branch34/src/docs/src/documentation/content/xdocs/zookeeperAdmin.xml
     [exec] 
     [exec] Total time: 4 seconds

BUILD FAILED
/home/jenkins/jenkins-slave/workspace/ZooKeeper_branch34/build.xml:450: exec returned: 1

Total time: 5 seconds
mv: cannot stat 'build/*.tar.gz': No such file or directory
mv: cannot stat 'build/*.jar': No such file or directory
mv: cannot stat 'build/test/findbugs': No such file or directory
mv: cannot stat 'build/docs/api': No such file or directory
Build Failed
Build step 'Execute shell' marked build as failure
Recording test results
ERROR: Step ?Publish JUnit test result report? failed: No test report files were found. Configuration
error?
Email was triggered for: Failure - Any
Sending email for trigger: Failure - Any



###################################################################################
############################## FAILED TESTS (if any) ##############################
No tests ran.
Mime
  • Unnamed multipart/mixed (inline, None, 0 bytes)
View raw message