zookeeper-dev mailing list archives

Site index · List index
Message view « Date » · « Thread »
Top « Date » · « Thread »
From Apache Jenkins Server <jenk...@builds.apache.org>
Subject ZooKeeper-trunk-openjdk7 - Build # 1528 - Still Failing
Date Thu, 29 Jun 2017 20:09:03 GMT
See https://builds.apache.org/job/ZooKeeper-trunk-openjdk7/1528/

###################################################################################
########################## LAST 60 LINES OF THE CONSOLE ###########################
[...truncated 62.48 MB...]
    [junit] 	at org.apache.zookeeper.ClientCnxnSocketNIO.doTransport(ClientCnxnSocketNIO.java:357)
    [junit] 	at org.apache.zookeeper.ClientCnxn$SendThread.run(ClientCnxn.java:1214)
    [junit] 2017-06-29 20:08:53,684 [myid:127.0.0.1:22120] - INFO  [main-SendThread(127.0.0.1:22120):ClientCnxn$SendThread@1113]
- Opening socket connection to server 127.0.0.1/127.0.0.1:22120. Will not attempt to authenticate
using SASL (unknown error)
    [junit] 2017-06-29 20:08:53,685 [myid:127.0.0.1:22120] - WARN  [main-SendThread(127.0.0.1:22120):ClientCnxn$SendThread@1235]
- Session 0x20520a059450000 for server 127.0.0.1/127.0.0.1:22120, unexpected error, closing
socket connection and attempting reconnect
    [junit] java.net.ConnectException: Connection refused
    [junit] 	at sun.nio.ch.SocketChannelImpl.checkConnect(Native Method)
    [junit] 	at sun.nio.ch.SocketChannelImpl.finishConnect(SocketChannelImpl.java:739)
    [junit] 	at org.apache.zookeeper.ClientCnxnSocketNIO.doTransport(ClientCnxnSocketNIO.java:357)
    [junit] 	at org.apache.zookeeper.ClientCnxn$SendThread.run(ClientCnxn.java:1214)
    [junit] 2017-06-29 20:08:54,358 [myid:127.0.0.1:22123] - INFO  [main-SendThread(127.0.0.1:22123):ClientCnxn$SendThread@1113]
- Opening socket connection to server 127.0.0.1/127.0.0.1:22123. Will not attempt to authenticate
using SASL (unknown error)
    [junit] 2017-06-29 20:08:54,359 [myid:127.0.0.1:22123] - WARN  [main-SendThread(127.0.0.1:22123):ClientCnxn$SendThread@1235]
- Session 0x30520a055690000 for server 127.0.0.1/127.0.0.1:22123, unexpected error, closing
socket connection and attempting reconnect
    [junit] java.net.ConnectException: Connection refused
    [junit] 	at sun.nio.ch.SocketChannelImpl.checkConnect(Native Method)
    [junit] 	at sun.nio.ch.SocketChannelImpl.finishConnect(SocketChannelImpl.java:739)
    [junit] 	at org.apache.zookeeper.ClientCnxnSocketNIO.doTransport(ClientCnxnSocketNIO.java:357)
    [junit] 	at org.apache.zookeeper.ClientCnxn$SendThread.run(ClientCnxn.java:1214)
    [junit] 2017-06-29 20:08:54,956 [myid:127.0.0.1:22117] - INFO  [main-SendThread(127.0.0.1:22117):ClientCnxn$SendThread@1113]
- Opening socket connection to server 127.0.0.1/127.0.0.1:22117. Will not attempt to authenticate
using SASL (unknown error)
    [junit] 2017-06-29 20:08:54,957 [myid:127.0.0.1:22117] - WARN  [main-SendThread(127.0.0.1:22117):ClientCnxn$SendThread@1235]
- Session 0x10520a055620000 for server 127.0.0.1/127.0.0.1:22117, unexpected error, closing
socket connection and attempting reconnect
    [junit] java.net.ConnectException: Connection refused
    [junit] 	at sun.nio.ch.SocketChannelImpl.checkConnect(Native Method)
    [junit] 	at sun.nio.ch.SocketChannelImpl.finishConnect(SocketChannelImpl.java:739)
    [junit] 	at org.apache.zookeeper.ClientCnxnSocketNIO.doTransport(ClientCnxnSocketNIO.java:357)
    [junit] 	at org.apache.zookeeper.ClientCnxn$SendThread.run(ClientCnxn.java:1214)
    [junit] 2017-06-29 20:08:55,198 [myid:127.0.0.1:21994] - INFO  [main-SendThread(127.0.0.1:21994):ClientCnxn$SendThread@1113]
- Opening socket connection to server 127.0.0.1/127.0.0.1:21994. Will not attempt to authenticate
using SASL (unknown error)
    [junit] 2017-06-29 20:08:55,199 [myid:127.0.0.1:21994] - WARN  [main-SendThread(127.0.0.1:21994):ClientCnxn$SendThread@1235]
- Session 0x105209d642d0000 for server 127.0.0.1/127.0.0.1:21994, unexpected error, closing
socket connection and attempting reconnect
    [junit] java.net.ConnectException: Connection refused
    [junit] 	at sun.nio.ch.SocketChannelImpl.checkConnect(Native Method)
    [junit] 	at sun.nio.ch.SocketChannelImpl.finishConnect(SocketChannelImpl.java:739)
    [junit] 	at org.apache.zookeeper.ClientCnxnSocketNIO.doTransport(ClientCnxnSocketNIO.java:357)
    [junit] 	at org.apache.zookeeper.ClientCnxn$SendThread.run(ClientCnxn.java:1214)
    [junit] 2017-06-29 20:08:55,374 [myid:127.0.0.1:22120] - INFO  [main-SendThread(127.0.0.1:22120):ClientCnxn$SendThread@1113]
- Opening socket connection to server 127.0.0.1/127.0.0.1:22120. Will not attempt to authenticate
using SASL (unknown error)
    [junit] 2017-06-29 20:08:55,375 [myid:127.0.0.1:22120] - WARN  [main-SendThread(127.0.0.1:22120):ClientCnxn$SendThread@1235]
- Session 0x20520a059450000 for server 127.0.0.1/127.0.0.1:22120, unexpected error, closing
socket connection and attempting reconnect
    [junit] java.net.ConnectException: Connection refused
    [junit] 	at sun.nio.ch.SocketChannelImpl.checkConnect(Native Method)
    [junit] 	at sun.nio.ch.SocketChannelImpl.finishConnect(SocketChannelImpl.java:739)
    [junit] 	at org.apache.zookeeper.ClientCnxnSocketNIO.doTransport(ClientCnxnSocketNIO.java:357)
    [junit] 	at org.apache.zookeeper.ClientCnxn$SendThread.run(ClientCnxn.java:1214)
    [junit] 2017-06-29 20:08:55,690 [myid:127.0.0.1:22123] - INFO  [main-SendThread(127.0.0.1:22123):ClientCnxn$SendThread@1113]
- Opening socket connection to server 127.0.0.1/127.0.0.1:22123. Will not attempt to authenticate
using SASL (unknown error)
    [junit] 2017-06-29 20:08:55,691 [myid:127.0.0.1:22123] - WARN  [main-SendThread(127.0.0.1:22123):ClientCnxn$SendThread@1235]
- Session 0x30520a055690000 for server 127.0.0.1/127.0.0.1:22123, unexpected error, closing
socket connection and attempting reconnect
    [junit] java.net.ConnectException: Connection refused
    [junit] 	at sun.nio.ch.SocketChannelImpl.checkConnect(Native Method)
    [junit] 	at sun.nio.ch.SocketChannelImpl.finishConnect(SocketChannelImpl.java:739)
    [junit] 	at org.apache.zookeeper.ClientCnxnSocketNIO.doTransport(ClientCnxnSocketNIO.java:357)
    [junit] 	at org.apache.zookeeper.ClientCnxn$SendThread.run(ClientCnxn.java:1214)
    [junit] Running org.apache.zookeeper.test.NioNettySuiteTest in thread 5
    [junit] Tests run: 1, Failures: 0, Errors: 1, Skipped: 0, Time elapsed: 0 sec, Thread:
5, Class: org.apache.zookeeper.test.NioNettySuiteTest
    [junit] Test org.apache.zookeeper.test.NioNettySuiteTest FAILED (timeout)

fail.build.on.test.failure:

BUILD FAILED
/home/jenkins/jenkins-slave/workspace/ZooKeeper-trunk-openjdk7/build.xml:1219: The following
error occurred while executing this line:
/home/jenkins/jenkins-slave/workspace/ZooKeeper-trunk-openjdk7/build.xml:1223: Tests failed!

Total time: 17 minutes 49 seconds
Build step 'Invoke Ant' marked build as failure
Recording test results
Email was triggered for: Failure - Any
Sending email for trigger: Failure - Any



###################################################################################
############################## FAILED TESTS (if any) ##############################
1 tests failed.
FAILED:  org.apache.zookeeper.test.NioNettySuiteTest.testJMXBeanAfterRoleChange

Error Message:
Timeout occurred. Please note the time in the report does not reflect the time until the timeout.

Stack Trace:
junit.framework.AssertionFailedError: Timeout occurred. Please note the time in the report
does not reflect the time until the timeout.
	at java.lang.Thread.run(Thread.java:745)
Mime
  • Unnamed multipart/mixed (inline, None, 0 bytes)
View raw message