zookeeper-dev mailing list archives

Site index · List index
Message view « Date » · « Thread »
Top « Date » · « Thread »
From Apache Jenkins Server <jenk...@builds.apache.org>
Subject ZooKeeper-trunk-openjdk7 - Build # 1464 - Still Failing
Date Wed, 10 May 2017 21:03:32 GMT
See https://builds.apache.org/job/ZooKeeper-trunk-openjdk7/1464/

###################################################################################
########################## LAST 60 LINES OF THE CONSOLE ###########################
[...truncated 56.17 MB...]
    [junit] 2017-05-10 21:03:11,802 [myid:127.0.0.1:24687] - INFO  [main-SendThread(127.0.0.1:24687):ClientCnxn$SendThread@1113]
- Opening socket connection to server 127.0.0.1/127.0.0.1:24687. Will not attempt to authenticate
using SASL (unknown error)
    [junit] 2017-05-10 21:03:11,803 [myid:127.0.0.1:24687] - WARN  [main-SendThread(127.0.0.1:24687):ClientCnxn$SendThread@1235]
- Session 0x1041ef25c970000 for server 127.0.0.1/127.0.0.1:24687, unexpected error, closing
socket connection and attempting reconnect
    [junit] java.net.ConnectException: Connection refused
    [junit] 	at sun.nio.ch.SocketChannelImpl.checkConnect(Native Method)
    [junit] 	at sun.nio.ch.SocketChannelImpl.finishConnect(SocketChannelImpl.java:739)
    [junit] 	at org.apache.zookeeper.ClientCnxnSocketNIO.doTransport(ClientCnxnSocketNIO.java:357)
    [junit] 	at org.apache.zookeeper.ClientCnxn$SendThread.run(ClientCnxn.java:1214)
    [junit] 2017-05-10 21:03:11,913 [myid:127.0.0.1:24810] - INFO  [main-SendThread(127.0.0.1:24810):ClientCnxn$SendThread@1113]
- Opening socket connection to server 127.0.0.1/127.0.0.1:24810. Will not attempt to authenticate
using SASL (unknown error)
    [junit] 2017-05-10 21:03:11,914 [myid:127.0.0.1:24810] - WARN  [main-SendThread(127.0.0.1:24810):ClientCnxn$SendThread@1235]
- Session 0x1041ef6a7c50000 for server 127.0.0.1/127.0.0.1:24810, unexpected error, closing
socket connection and attempting reconnect
    [junit] java.net.ConnectException: Connection refused
    [junit] 	at sun.nio.ch.SocketChannelImpl.checkConnect(Native Method)
    [junit] 	at sun.nio.ch.SocketChannelImpl.finishConnect(SocketChannelImpl.java:739)
    [junit] 	at org.apache.zookeeper.ClientCnxnSocketNIO.doTransport(ClientCnxnSocketNIO.java:357)
    [junit] 	at org.apache.zookeeper.ClientCnxn$SendThread.run(ClientCnxn.java:1214)
    [junit] 2017-05-10 21:03:11,920 [myid:127.0.0.1:24816] - INFO  [main-SendThread(127.0.0.1:24816):ClientCnxn$SendThread@1113]
- Opening socket connection to server 127.0.0.1/127.0.0.1:24816. Will not attempt to authenticate
using SASL (unknown error)
    [junit] 2017-05-10 21:03:11,921 [myid:127.0.0.1:24816] - WARN  [main-SendThread(127.0.0.1:24816):ClientCnxn$SendThread@1235]
- Session 0x3041ef6a7cb0000 for server 127.0.0.1/127.0.0.1:24816, unexpected error, closing
socket connection and attempting reconnect
    [junit] java.net.ConnectException: Connection refused
    [junit] 	at sun.nio.ch.SocketChannelImpl.checkConnect(Native Method)
    [junit] 	at sun.nio.ch.SocketChannelImpl.finishConnect(SocketChannelImpl.java:739)
    [junit] 	at org.apache.zookeeper.ClientCnxnSocketNIO.doTransport(ClientCnxnSocketNIO.java:357)
    [junit] 	at org.apache.zookeeper.ClientCnxn$SendThread.run(ClientCnxn.java:1214)
    [junit] 2017-05-10 21:03:12,288 [myid:] - INFO  [ProcessThread(sid:0 cport:24933)::PrepRequestProcessor@617]
- Processed session termination for sessionid: 0x1041ef9cef00000
    [junit] 2017-05-10 21:03:12,289 [myid:] - INFO  [SyncThread:0:MBeanRegistry@128] - Unregister
MBean [org.apache.ZooKeeperService:name0=StandaloneServer_port24933,name1=Connections,name2=127.0.0.1,name3=0x1041ef9cef00000]
    [junit] 2017-05-10 21:03:12,290 [myid:] - INFO  [main:ZooKeeper@1329] - Session: 0x1041ef9cef00000
closed
    [junit] 2017-05-10 21:03:12,290 [myid:] - INFO  [main-EventThread:ClientCnxn$EventThread@513]
- EventThread shut down for session: 0x1041ef9cef00000
    [junit] 2017-05-10 21:03:12,290 [myid:] - INFO  [main:JUnit4ZKTestRunner$LoggedInvokeMethod@82]
- Memory used 204613
    [junit] 2017-05-10 21:03:12,290 [myid:] - INFO  [main:JUnit4ZKTestRunner$LoggedInvokeMethod@87]
- Number of threads 2427
    [junit] 2017-05-10 21:03:12,290 [myid:] - INFO  [main:JUnit4ZKTestRunner$LoggedInvokeMethod@102]
- FINISHED TEST METHOD testWatcherAutoResetWithLocal
    [junit] 2017-05-10 21:03:12,291 [myid:] - INFO  [main:ClientBase@582] - tearDown starting
    [junit] 2017-05-10 21:03:12,291 [myid:] - INFO  [main:ClientBase@552] - STOPPING server
    [junit] 2017-05-10 21:03:12,291 [myid:] - INFO  [main:NettyServerCnxnFactory@464] - shutdown
called 0.0.0.0/0.0.0.0:24933
    [junit] 2017-05-10 21:03:12,297 [myid:] - INFO  [main:ZooKeeperServer@542] - shutting
down
    [junit] 2017-05-10 21:03:12,297 [myid:] - ERROR [main:ZooKeeperServer@506] - ZKShutdownHandler
is not registered, so ZooKeeper server won't take any action on ERROR or SHUTDOWN server state
changes
    [junit] 2017-05-10 21:03:12,297 [myid:] - INFO  [main:SessionTrackerImpl@232] - Shutting
down
    [junit] 2017-05-10 21:03:12,297 [myid:] - INFO  [main:PrepRequestProcessor@1008] - Shutting
down
    [junit] 2017-05-10 21:03:12,298 [myid:] - INFO  [main:SyncRequestProcessor@191] - Shutting
down
    [junit] 2017-05-10 21:03:12,298 [myid:] - INFO  [ProcessThread(sid:0 cport:24933)::PrepRequestProcessor@157]
- PrepRequestProcessor exited loop!
    [junit] 2017-05-10 21:03:12,298 [myid:] - INFO  [SyncThread:0:SyncRequestProcessor@169]
- SyncRequestProcessor exited!
    [junit] 2017-05-10 21:03:12,298 [myid:] - INFO  [main:FinalRequestProcessor@481] - shutdown
of request processor complete
    [junit] 2017-05-10 21:03:12,298 [myid:] - INFO  [main:MBeanRegistry@128] - Unregister
MBean [org.apache.ZooKeeperService:name0=StandaloneServer_port24933,name1=InMemoryDataTree]
    [junit] 2017-05-10 21:03:12,299 [myid:] - INFO  [main:MBeanRegistry@128] - Unregister
MBean [org.apache.ZooKeeperService:name0=StandaloneServer_port24933]
    [junit] 2017-05-10 21:03:12,299 [myid:] - INFO  [main:FourLetterWordMain@85] - connecting
to 127.0.0.1 24933
    [junit] 2017-05-10 21:03:12,299 [myid:] - INFO  [main:JMXEnv@146] - ensureOnly:[]
    [junit] 2017-05-10 21:03:12,315 [myid:] - INFO  [main:ClientBase@607] - fdcount after
test is: 7137 at start it was 7137
    [junit] 2017-05-10 21:03:12,316 [myid:] - INFO  [main:ZKTestCase$1@68] - SUCCEEDED testWatcherAutoResetWithLocal
    [junit] 2017-05-10 21:03:12,316 [myid:] - INFO  [main:ZKTestCase$1@63] - FINISHED testWatcherAutoResetWithLocal
    [junit] Tests run: 103, Failures: 0, Errors: 0, Skipped: 0, Time elapsed: 494.656 sec,
Thread: 6, Class: org.apache.zookeeper.test.NioNettySuiteTest

fail.build.on.test.failure:

BUILD FAILED
/home/jenkins/jenkins-slave/workspace/ZooKeeper-trunk-openjdk7/build.xml:1219: The following
error occurred while executing this line:
/home/jenkins/jenkins-slave/workspace/ZooKeeper-trunk-openjdk7/build.xml:1223: Tests failed!

Total time: 11 minutes 55 seconds
Build step 'Invoke Ant' marked build as failure
Recording test results
Email was triggered for: Failure - Any
Sending email for trigger: Failure - Any



###################################################################################
############################## FAILED TESTS (if any) ##############################
1 tests failed.
FAILED:  org.apache.zookeeper.test.LETest.testLE

Error Message:
Thread 5 got 27 expected 28

Stack Trace:
junit.framework.AssertionFailedError: Thread 5 got 27 expected 28
	at org.apache.zookeeper.test.LETest.testLE(LETest.java:135)
	at org.apache.zookeeper.JUnit4ZKTestRunner$LoggedInvokeMethod.evaluate(JUnit4ZKTestRunner.java:79)
Mime
  • Unnamed multipart/mixed (inline, None, 0 bytes)
View raw message