zookeeper-dev mailing list archives

Site index · List index
Message view « Date » · « Thread »
Top « Date » · « Thread »
From Apache Jenkins Server <jenk...@builds.apache.org>
Subject ZooKeeper_branch34 - Build # 1947 - Failure
Date Wed, 17 May 2017 00:25:19 GMT
See https://builds.apache.org/job/ZooKeeper_branch34/1947/

###################################################################################
########################## LAST 60 LINES OF THE CONSOLE ###########################
[...truncated 31.67 MB...]
     [exec] Zookeeper_init::testBasic : elapsed 0 : OK
     [exec] Zookeeper_init::testAddressResolution : elapsed 0 : OK
     [exec] Zookeeper_init::testMultipleAddressResolution : elapsed 0 : OK
     [exec] Zookeeper_init::testNullAddressString : elapsed 0 : OK
     [exec] Zookeeper_init::testEmptyAddressString : elapsed 0 : OK
     [exec] Zookeeper_init::testOneSpaceAddressString : elapsed 0 : OK
     [exec] Zookeeper_init::testTwoSpacesAddressString : elapsed 0 : OK
     [exec] Zookeeper_init::testInvalidAddressString1 : elapsed 0 : OK
     [exec] Zookeeper_init::testInvalidAddressString2 : elapsed 417 : OK
     [exec] Zookeeper_init::testNonexistentHost : elapsed 13 : OK
     [exec] Zookeeper_init::testOutOfMemory_init : elapsed 0 : OK
     [exec] Zookeeper_init::testOutOfMemory_getaddrs1 : elapsed 0 : OK
     [exec] Zookeeper_init::testOutOfMemory_getaddrs2 : elapsed 0 : OK
     [exec] Zookeeper_init::testPermuteAddrsList : elapsed 0 : OK
     [exec] Zookeeper_close::testIOThreadStoppedOnExpire : elapsed 289 : OK
     [exec] Zookeeper_close::testCloseUnconnected : elapsed 0 : OK
     [exec] Zookeeper_close::testCloseUnconnected1 : elapsed 80 : OK
     [exec] Zookeeper_close::testCloseConnected1 : elapsed 300 : OK
     [exec] Zookeeper_close::testCloseFromWatcher1 : elapsed 271 : OK
     [exec] Zookeeper_simpleSystem::testAsyncWatcherAutoReset ZooKeeper server started : elapsed
12187 : OK
     [exec] Zookeeper_simpleSystem::testDeserializeString : elapsed 0 : OK
     [exec] Zookeeper_simpleSystem::testFirstServerDown : elapsed 1001 : OK
     [exec] Zookeeper_simpleSystem::testNullData : elapsed 1027 : OK
     [exec] Zookeeper_simpleSystem::testIPV6 : elapsed 1002 : OK
     [exec] Zookeeper_simpleSystem::testPath : elapsed 1020 : OK
     [exec] Zookeeper_simpleSystem::testPathValidation : elapsed 1070 : OK
     [exec] Zookeeper_simpleSystem::testPing : elapsed 17191 : OK
     [exec] Zookeeper_simpleSystem::testAcl : elapsed 1031 : OK
     [exec] Zookeeper_simpleSystem::testChroot : elapsed 3036 : OK
     [exec] Zookeeper_simpleSystem::testAuth ZooKeeper server started ZooKeeper server started
: elapsed 34432 : OK
     [exec] Zookeeper_simpleSystem::testHangingClient : elapsed 1036 : OK
     [exec] Zookeeper_simpleSystem::testWatcherAutoResetWithGlobal ZooKeeper server started
ZooKeeper server started ZooKeeper server started : elapsed 20706 : OK
     [exec] Zookeeper_simpleSystem::testWatcherAutoResetWithLocal ZooKeeper server started
ZooKeeper server started ZooKeeper server started : elapsed 20654 : OK
     [exec] Zookeeper_simpleSystem::testGetChildren2 : elapsed 1034 : OK
     [exec] Zookeeper_multi::testCreate : elapsed 1011 : OK
     [exec] Zookeeper_multi::testCreateDelete : elapsed 1004 : OK
     [exec] Zookeeper_multi::testInvalidVersion : elapsed 1007 : OK
     [exec] Zookeeper_multi::testNestedCreate : elapsed 1008 : OK
     [exec] Zookeeper_multi::testSetData : elapsed 6012 : OK
     [exec] Zookeeper_multi::testUpdateConflict : elapsed 1007 : OK
     [exec] Zookeeper_multi::testDeleteUpdateConflict : elapsed 1004 : OK
     [exec] Zookeeper_multi::testAsyncMulti : elapsed 2001 : OK
     [exec] Zookeeper_multi::testMultiFail : elapsed 1003 : OK
     [exec] Zookeeper_multi::testCheck : elapsed 1024 : OK
     [exec] Zookeeper_multi::testWatch : elapsed 2013 : OK
     [exec] Zookeeper_multi::testSequentialNodeCreateInAsyncMultiMakefile:1902: recipe for
target 'run-check' failed
     [exec] zktest-mt: /home/jenkins/jenkins-slave/workspace/ZooKeeper_branch34/src/c/src/zookeeper.c:1994:
deserialize_multi: Assertion `entry' failed.
     [exec] make: *** [run-check] Aborted

BUILD FAILED
/home/jenkins/jenkins-slave/workspace/ZooKeeper_branch34/build.xml:1422: The following error
occurred while executing this line:
/home/jenkins/jenkins-slave/workspace/ZooKeeper_branch34/build.xml:1382: The following error
occurred while executing this line:
/home/jenkins/jenkins-slave/workspace/ZooKeeper_branch34/build.xml:1392: exec returned: 2

Total time: 34 minutes 6 seconds
Build step 'Execute shell' marked build as failure
Recording test results
Email was triggered for: Failure - Any
Sending email for trigger: Failure - Any



###################################################################################
############################## FAILED TESTS (if any) ##############################
All tests passed
Mime
  • Unnamed multipart/mixed (inline, None, 0 bytes)
View raw message