zookeeper-dev mailing list archives

Site index · List index
Message view « Date » · « Thread »
Top « Date » · « Thread »
From Apache Jenkins Server <jenk...@builds.apache.org>
Subject ZooKeeper-trunk-openjdk7 - Build # 1479 - Failure
Date Tue, 23 May 2017 20:08:38 GMT
See https://builds.apache.org/job/ZooKeeper-trunk-openjdk7/1479/

###################################################################################
########################## LAST 60 LINES OF THE CONSOLE ###########################
[...truncated 64.31 MB...]
    [junit] 	at org.apache.zookeeper.ClientCnxnSocketNIO.doTransport(ClientCnxnSocketNIO.java:357)
    [junit] 	at org.apache.zookeeper.ClientCnxn$SendThread.run(ClientCnxn.java:1214)
    [junit] 2017-05-23 20:08:31,721 [myid:127.0.0.1:16608] - INFO  [main-SendThread(127.0.0.1:16608):ClientCnxn$SendThread@1113]
- Opening socket connection to server 127.0.0.1/127.0.0.1:16608. Will not attempt to authenticate
using SASL (unknown error)
    [junit] 2017-05-23 20:08:31,722 [myid:127.0.0.1:16608] - WARN  [main-SendThread(127.0.0.1:16608):ClientCnxn$SendThread@1235]
- Session 0x461d63e990000 for server 127.0.0.1/127.0.0.1:16608, unexpected error, closing
socket connection and attempting reconnect
    [junit] java.net.ConnectException: Connection refused
    [junit] 	at sun.nio.ch.SocketChannelImpl.checkConnect(Native Method)
    [junit] 	at sun.nio.ch.SocketChannelImpl.finishConnect(SocketChannelImpl.java:739)
    [junit] 	at org.apache.zookeeper.ClientCnxnSocketNIO.doTransport(ClientCnxnSocketNIO.java:357)
    [junit] 	at org.apache.zookeeper.ClientCnxn$SendThread.run(ClientCnxn.java:1214)
    [junit] 2017-05-23 20:08:31,789 [myid:127.0.0.1:16608] - INFO  [main-SendThread(127.0.0.1:16608):ClientCnxn$SendThread@1113]
- Opening socket connection to server 127.0.0.1/127.0.0.1:16608. Will not attempt to authenticate
using SASL (unknown error)
    [junit] 2017-05-23 20:08:31,789 [myid:127.0.0.1:16608] - WARN  [main-SendThread(127.0.0.1:16608):ClientCnxn$SendThread@1235]
- Session 0x461d63e990001 for server 127.0.0.1/127.0.0.1:16608, unexpected error, closing
socket connection and attempting reconnect
    [junit] java.net.ConnectException: Connection refused
    [junit] 	at sun.nio.ch.SocketChannelImpl.checkConnect(Native Method)
    [junit] 	at sun.nio.ch.SocketChannelImpl.finishConnect(SocketChannelImpl.java:739)
    [junit] 	at org.apache.zookeeper.ClientCnxnSocketNIO.doTransport(ClientCnxnSocketNIO.java:357)
    [junit] 	at org.apache.zookeeper.ClientCnxn$SendThread.run(ClientCnxn.java:1214)
    [junit] 2017-05-23 20:08:33,370 [myid:127.0.0.1:16608] - INFO  [main-SendThread(127.0.0.1:16608):ClientCnxn$SendThread@1113]
- Opening socket connection to server 127.0.0.1/127.0.0.1:16608. Will not attempt to authenticate
using SASL (unknown error)
    [junit] 2017-05-23 20:08:33,370 [myid:127.0.0.1:16608] - WARN  [main-SendThread(127.0.0.1:16608):ClientCnxn$SendThread@1235]
- Session 0x461d63e990001 for server 127.0.0.1/127.0.0.1:16608, unexpected error, closing
socket connection and attempting reconnect
    [junit] java.net.ConnectException: Connection refused
    [junit] 	at sun.nio.ch.SocketChannelImpl.checkConnect(Native Method)
    [junit] 	at sun.nio.ch.SocketChannelImpl.finishConnect(SocketChannelImpl.java:739)
    [junit] 	at org.apache.zookeeper.ClientCnxnSocketNIO.doTransport(ClientCnxnSocketNIO.java:357)
    [junit] 	at org.apache.zookeeper.ClientCnxn$SendThread.run(ClientCnxn.java:1214)
    [junit] 2017-05-23 20:08:33,442 [myid:127.0.0.1:16611] - INFO  [main-SendThread(127.0.0.1:16611):ClientCnxn$SendThread@1113]
- Opening socket connection to server 127.0.0.1/127.0.0.1:16611. Will not attempt to authenticate
using SASL (unknown error)
    [junit] 2017-05-23 20:08:33,443 [myid:127.0.0.1:16611] - WARN  [main-SendThread(127.0.0.1:16611):ClientCnxn$SendThread@1235]
- Session 0x10461d6405a0000 for server 127.0.0.1/127.0.0.1:16611, unexpected error, closing
socket connection and attempting reconnect
    [junit] java.net.ConnectException: Connection refused
    [junit] 	at sun.nio.ch.SocketChannelImpl.checkConnect(Native Method)
    [junit] 	at sun.nio.ch.SocketChannelImpl.finishConnect(SocketChannelImpl.java:739)
    [junit] 	at org.apache.zookeeper.ClientCnxnSocketNIO.doTransport(ClientCnxnSocketNIO.java:357)
    [junit] 	at org.apache.zookeeper.ClientCnxn$SendThread.run(ClientCnxn.java:1214)
    [junit] 2017-05-23 20:08:33,445 [myid:127.0.0.1:16608] - INFO  [main-SendThread(127.0.0.1:16608):ClientCnxn$SendThread@1113]
- Opening socket connection to server 127.0.0.1/127.0.0.1:16608. Will not attempt to authenticate
using SASL (unknown error)
    [junit] 2017-05-23 20:08:33,445 [myid:127.0.0.1:16608] - WARN  [main-SendThread(127.0.0.1:16608):ClientCnxn$SendThread@1235]
- Session 0x461d63e990000 for server 127.0.0.1/127.0.0.1:16608, unexpected error, closing
socket connection and attempting reconnect
    [junit] java.net.ConnectException: Connection refused
    [junit] 	at sun.nio.ch.SocketChannelImpl.checkConnect(Native Method)
    [junit] 	at sun.nio.ch.SocketChannelImpl.finishConnect(SocketChannelImpl.java:739)
    [junit] 	at org.apache.zookeeper.ClientCnxnSocketNIO.doTransport(ClientCnxnSocketNIO.java:357)
    [junit] 	at org.apache.zookeeper.ClientCnxn$SendThread.run(ClientCnxn.java:1214)
    [junit] 2017-05-23 20:08:33,562 [myid:127.0.0.1:16611] - INFO  [main-SendThread(127.0.0.1:16611):ClientCnxn$SendThread@1113]
- Opening socket connection to server 127.0.0.1/127.0.0.1:16611. Will not attempt to authenticate
using SASL (unknown error)
    [junit] 2017-05-23 20:08:33,563 [myid:127.0.0.1:16611] - WARN  [main-SendThread(127.0.0.1:16611):ClientCnxn$SendThread@1235]
- Session 0x10461d6405a0001 for server 127.0.0.1/127.0.0.1:16611, unexpected error, closing
socket connection and attempting reconnect
    [junit] java.net.ConnectException: Connection refused
    [junit] 	at sun.nio.ch.SocketChannelImpl.checkConnect(Native Method)
    [junit] 	at sun.nio.ch.SocketChannelImpl.finishConnect(SocketChannelImpl.java:739)
    [junit] 	at org.apache.zookeeper.ClientCnxnSocketNIO.doTransport(ClientCnxnSocketNIO.java:357)
    [junit] 	at org.apache.zookeeper.ClientCnxn$SendThread.run(ClientCnxn.java:1214)
    [junit] Running org.apache.zookeeper.server.quorum.StandaloneDisabledTest in thread 3
    [junit] Tests run: 1, Failures: 0, Errors: 1, Skipped: 0, Time elapsed: 0 sec, Thread:
3, Class: org.apache.zookeeper.server.quorum.StandaloneDisabledTest
    [junit] Test org.apache.zookeeper.server.quorum.StandaloneDisabledTest FAILED (timeout)

fail.build.on.test.failure:

BUILD FAILED
/home/jenkins/jenkins-slave/workspace/ZooKeeper-trunk-openjdk7/build.xml:1219: The following
error occurred while executing this line:
/home/jenkins/jenkins-slave/workspace/ZooKeeper-trunk-openjdk7/build.xml:1223: Tests failed!

Total time: 16 minutes 17 seconds
Build step 'Invoke Ant' marked build as failure
Recording test results
Email was triggered for: Failure - Any
Sending email for trigger: Failure - Any



###################################################################################
############################## FAILED TESTS (if any) ##############################
1 tests failed.
FAILED:  org.apache.zookeeper.server.quorum.StandaloneDisabledTest.startSingleServerTest

Error Message:
Timeout occurred. Please note the time in the report does not reflect the time until the timeout.

Stack Trace:
junit.framework.AssertionFailedError: Timeout occurred. Please note the time in the report
does not reflect the time until the timeout.
	at java.lang.Thread.run(Thread.java:745)
Mime
  • Unnamed multipart/mixed (inline, None, 0 bytes)
View raw message