zookeeper-dev mailing list archives

Site index · List index
Message view « Date » · « Thread »
Top « Date » · « Thread »
From Apache Jenkins Server <jenk...@builds.apache.org>
Subject ZooKeeper-trunk - Build # 3398 - Still Failing
Date Sun, 21 May 2017 23:34:27 GMT
See https://builds.apache.org/job/ZooKeeper-trunk/3398/

###################################################################################
########################## LAST 60 LINES OF THE CONSOLE ###########################
[...truncated 61.82 MB...]
    [junit] 2017-05-21 23:31:39,748 [myid:] - INFO  [ProcessThread(sid:0 cport:21997)::PrepRequestProcessor@617]
- Processed session termination for sessionid: 0x101fa0388700000
    [junit] 2017-05-21 23:31:39,755 [myid:] - INFO  [main:ZooKeeper@1329] - Session: 0x101fa0388700000
closed
    [junit] 2017-05-21 23:31:39,755 [myid:] - INFO  [main-EventThread:ClientCnxn$EventThread@513]
- EventThread shut down for session: 0x101fa0388700000
    [junit] 2017-05-21 23:31:39,755 [myid:] - INFO  [NIOWorkerThread-17:MBeanRegistry@128]
- Unregister MBean [org.apache.ZooKeeperService:name0=StandaloneServer_port21997,name1=Connections,name2=127.0.0.1,name3=0x101fa0388700000]
    [junit] 2017-05-21 23:31:39,756 [myid:] - INFO  [ProcessThread(sid:0 cport:21997)::PrepRequestProcessor@617]
- Processed session termination for sessionid: 0x101fa0388700001
    [junit] 2017-05-21 23:31:39,757 [myid:] - INFO  [NIOWorkerThread-17:NIOServerCnxn@627]
- Closed socket connection for client /127.0.0.1:57445 which had sessionid 0x101fa0388700000
    [junit] 2017-05-21 23:31:39,763 [myid:] - INFO  [main:ZooKeeper@1329] - Session: 0x101fa0388700001
closed
    [junit] 2017-05-21 23:31:39,763 [myid:] - INFO  [NIOWorkerThread-32:MBeanRegistry@128]
- Unregister MBean [org.apache.ZooKeeperService:name0=StandaloneServer_port21997,name1=Connections,name2=127.0.0.1,name3=0x101fa0388700001]
    [junit] 2017-05-21 23:31:39,763 [myid:] - INFO  [main:ClientBase@552] - STOPPING server
    [junit] 2017-05-21 23:31:39,763 [myid:] - INFO  [main-EventThread:ClientCnxn$EventThread@513]
- EventThread shut down for session: 0x101fa0388700001
    [junit] 2017-05-21 23:31:39,764 [myid:] - INFO  [ConnnectionExpirer:NIOServerCnxnFactory$ConnectionExpirerThread@583]
- ConnnectionExpirerThread interrupted
    [junit] 2017-05-21 23:31:39,764 [myid:] - INFO  [NIOWorkerThread-32:NIOServerCnxn@627]
- Closed socket connection for client /127.0.0.1:57446 which had sessionid 0x101fa0388700001
    [junit] 2017-05-21 23:31:39,766 [myid:] - INFO  [NIOServerCxnFactory.AcceptThread:0.0.0.0/0.0.0.0:21997:NIOServerCnxnFactory$AcceptThread@219]
- accept thread exitted run method
    [junit] 2017-05-21 23:31:39,769 [myid:] - INFO  [NIOServerCxnFactory.SelectorThread-0:NIOServerCnxnFactory$SelectorThread@420]
- selector thread exitted run method
    [junit] 2017-05-21 23:31:39,770 [myid:] - INFO  [NIOServerCxnFactory.SelectorThread-1:NIOServerCnxnFactory$SelectorThread@420]
- selector thread exitted run method
    [junit] 2017-05-21 23:31:39,773 [myid:] - INFO  [main:ZooKeeperServer@542] - shutting
down
    [junit] 2017-05-21 23:31:39,774 [myid:] - ERROR [main:ZooKeeperServer@506] - ZKShutdownHandler
is not registered, so ZooKeeper server won't take any action on ERROR or SHUTDOWN server state
changes
    [junit] 2017-05-21 23:31:39,774 [myid:] - INFO  [main:SessionTrackerImpl@232] - Shutting
down
    [junit] 2017-05-21 23:31:39,774 [myid:] - INFO  [main:PrepRequestProcessor@1008] - Shutting
down
    [junit] 2017-05-21 23:31:39,774 [myid:] - INFO  [main:SyncRequestProcessor@191] - Shutting
down
    [junit] 2017-05-21 23:31:39,774 [myid:] - INFO  [ProcessThread(sid:0 cport:21997)::PrepRequestProcessor@157]
- PrepRequestProcessor exited loop!
    [junit] 2017-05-21 23:31:39,775 [myid:] - INFO  [SyncThread:0:SyncRequestProcessor@169]
- SyncRequestProcessor exited!
    [junit] 2017-05-21 23:31:39,775 [myid:] - INFO  [main:FinalRequestProcessor@481] - shutdown
of request processor complete
    [junit] 2017-05-21 23:31:39,775 [myid:] - INFO  [main:MBeanRegistry@128] - Unregister
MBean [org.apache.ZooKeeperService:name0=StandaloneServer_port21997,name1=InMemoryDataTree]
    [junit] 2017-05-21 23:31:39,776 [myid:] - INFO  [main:MBeanRegistry@128] - Unregister
MBean [org.apache.ZooKeeperService:name0=StandaloneServer_port21997]
    [junit] 2017-05-21 23:31:39,776 [myid:] - INFO  [main:FourLetterWordMain@85] - connecting
to 127.0.0.1 21997
    [junit] 2017-05-21 23:31:39,777 [myid:] - INFO  [main:JMXEnv@146] - ensureOnly:[]
    [junit] 2017-05-21 23:31:39,784 [myid:] - INFO  [main:ClientBase@607] - fdcount after
test is: 53 at start it was 53
    [junit] 2017-05-21 23:31:39,784 [myid:] - INFO  [main:ZKTestCase$1@68] - SUCCEEDED testManyChildWatchersAutoReset
    [junit] 2017-05-21 23:31:39,784 [myid:] - INFO  [main:ZKTestCase$1@63] - FINISHED testManyChildWatchersAutoReset
    [junit] Tests run: 4, Failures: 0, Errors: 0, Skipped: 0, Time elapsed: 662.107 sec, Thread:
5, Class: org.apache.zookeeper.test.DisconnectedWatcherTest
    [junit] Running org.apache.zookeeper.server.quorum.Zab1_0Test in thread 8
    [junit] Tests run: 1, Failures: 0, Errors: 1, Skipped: 0, Time elapsed: 0 sec, Thread:
8, Class: org.apache.zookeeper.server.quorum.Zab1_0Test
    [junit] Test org.apache.zookeeper.server.quorum.Zab1_0Test FAILED (timeout)

fail.build.on.test.failure:

BUILD FAILED
/home/jenkins/jenkins-slave/workspace/ZooKeeper-trunk/build.xml:1338: The following error
occurred while executing this line:
/home/jenkins/jenkins-slave/workspace/ZooKeeper-trunk/build.xml:1219: The following error
occurred while executing this line:
/home/jenkins/jenkins-slave/workspace/ZooKeeper-trunk/build.xml:1223: Tests failed!

Total time: 17 minutes 26 seconds
Build step 'Execute shell' marked build as failure
[FINDBUGS] Skipping publisher since build result is FAILURE
[WARNINGS] Skipping publisher since build result is FAILURE
Archiving artifacts
Setting JDK_1_7_LATEST__HOME=/home/jenkins/tools/java/latest1.7
Recording fingerprints
Setting JDK_1_7_LATEST__HOME=/home/jenkins/tools/java/latest1.7
Recording test results
Setting JDK_1_7_LATEST__HOME=/home/jenkins/tools/java/latest1.7
Publishing Javadoc
Setting JDK_1_7_LATEST__HOME=/home/jenkins/tools/java/latest1.7
Setting JDK_1_7_LATEST__HOME=/home/jenkins/tools/java/latest1.7
Email was triggered for: Failure - Any
Sending email for trigger: Failure - Any
Setting JDK_1_7_LATEST__HOME=/home/jenkins/tools/java/latest1.7
Setting JDK_1_7_LATEST__HOME=/home/jenkins/tools/java/latest1.7



###################################################################################
############################## FAILED TESTS (if any) ##############################
1 tests failed.
FAILED:  org.apache.zookeeper.server.quorum.Zab1_0Test.testNormalObserverRun

Error Message:
Timeout occurred. Please note the time in the report does not reflect the time until the timeout.

Stack Trace:
junit.framework.AssertionFailedError: Timeout occurred. Please note the time in the report
does not reflect the time until the timeout.
	at java.lang.Thread.run(Thread.java:745)
Mime
  • Unnamed multipart/mixed (inline, None, 0 bytes)
View raw message