zookeeper-dev mailing list archives

Site index · List index
Message view « Date » · « Thread »
Top « Date » · « Thread »
From Apache Jenkins Server <jenk...@builds.apache.org>
Subject ZooKeeper-trunk - Build # 3376 - Failure
Date Mon, 01 May 2017 23:27:15 GMT
See https://builds.apache.org/job/ZooKeeper-trunk/3376/

###################################################################################
########################## LAST 60 LINES OF THE CONSOLE ###########################
[...truncated 63.26 MB...]
    [junit] 	at org.apache.zookeeper.ClientCnxn$SendThread.run(ClientCnxn.java:1214)
    [junit] 2017-05-01 23:26:57,924 [myid:127.0.0.1:11348] - INFO  [main-SendThread(127.0.0.1:11348):ClientCnxn$SendThread@1113]
- Opening socket connection to server 127.0.0.1/127.0.0.1:11348. Will not attempt to authenticate
using SASL (unknown error)
    [junit] 2017-05-01 23:26:57,924 [myid:127.0.0.1:11348] - WARN  [main-SendThread(127.0.0.1:11348):ClientCnxn$SendThread@1235]
- Session 0x203f00396690000 for server 127.0.0.1/127.0.0.1:11348, unexpected error, closing
socket connection and attempting reconnect
    [junit] java.net.ConnectException: Connection refused
    [junit] 	at sun.nio.ch.SocketChannelImpl.checkConnect(Native Method)
    [junit] 	at sun.nio.ch.SocketChannelImpl.finishConnect(SocketChannelImpl.java:744)
    [junit] 	at org.apache.zookeeper.ClientCnxnSocketNIO.doTransport(ClientCnxnSocketNIO.java:357)
    [junit] 	at org.apache.zookeeper.ClientCnxn$SendThread.run(ClientCnxn.java:1214)
    [junit] 2017-05-01 23:26:57,969 [myid:] - INFO  [ProcessThread(sid:0 cport:11468)::PrepRequestProcessor@617]
- Processed session termination for sessionid: 0x103f006d9430000
    [junit] 2017-05-01 23:26:57,970 [myid:] - INFO  [SyncThread:0:MBeanRegistry@128] - Unregister
MBean [org.apache.ZooKeeperService:name0=StandaloneServer_port11468,name1=Connections,name2=127.0.0.1,name3=0x103f006d9430000]
    [junit] 2017-05-01 23:26:57,970 [myid:] - INFO  [main:ZooKeeper@1329] - Session: 0x103f006d9430000
closed
    [junit] 2017-05-01 23:26:57,970 [myid:] - INFO  [main-EventThread:ClientCnxn$EventThread@513]
- EventThread shut down for session: 0x103f006d9430000
    [junit] 2017-05-01 23:26:57,970 [myid:] - INFO  [main:JUnit4ZKTestRunner$LoggedInvokeMethod@82]
- Memory used 237696
    [junit] 2017-05-01 23:26:57,970 [myid:] - INFO  [main:JUnit4ZKTestRunner$LoggedInvokeMethod@87]
- Number of threads 2427
    [junit] 2017-05-01 23:26:57,971 [myid:] - INFO  [main:JUnit4ZKTestRunner$LoggedInvokeMethod@102]
- FINISHED TEST METHOD testWatcherAutoResetWithLocal
    [junit] 2017-05-01 23:26:57,971 [myid:] - INFO  [main:ClientBase@582] - tearDown starting
    [junit] 2017-05-01 23:26:57,971 [myid:] - INFO  [main:ClientBase@552] - STOPPING server
    [junit] 2017-05-01 23:26:57,971 [myid:] - INFO  [main:NettyServerCnxnFactory@464] - shutdown
called 0.0.0.0/0.0.0.0:11468
    [junit] 2017-05-01 23:26:57,982 [myid:] - INFO  [main:ZooKeeperServer@542] - shutting
down
    [junit] 2017-05-01 23:26:57,983 [myid:] - ERROR [main:ZooKeeperServer@506] - ZKShutdownHandler
is not registered, so ZooKeeper server won't take any action on ERROR or SHUTDOWN server state
changes
    [junit] 2017-05-01 23:26:57,983 [myid:] - INFO  [main:SessionTrackerImpl@232] - Shutting
down
    [junit] 2017-05-01 23:26:57,983 [myid:] - INFO  [main:PrepRequestProcessor@1008] - Shutting
down
    [junit] 2017-05-01 23:26:57,983 [myid:] - INFO  [main:SyncRequestProcessor@191] - Shutting
down
    [junit] 2017-05-01 23:26:57,983 [myid:] - INFO  [ProcessThread(sid:0 cport:11468)::PrepRequestProcessor@157]
- PrepRequestProcessor exited loop!
    [junit] 2017-05-01 23:26:57,984 [myid:] - INFO  [SyncThread:0:SyncRequestProcessor@169]
- SyncRequestProcessor exited!
    [junit] 2017-05-01 23:26:57,987 [myid:] - INFO  [main:FinalRequestProcessor@481] - shutdown
of request processor complete
    [junit] 2017-05-01 23:26:57,987 [myid:] - INFO  [main:MBeanRegistry@128] - Unregister
MBean [org.apache.ZooKeeperService:name0=StandaloneServer_port11468,name1=InMemoryDataTree]
    [junit] 2017-05-01 23:26:57,988 [myid:] - INFO  [main:MBeanRegistry@128] - Unregister
MBean [org.apache.ZooKeeperService:name0=StandaloneServer_port11468]
    [junit] 2017-05-01 23:26:58,030 [myid:] - INFO  [main:FourLetterWordMain@85] - connecting
to 127.0.0.1 11468
    [junit] 2017-05-01 23:26:58,031 [myid:] - INFO  [main:JMXEnv@146] - ensureOnly:[]
    [junit] 2017-05-01 23:26:58,043 [myid:] - INFO  [main:ClientBase@607] - fdcount after
test is: 7131 at start it was 7131
    [junit] 2017-05-01 23:26:58,043 [myid:] - INFO  [main:ZKTestCase$1@68] - SUCCEEDED testWatcherAutoResetWithLocal
    [junit] 2017-05-01 23:26:58,043 [myid:] - INFO  [main:ZKTestCase$1@63] - FINISHED testWatcherAutoResetWithLocal
    [junit] Tests run: 103, Failures: 0, Errors: 0, Skipped: 0, Time elapsed: 464.07 sec,
Thread: 1, Class: org.apache.zookeeper.test.NioNettySuiteTest

fail.build.on.test.failure:

BUILD FAILED
/home/jenkins/jenkins-slave/workspace/ZooKeeper-trunk/build.xml:1338: The following error
occurred while executing this line:
/home/jenkins/jenkins-slave/workspace/ZooKeeper-trunk/build.xml:1219: The following error
occurred while executing this line:
/home/jenkins/jenkins-slave/workspace/ZooKeeper-trunk/build.xml:1223: Tests failed!

Total time: 10 minutes 53 seconds
Build step 'Execute shell' marked build as failure
[FINDBUGS] Skipping publisher since build result is FAILURE
[WARNINGS] Skipping publisher since build result is FAILURE
Archiving artifacts
Setting JDK_1_7_LATEST__HOME=/home/jenkins/tools/java/latest1.7
Recording fingerprints
Setting JDK_1_7_LATEST__HOME=/home/jenkins/tools/java/latest1.7
Recording test results
Setting JDK_1_7_LATEST__HOME=/home/jenkins/tools/java/latest1.7
Publishing Javadoc
Setting JDK_1_7_LATEST__HOME=/home/jenkins/tools/java/latest1.7
Setting JDK_1_7_LATEST__HOME=/home/jenkins/tools/java/latest1.7
Email was triggered for: Failure - Any
Sending email for trigger: Failure - Any
Setting JDK_1_7_LATEST__HOME=/home/jenkins/tools/java/latest1.7
Setting JDK_1_7_LATEST__HOME=/home/jenkins/tools/java/latest1.7



###################################################################################
############################## FAILED TESTS (if any) ##############################
1 tests failed.
FAILED:  org.apache.zookeeper.server.quorum.ReconfigRecoveryTest.testCurrentServersAreObserversInNextConfig

Error Message:
waiting for server 4 being up

Stack Trace:
junit.framework.AssertionFailedError: waiting for server 4 being up
	at org.apache.zookeeper.server.quorum.ReconfigRecoveryTest.testCurrentServersAreObserversInNextConfig(ReconfigRecoveryTest.java:217)
	at org.apache.zookeeper.JUnit4ZKTestRunner$LoggedInvokeMethod.evaluate(JUnit4ZKTestRunner.java:79)
Mime
  • Unnamed multipart/mixed (inline, None, 0 bytes)
View raw message