zookeeper-dev mailing list archives

Site index · List index
Message view « Date » · « Thread »
Top « Date » · « Thread »
From Apache Jenkins Server <jenk...@builds.apache.org>
Subject ZooKeeper_branch34_openjdk7 - Build # 1507 - Still Failing
Date Tue, 23 May 2017 15:15:47 GMT
See https://builds.apache.org/job/ZooKeeper_branch34_openjdk7/1507/

###################################################################################
########################## LAST 60 LINES OF THE CONSOLE ###########################
[...truncated 32.09 MB...]
    [junit] 2017-05-23 15:14:19,336 [myid:] - INFO  [main:PrepRequestProcessor@766] - Shutting
down
    [junit] 2017-05-23 15:14:19,336 [myid:] - INFO  [main:SyncRequestProcessor@208] - Shutting
down
    [junit] 2017-05-23 15:14:19,336 [myid:] - INFO  [ProcessThread(sid:0 cport:11221)::PrepRequestProcessor@144]
- PrepRequestProcessor exited loop!
    [junit] 2017-05-23 15:14:19,338 [myid:] - INFO  [SyncThread:0:SyncRequestProcessor@186]
- SyncRequestProcessor exited!
    [junit] 2017-05-23 15:14:19,338 [myid:] - INFO  [main:FinalRequestProcessor@403] - shutdown
of request processor complete
    [junit] 2017-05-23 15:14:19,339 [myid:] - INFO  [main:FourLetterWordMain@62] - connecting
to 127.0.0.1 11221
    [junit] 2017-05-23 15:14:19,339 [myid:] - INFO  [main:JMXEnv@147] - ensureOnly:[]
    [junit] 2017-05-23 15:14:19,340 [myid:] - INFO  [main:ClientBase@470] - STARTING server
    [junit] 2017-05-23 15:14:19,340 [myid:] - INFO  [main:ClientBase@391] - CREATING server
instance 127.0.0.1:11221
    [junit] 2017-05-23 15:14:19,341 [myid:] - INFO  [main:ServerCnxnFactory@111] - Using org.apache.zookeeper.server.NIOServerCnxnFactory
as server connection factory
    [junit] 2017-05-23 15:14:19,341 [myid:] - INFO  [main:NIOServerCnxnFactory@89] - binding
to port 0.0.0.0/0.0.0.0:11221
    [junit] 2017-05-23 15:14:19,341 [myid:] - INFO  [main:ClientBase@366] - STARTING server
instance 127.0.0.1:11221
    [junit] 2017-05-23 15:14:19,341 [myid:] - INFO  [main:ZooKeeperServer@173] - Created server
with tickTime 3000 minSessionTimeout 6000 maxSessionTimeout 60000 datadir /home/jenkins/jenkins-slave/workspace/ZooKeeper_branch34_openjdk7/build/test/tmp/test2702001098124566362.junit.dir/version-2
snapdir /home/jenkins/jenkins-slave/workspace/ZooKeeper_branch34_openjdk7/build/test/tmp/test2702001098124566362.junit.dir/version-2
    [junit] 2017-05-23 15:14:19,344 [myid:] - ERROR [main:ZooKeeperServer@468] - ZKShutdownHandler
is not registered, so ZooKeeper server won't take any action on ERROR or SHUTDOWN server state
changes
    [junit] 2017-05-23 15:14:19,344 [myid:] - INFO  [main:FourLetterWordMain@62] - connecting
to 127.0.0.1 11221
    [junit] 2017-05-23 15:14:19,345 [myid:] - INFO  [NIOServerCxn.Factory:0.0.0.0/0.0.0.0:11221:NIOServerCnxnFactory@192]
- Accepted socket connection from /127.0.0.1:35173
    [junit] 2017-05-23 15:14:19,345 [myid:] - INFO  [NIOServerCxn.Factory:0.0.0.0/0.0.0.0:11221:NIOServerCnxn@883]
- Processing stat command from /127.0.0.1:35173
    [junit] 2017-05-23 15:14:19,346 [myid:] - INFO  [Thread-4:NIOServerCnxn$StatCommand@674]
- Stat command output
    [junit] 2017-05-23 15:14:19,346 [myid:] - INFO  [Thread-4:NIOServerCnxn@1044] - Closed
socket connection for client /127.0.0.1:35173 (no session established for client)
    [junit] 2017-05-23 15:14:19,346 [myid:] - INFO  [main:JMXEnv@230] - ensureParent:[InMemoryDataTree,
StandaloneServer_port]
    [junit] 2017-05-23 15:14:19,348 [myid:] - INFO  [main:JMXEnv@247] - expect:InMemoryDataTree
    [junit] 2017-05-23 15:14:19,348 [myid:] - INFO  [main:JMXEnv@251] - found:InMemoryDataTree
org.apache.ZooKeeperService:name0=StandaloneServer_port11221,name1=InMemoryDataTree
    [junit] 2017-05-23 15:14:19,348 [myid:] - INFO  [main:JMXEnv@247] - expect:StandaloneServer_port
    [junit] 2017-05-23 15:14:19,348 [myid:] - INFO  [main:JMXEnv@251] - found:StandaloneServer_port
org.apache.ZooKeeperService:name0=StandaloneServer_port11221
    [junit] 2017-05-23 15:14:19,348 [myid:] - INFO  [main:JUnit4ZKTestRunner$LoggedInvokeMethod@58]
- Memory used 24640
    [junit] 2017-05-23 15:14:19,348 [myid:] - INFO  [main:JUnit4ZKTestRunner$LoggedInvokeMethod@63]
- Number of threads 20
    [junit] 2017-05-23 15:14:19,349 [myid:] - INFO  [main:JUnit4ZKTestRunner$LoggedInvokeMethod@78]
- FINISHED TEST METHOD testQuota
    [junit] 2017-05-23 15:14:19,349 [myid:] - INFO  [main:ClientBase@547] - tearDown starting
    [junit] 2017-05-23 15:14:19,423 [myid:] - INFO  [main:ZooKeeper@684] - Session: 0x101f23c4e100000
closed
    [junit] 2017-05-23 15:14:19,424 [myid:] - INFO  [main:ClientBase@517] - STOPPING server
    [junit] 2017-05-23 15:14:19,424 [myid:] - INFO  [NIOServerCxn.Factory:0.0.0.0/0.0.0.0:11221:NIOServerCnxnFactory@219]
- NIOServerCnxn factory exited run method
    [junit] 2017-05-23 15:14:19,424 [myid:] - INFO  [main:ZooKeeperServer@501] - shutting
down
    [junit] 2017-05-23 15:14:19,426 [myid:] - ERROR [main:ZooKeeperServer@468] - ZKShutdownHandler
is not registered, so ZooKeeper server won't take any action on ERROR or SHUTDOWN server state
changes
    [junit] 2017-05-23 15:14:19,426 [myid:] - INFO  [main:SessionTrackerImpl@226] - Shutting
down
    [junit] 2017-05-23 15:14:19,426 [myid:] - INFO  [main:PrepRequestProcessor@766] - Shutting
down
    [junit] 2017-05-23 15:14:19,426 [myid:] - INFO  [main:SyncRequestProcessor@208] - Shutting
down
    [junit] 2017-05-23 15:14:19,426 [myid:] - INFO  [SyncThread:0:SyncRequestProcessor@186]
- SyncRequestProcessor exited!
    [junit] 2017-05-23 15:14:19,427 [myid:] - INFO  [main:FinalRequestProcessor@403] - shutdown
of request processor complete
    [junit] 2017-05-23 15:14:19,426 [myid:] - INFO  [main-EventThread:ClientCnxn$EventThread@520]
- EventThread shut down for session: 0x101f23c4e100000
    [junit] 2017-05-23 15:14:19,426 [myid:] - INFO  [ProcessThread(sid:0 cport:11221)::PrepRequestProcessor@144]
- PrepRequestProcessor exited loop!
    [junit] 2017-05-23 15:14:19,427 [myid:] - INFO  [main:FourLetterWordMain@62] - connecting
to 127.0.0.1 11221
    [junit] 2017-05-23 15:14:19,428 [myid:] - INFO  [main:JMXEnv@147] - ensureOnly:[]
    [junit] 2017-05-23 15:14:19,432 [myid:] - INFO  [main:ClientBase@572] - fdcount after
test is: 100 at start it was 88
    [junit] 2017-05-23 15:14:19,432 [myid:] - INFO  [main:ClientBase@574] - sleeping for 20
secs
    [junit] 2017-05-23 15:14:19,433 [myid:] - INFO  [main:ZKTestCase$1@69] - SUCCEEDED testQuota
    [junit] 2017-05-23 15:14:19,433 [myid:] - INFO  [main:ZKTestCase$1@64] - FINISHED testQuota
    [junit] Tests run: 1, Failures: 0, Errors: 0, Skipped: 0, Time elapsed: 0.566 sec

fail.build.on.test.failure:

BUILD FAILED
/home/jenkins/jenkins-slave/workspace/ZooKeeper_branch34_openjdk7/build.xml:1330: The following
error occurred while executing this line:
/home/jenkins/jenkins-slave/workspace/ZooKeeper_branch34_openjdk7/build.xml:1333: Tests failed!

Total time: 30 minutes 21 seconds
Build step 'Invoke Ant' marked build as failure
Recording test results
Email was triggered for: Failure - Any
Sending email for trigger: Failure - Any



###################################################################################
############################## FAILED TESTS (if any) ##############################
1 tests failed.
FAILED:  org.apache.zookeeper.server.DataNodeTest.BeforeFirstTest

Error Message:
Forked Java VM exited abnormally. Please note the time in the report does not reflect the
time until the VM exit.

Stack Trace:
junit.framework.AssertionFailedError: Forked Java VM exited abnormally. Please note the time
in the report does not reflect the time until the VM exit.
Mime
  • Unnamed multipart/mixed (inline, None, 0 bytes)
View raw message