zookeeper-dev mailing list archives

Site index · List index
Message view « Date » · « Thread »
Top « Date » · « Thread »
From Apache Jenkins Server <jenk...@builds.apache.org>
Subject ZooKeeper_branch34_jdk7 - Build # 1509 - Still Failing
Date Fri, 12 May 2017 02:42:40 GMT
See https://builds.apache.org/job/ZooKeeper_branch34_jdk7/1509/

###################################################################################
########################## LAST 60 LINES OF THE CONSOLE ###########################
[...truncated 29.18 MB...]
    [junit] 2017-05-12 02:42:31,184 [myid:] - INFO  [main:PrepRequestProcessor@764] - Shutting
down
    [junit] 2017-05-12 02:42:31,185 [myid:] - INFO  [main:SyncRequestProcessor@208] - Shutting
down
    [junit] 2017-05-12 02:42:31,185 [myid:] - INFO  [ProcessThread(sid:0 cport:11221)::PrepRequestProcessor@143]
- PrepRequestProcessor exited loop!
    [junit] 2017-05-12 02:42:31,185 [myid:] - INFO  [SyncThread:0:SyncRequestProcessor@186]
- SyncRequestProcessor exited!
    [junit] 2017-05-12 02:42:31,186 [myid:] - INFO  [main:FinalRequestProcessor@402] - shutdown
of request processor complete
    [junit] 2017-05-12 02:42:31,186 [myid:] - INFO  [main:FourLetterWordMain@62] - connecting
to 127.0.0.1 11221
    [junit] 2017-05-12 02:42:31,187 [myid:] - INFO  [main:JMXEnv@147] - ensureOnly:[]
    [junit] 2017-05-12 02:42:31,189 [myid:] - INFO  [main:ClientBase@469] - STARTING server
    [junit] 2017-05-12 02:42:31,189 [myid:] - INFO  [main:ClientBase@390] - CREATING server
instance 127.0.0.1:11221
    [junit] 2017-05-12 02:42:31,189 [myid:] - INFO  [main:ServerCnxnFactory@111] - Using org.apache.zookeeper.server.NIOServerCnxnFactory
as server connection factory
    [junit] 2017-05-12 02:42:31,189 [myid:] - INFO  [main:NIOServerCnxnFactory@89] - binding
to port 0.0.0.0/0.0.0.0:11221
    [junit] 2017-05-12 02:42:31,190 [myid:] - INFO  [main:ClientBase@365] - STARTING server
instance 127.0.0.1:11221
    [junit] 2017-05-12 02:42:31,190 [myid:] - INFO  [main:ZooKeeperServer@173] - Created server
with tickTime 3000 minSessionTimeout 6000 maxSessionTimeout 60000 datadir /home/jenkins/jenkins-slave/workspace/ZooKeeper_branch34_jdk7/build/test/tmp/test7082283008012155578.junit.dir/version-2
snapdir /home/jenkins/jenkins-slave/workspace/ZooKeeper_branch34_jdk7/build/test/tmp/test7082283008012155578.junit.dir/version-2
    [junit] 2017-05-12 02:42:31,194 [myid:] - ERROR [main:ZooKeeperServer@472] - ZKShutdownHandler
is not registered, so ZooKeeper server won't take any action on ERROR or SHUTDOWN server state
changes
    [junit] 2017-05-12 02:42:31,194 [myid:] - INFO  [main:FourLetterWordMain@62] - connecting
to 127.0.0.1 11221
    [junit] 2017-05-12 02:42:31,195 [myid:] - INFO  [NIOServerCxn.Factory:0.0.0.0/0.0.0.0:11221:NIOServerCnxnFactory@192]
- Accepted socket connection from /127.0.0.1:53346
    [junit] 2017-05-12 02:42:31,196 [myid:] - INFO  [NIOServerCxn.Factory:0.0.0.0/0.0.0.0:11221:NIOServerCnxn@883]
- Processing stat command from /127.0.0.1:53346
    [junit] 2017-05-12 02:42:31,196 [myid:] - INFO  [Thread-4:NIOServerCnxn$StatCommand@674]
- Stat command output
    [junit] 2017-05-12 02:42:31,196 [myid:] - INFO  [Thread-4:NIOServerCnxn@1044] - Closed
socket connection for client /127.0.0.1:53346 (no session established for client)
    [junit] 2017-05-12 02:42:31,197 [myid:] - INFO  [main:JMXEnv@230] - ensureParent:[InMemoryDataTree,
StandaloneServer_port]
    [junit] 2017-05-12 02:42:31,199 [myid:] - INFO  [main:JMXEnv@247] - expect:InMemoryDataTree
    [junit] 2017-05-12 02:42:31,199 [myid:] - INFO  [main:JMXEnv@251] - found:InMemoryDataTree
org.apache.ZooKeeperService:name0=StandaloneServer_port11221,name1=InMemoryDataTree
    [junit] 2017-05-12 02:42:31,200 [myid:] - INFO  [main:JMXEnv@247] - expect:StandaloneServer_port
    [junit] 2017-05-12 02:42:31,200 [myid:] - INFO  [main:JMXEnv@251] - found:StandaloneServer_port
org.apache.ZooKeeperService:name0=StandaloneServer_port11221
    [junit] 2017-05-12 02:42:31,200 [myid:] - INFO  [main:JUnit4ZKTestRunner$LoggedInvokeMethod@58]
- Memory used 35691
    [junit] 2017-05-12 02:42:31,201 [myid:] - INFO  [main:JUnit4ZKTestRunner$LoggedInvokeMethod@63]
- Number of threads 20
    [junit] 2017-05-12 02:42:31,201 [myid:] - INFO  [main:JUnit4ZKTestRunner$LoggedInvokeMethod@78]
- FINISHED TEST METHOD testQuota
    [junit] 2017-05-12 02:42:31,201 [myid:] - INFO  [main:ClientBase@546] - tearDown starting
    [junit] 2017-05-12 02:42:31,265 [myid:] - INFO  [main:ZooKeeper@684] - Session: 0x15bfa8941f20000
closed
    [junit] 2017-05-12 02:42:31,265 [myid:] - INFO  [main:ClientBase@516] - STOPPING server
    [junit] 2017-05-12 02:42:31,266 [myid:] - INFO  [main-EventThread:ClientCnxn$EventThread@519]
- EventThread shut down for session: 0x15bfa8941f20000
    [junit] 2017-05-12 02:42:31,266 [myid:] - INFO  [NIOServerCxn.Factory:0.0.0.0/0.0.0.0:11221:NIOServerCnxnFactory@219]
- NIOServerCnxn factory exited run method
    [junit] 2017-05-12 02:42:31,266 [myid:] - INFO  [main:ZooKeeperServer@505] - shutting
down
    [junit] 2017-05-12 02:42:31,266 [myid:] - ERROR [main:ZooKeeperServer@472] - ZKShutdownHandler
is not registered, so ZooKeeper server won't take any action on ERROR or SHUTDOWN server state
changes
    [junit] 2017-05-12 02:42:31,266 [myid:] - INFO  [main:SessionTrackerImpl@225] - Shutting
down
    [junit] 2017-05-12 02:42:31,267 [myid:] - INFO  [main:PrepRequestProcessor@764] - Shutting
down
    [junit] 2017-05-12 02:42:31,267 [myid:] - INFO  [main:SyncRequestProcessor@208] - Shutting
down
    [junit] 2017-05-12 02:42:31,267 [myid:] - INFO  [ProcessThread(sid:0 cport:11221)::PrepRequestProcessor@143]
- PrepRequestProcessor exited loop!
    [junit] 2017-05-12 02:42:31,268 [myid:] - INFO  [SyncThread:0:SyncRequestProcessor@186]
- SyncRequestProcessor exited!
    [junit] 2017-05-12 02:42:31,268 [myid:] - INFO  [main:FinalRequestProcessor@402] - shutdown
of request processor complete
    [junit] 2017-05-12 02:42:31,269 [myid:] - INFO  [main:FourLetterWordMain@62] - connecting
to 127.0.0.1 11221
    [junit] 2017-05-12 02:42:31,269 [myid:] - INFO  [main:JMXEnv@147] - ensureOnly:[]
    [junit] 2017-05-12 02:42:31,274 [myid:] - INFO  [main:ClientBase@571] - fdcount after
test is: 93 at start it was 81
    [junit] 2017-05-12 02:42:31,274 [myid:] - INFO  [main:ClientBase@573] - sleeping for 20
secs
    [junit] 2017-05-12 02:42:31,275 [myid:] - INFO  [main:ZKTestCase$1@69] - SUCCEEDED testQuota
    [junit] 2017-05-12 02:42:31,275 [myid:] - INFO  [main:ZKTestCase$1@64] - FINISHED testQuota
    [junit] Tests run: 1, Failures: 0, Errors: 0, Skipped: 0, Time elapsed: 0.568 sec

fail.build.on.test.failure:

BUILD FAILED
/home/jenkins/jenkins-slave/workspace/ZooKeeper_branch34_jdk7/build.xml:1330: The following
error occurred while executing this line:
/home/jenkins/jenkins-slave/workspace/ZooKeeper_branch34_jdk7/build.xml:1333: Tests failed!

Total time: 29 minutes 5 seconds
Build step 'Invoke Ant' marked build as failure
Recording test results
Email was triggered for: Failure - Any
Sending email for trigger: Failure - Any



###################################################################################
############################## FAILED TESTS (if any) ##############################
2 tests failed.
FAILED:  org.apache.zookeeper.test.FourLetterWordsWhiteListTest.testFourLetterWordsAllDisabledByDefault

Error Message:
Exception while executing four letter word: wchc

Stack Trace:
java.io.IOException: Exception while executing four letter word: wchc
	at org.apache.zookeeper.client.FourLetterWordMain.send4LetterWord(FourLetterWordMain.java:86)
	at org.apache.zookeeper.client.FourLetterWordMain.send4LetterWord(FourLetterWordMain.java:48)
	at org.apache.zookeeper.test.FourLetterWordsWhiteListTest.sendRequest(FourLetterWordsWhiteListTest.java:245)
	at org.apache.zookeeper.test.FourLetterWordsWhiteListTest.verifyExactMatch(FourLetterWordsWhiteListTest.java:238)
	at org.apache.zookeeper.test.FourLetterWordsWhiteListTest.verifyAllCommandsFail(FourLetterWordsWhiteListTest.java:217)
	at org.apache.zookeeper.test.FourLetterWordsWhiteListTest.testFourLetterWordsAllDisabledByDefault(FourLetterWordsWhiteListTest.java:58)
	at org.apache.zookeeper.JUnit4ZKTestRunner$LoggedInvokeMethod.evaluate(JUnit4ZKTestRunner.java:55)
Caused by: java.net.SocketTimeoutException: Read timed out
	at java.net.SocketInputStream.socketRead0(Native Method)
	at java.net.SocketInputStream.read(SocketInputStream.java:152)
	at java.net.SocketInputStream.read(SocketInputStream.java:122)
	at sun.nio.cs.StreamDecoder.readBytes(StreamDecoder.java:283)
	at sun.nio.cs.StreamDecoder.implRead(StreamDecoder.java:325)
	at sun.nio.cs.StreamDecoder.read(StreamDecoder.java:177)
	at java.io.InputStreamReader.read(InputStreamReader.java:184)
	at java.io.BufferedReader.fill(BufferedReader.java:154)
	at java.io.BufferedReader.readLine(BufferedReader.java:317)
	at java.io.BufferedReader.readLine(BufferedReader.java:382)
	at org.apache.zookeeper.client.FourLetterWordMain.send4LetterWord(FourLetterWordMain.java:81)


FAILED:  org.apache.zookeeper.test.LETest.testLE

Error Message:
Threads didn't join

Stack Trace:
junit.framework.AssertionFailedError: Threads didn't join
	at org.apache.zookeeper.test.LETest.testLE(LETest.java:120)
	at org.apache.zookeeper.JUnit4ZKTestRunner$LoggedInvokeMethod.evaluate(JUnit4ZKTestRunner.java:55)
Mime
  • Unnamed multipart/mixed (inline, None, 0 bytes)
View raw message