zookeeper-dev mailing list archives

Site index · List index
Message view « Date » · « Thread »
Top « Date » · « Thread »
From Apache Jenkins Server <jenk...@builds.apache.org>
Subject ZooKeeper-trunk-openjdk7 - Build # 1462 - Failure
Date Mon, 08 May 2017 20:08:03 GMT
See https://builds.apache.org/job/ZooKeeper-trunk-openjdk7/1462/

###################################################################################
########################## LAST 60 LINES OF THE CONSOLE ###########################
[...truncated 58.46 MB...]
    [junit] java.net.ConnectException: Connection refused: 127.0.0.1/127.0.0.1:16734
    [junit] 	at sun.nio.ch.SocketChannelImpl.checkConnect(Native Method)
    [junit] 	at sun.nio.ch.SocketChannelImpl.finishConnect(SocketChannelImpl.java:739)
    [junit] 	at org.jboss.netty.channel.socket.nio.NioClientBoss.connect(NioClientBoss.java:152)
    [junit] 	at org.jboss.netty.channel.socket.nio.NioClientBoss.processSelectedKeys(NioClientBoss.java:105)
    [junit] 	at org.jboss.netty.channel.socket.nio.NioClientBoss.process(NioClientBoss.java:79)
    [junit] 	at org.jboss.netty.channel.socket.nio.AbstractNioSelector.run(AbstractNioSelector.java:337)
    [junit] 	at org.jboss.netty.channel.socket.nio.NioClientBoss.run(NioClientBoss.java:42)
    [junit] 	at org.jboss.netty.util.ThreadRenamingRunnable.run(ThreadRenamingRunnable.java:108)
    [junit] 	at org.jboss.netty.util.internal.DeadLockProofWorker$1.run(DeadLockProofWorker.java:42)
    [junit] 	at java.util.concurrent.ThreadPoolExecutor.runWorker(ThreadPoolExecutor.java:1145)
    [junit] 	at java.util.concurrent.ThreadPoolExecutor$Worker.run(ThreadPoolExecutor.java:615)
    [junit] 	at java.lang.Thread.run(Thread.java:745)
    [junit] 2017-05-08 20:02:55,025 [myid:] - INFO  [New I/O boss #15092:ClientCnxnSocketNetty@208]
- channel is told closing
    [junit] 2017-05-08 20:02:55,025 [myid:127.0.0.1:16734] - INFO  [main-SendThread(127.0.0.1:16734):ClientCnxn$SendThread@1231]
- channel for sessionid 0x204149bde7b0000 is lost, closing socket connection and attempting
reconnect
    [junit] 2017-05-08 20:02:55,065 [myid:] - INFO  [ProcessThread(sid:0 cport:16854)::PrepRequestProcessor@617]
- Processed session termination for sessionid: 0x104149f53120000
    [junit] 2017-05-08 20:02:55,066 [myid:] - INFO  [SyncThread:0:MBeanRegistry@128] - Unregister
MBean [org.apache.ZooKeeperService:name0=StandaloneServer_port16854,name1=Connections,name2=127.0.0.1,name3=0x104149f53120000]
    [junit] 2017-05-08 20:02:55,066 [myid:] - INFO  [main:ClientCnxnSocketNetty@208] - channel
is told closing
    [junit] 2017-05-08 20:02:55,066 [myid:] - INFO  [main:ZooKeeper@1329] - Session: 0x104149f53120000
closed
    [junit] 2017-05-08 20:02:55,067 [myid:] - INFO  [main:JUnit4ZKTestRunner$LoggedInvokeMethod@82]
- Memory used 294174
    [junit] 2017-05-08 20:02:55,066 [myid:] - INFO  [New I/O worker #24014:ClientCnxnSocketNetty$ZKClientHandler@384]
- channel is disconnected: [id: 0xe76e1d70, /127.0.0.1:50766 :> 127.0.0.1/127.0.0.1:16854]
    [junit] 2017-05-08 20:02:55,067 [myid:] - INFO  [New I/O worker #24014:ClientCnxnSocketNetty@208]
- channel is told closing
    [junit] 2017-05-08 20:02:55,067 [myid:] - INFO  [main-EventThread:ClientCnxn$EventThread@513]
- EventThread shut down for session: 0x104149f53120000
    [junit] 2017-05-08 20:02:55,067 [myid:] - INFO  [main:JUnit4ZKTestRunner$LoggedInvokeMethod@87]
- Number of threads 2677
    [junit] 2017-05-08 20:02:55,068 [myid:] - INFO  [main:JUnit4ZKTestRunner$LoggedInvokeMethod@102]
- FINISHED TEST METHOD testWatcherAutoResetWithLocal
    [junit] 2017-05-08 20:02:55,068 [myid:] - INFO  [main:ClientBase@582] - tearDown starting
    [junit] 2017-05-08 20:02:55,068 [myid:] - INFO  [main:ClientBase@552] - STOPPING server
    [junit] 2017-05-08 20:02:55,068 [myid:] - INFO  [main:NettyServerCnxnFactory@464] - shutdown
called 0.0.0.0/0.0.0.0:16854
    [junit] 2017-05-08 20:02:55,074 [myid:] - INFO  [main:ZooKeeperServer@542] - shutting
down
    [junit] 2017-05-08 20:02:55,075 [myid:] - ERROR [main:ZooKeeperServer@506] - ZKShutdownHandler
is not registered, so ZooKeeper server won't take any action on ERROR or SHUTDOWN server state
changes
    [junit] 2017-05-08 20:02:55,075 [myid:] - INFO  [main:SessionTrackerImpl@232] - Shutting
down
    [junit] 2017-05-08 20:02:55,075 [myid:] - INFO  [main:PrepRequestProcessor@1008] - Shutting
down
    [junit] 2017-05-08 20:02:55,075 [myid:] - INFO  [main:SyncRequestProcessor@191] - Shutting
down
    [junit] 2017-05-08 20:02:55,075 [myid:] - INFO  [SyncThread:0:SyncRequestProcessor@169]
- SyncRequestProcessor exited!
    [junit] 2017-05-08 20:02:55,076 [myid:] - INFO  [main:FinalRequestProcessor@481] - shutdown
of request processor complete
    [junit] 2017-05-08 20:02:55,075 [myid:] - INFO  [ProcessThread(sid:0 cport:16854)::PrepRequestProcessor@157]
- PrepRequestProcessor exited loop!
    [junit] 2017-05-08 20:02:55,076 [myid:] - INFO  [main:MBeanRegistry@128] - Unregister
MBean [org.apache.ZooKeeperService:name0=StandaloneServer_port16854,name1=InMemoryDataTree]
    [junit] 2017-05-08 20:02:55,077 [myid:] - INFO  [main:MBeanRegistry@128] - Unregister
MBean [org.apache.ZooKeeperService:name0=StandaloneServer_port16854]
    [junit] 2017-05-08 20:02:55,077 [myid:] - INFO  [main:FourLetterWordMain@85] - connecting
to 127.0.0.1 16854
    [junit] 2017-05-08 20:02:55,078 [myid:] - INFO  [main:JMXEnv@146] - ensureOnly:[]
    [junit] 2017-05-08 20:02:55,088 [myid:] - INFO  [main:ClientBase@607] - fdcount after
test is: 7712 at start it was 7712
    [junit] 2017-05-08 20:02:55,089 [myid:] - INFO  [main:ZKTestCase$1@68] - SUCCEEDED testWatcherAutoResetWithLocal
    [junit] 2017-05-08 20:02:55,089 [myid:] - INFO  [main:ZKTestCase$1@63] - FINISHED testWatcherAutoResetWithLocal
    [junit] Tests run: 103, Failures: 0, Errors: 0, Skipped: 0, Time elapsed: 489.664 sec,
Thread: 3, Class: org.apache.zookeeper.test.NettyNettySuiteTest
    [junit] Running org.apache.zookeeper.server.quorum.Zab1_0Test in thread 1
    [junit] Tests run: 1, Failures: 0, Errors: 1, Skipped: 0, Time elapsed: 0 sec, Thread:
1, Class: org.apache.zookeeper.server.quorum.Zab1_0Test
    [junit] Test org.apache.zookeeper.server.quorum.Zab1_0Test FAILED (timeout)

fail.build.on.test.failure:

BUILD FAILED
/home/jenkins/jenkins-slave/workspace/ZooKeeper-trunk-openjdk7/build.xml:1219: The following
error occurred while executing this line:
/home/jenkins/jenkins-slave/workspace/ZooKeeper-trunk-openjdk7/build.xml:1223: Tests failed!

Total time: 16 minutes 17 seconds
Build step 'Invoke Ant' marked build as failure
Recording test results
Email was triggered for: Failure - Any
Sending email for trigger: Failure - Any



###################################################################################
############################## FAILED TESTS (if any) ##############################
3 tests failed.
FAILED:  org.apache.zookeeper.server.quorum.ReconfigDuringLeaderSyncTest.testDuringLeaderSync

Error Message:
zoo.cfg.dynamic.next is not deleted.

Stack Trace:
junit.framework.AssertionFailedError: zoo.cfg.dynamic.next is not deleted.
	at org.apache.zookeeper.server.quorum.ReconfigDuringLeaderSyncTest.testDuringLeaderSync(ReconfigDuringLeaderSyncTest.java:165)
	at org.apache.zookeeper.JUnit4ZKTestRunner$LoggedInvokeMethod.evaluate(JUnit4ZKTestRunner.java:79)


FAILED:  org.apache.zookeeper.server.quorum.Zab1_0Test.testNormalObserverRun

Error Message:
Timeout occurred. Please note the time in the report does not reflect the time until the timeout.

Stack Trace:
junit.framework.AssertionFailedError: Timeout occurred. Please note the time in the report
does not reflect the time until the timeout.
	at java.lang.Thread.run(Thread.java:745)


FAILED:  org.apache.zookeeper.test.WatchEventWhenAutoResetTest.testNodeDataChanged

Error Message:
expected:<NodeDataChanged> but was:<NodeDeleted>

Stack Trace:
junit.framework.AssertionFailedError: expected:<NodeDataChanged> but was:<NodeDeleted>
	at org.apache.zookeeper.test.WatchEventWhenAutoResetTest$EventsWatcher.assertEvent(WatchEventWhenAutoResetTest.java:67)
	at org.apache.zookeeper.test.WatchEventWhenAutoResetTest.testNodeDataChanged(WatchEventWhenAutoResetTest.java:117)
	at org.apache.zookeeper.JUnit4ZKTestRunner$LoggedInvokeMethod.evaluate(JUnit4ZKTestRunner.java:79)
Mime
  • Unnamed multipart/mixed (inline, None, 0 bytes)
View raw message