zookeeper-dev mailing list archives

Site index · List index
Message view « Date » · « Thread »
Top « Date » · « Thread »
From Apache Jenkins Server <jenk...@builds.apache.org>
Subject ZooKeeper_branch34_jdk7 - Build # 1508 - Failure
Date Thu, 11 May 2017 02:43:04 GMT
See https://builds.apache.org/job/ZooKeeper_branch34_jdk7/1508/

###################################################################################
########################## LAST 60 LINES OF THE CONSOLE ###########################
[...truncated 27.44 MB...]
    [junit] 2017-05-11 02:42:52,741 [myid:] - INFO  [main:PrepRequestProcessor@764] - Shutting
down
    [junit] 2017-05-11 02:42:52,742 [myid:] - INFO  [main:SyncRequestProcessor@208] - Shutting
down
    [junit] 2017-05-11 02:42:52,742 [myid:] - INFO  [ProcessThread(sid:0 cport:11221)::PrepRequestProcessor@143]
- PrepRequestProcessor exited loop!
    [junit] 2017-05-11 02:42:52,742 [myid:] - INFO  [SyncThread:0:SyncRequestProcessor@186]
- SyncRequestProcessor exited!
    [junit] 2017-05-11 02:42:52,743 [myid:] - INFO  [main:FinalRequestProcessor@402] - shutdown
of request processor complete
    [junit] 2017-05-11 02:42:52,743 [myid:] - INFO  [main:FourLetterWordMain@62] - connecting
to 127.0.0.1 11221
    [junit] 2017-05-11 02:42:52,744 [myid:] - INFO  [main:JMXEnv@147] - ensureOnly:[]
    [junit] 2017-05-11 02:42:52,745 [myid:] - INFO  [main:ClientBase@469] - STARTING server
    [junit] 2017-05-11 02:42:52,746 [myid:] - INFO  [main:ClientBase@390] - CREATING server
instance 127.0.0.1:11221
    [junit] 2017-05-11 02:42:52,746 [myid:] - INFO  [main:ServerCnxnFactory@111] - Using org.apache.zookeeper.server.NIOServerCnxnFactory
as server connection factory
    [junit] 2017-05-11 02:42:52,746 [myid:] - INFO  [main:NIOServerCnxnFactory@89] - binding
to port 0.0.0.0/0.0.0.0:11221
    [junit] 2017-05-11 02:42:52,746 [myid:] - INFO  [main:ClientBase@365] - STARTING server
instance 127.0.0.1:11221
    [junit] 2017-05-11 02:42:52,747 [myid:] - INFO  [main:ZooKeeperServer@173] - Created server
with tickTime 3000 minSessionTimeout 6000 maxSessionTimeout 60000 datadir /home/jenkins/jenkins-slave/workspace/ZooKeeper_branch34_jdk7/build/test/tmp/test8946559244220509307.junit.dir/version-2
snapdir /home/jenkins/jenkins-slave/workspace/ZooKeeper_branch34_jdk7/build/test/tmp/test8946559244220509307.junit.dir/version-2
    [junit] 2017-05-11 02:42:52,751 [myid:] - ERROR [main:ZooKeeperServer@472] - ZKShutdownHandler
is not registered, so ZooKeeper server won't take any action on ERROR or SHUTDOWN server state
changes
    [junit] 2017-05-11 02:42:52,751 [myid:] - INFO  [main:FourLetterWordMain@62] - connecting
to 127.0.0.1 11221
    [junit] 2017-05-11 02:42:52,752 [myid:] - INFO  [NIOServerCxn.Factory:0.0.0.0/0.0.0.0:11221:NIOServerCnxnFactory@192]
- Accepted socket connection from /127.0.0.1:40204
    [junit] 2017-05-11 02:42:52,752 [myid:] - INFO  [NIOServerCxn.Factory:0.0.0.0/0.0.0.0:11221:NIOServerCnxn@883]
- Processing stat command from /127.0.0.1:40204
    [junit] 2017-05-11 02:42:52,753 [myid:] - INFO  [Thread-4:NIOServerCnxn$StatCommand@674]
- Stat command output
    [junit] 2017-05-11 02:42:52,753 [myid:] - INFO  [Thread-4:NIOServerCnxn@1044] - Closed
socket connection for client /127.0.0.1:40204 (no session established for client)
    [junit] 2017-05-11 02:42:52,754 [myid:] - INFO  [main:JMXEnv@230] - ensureParent:[InMemoryDataTree,
StandaloneServer_port]
    [junit] 2017-05-11 02:42:52,756 [myid:] - INFO  [main:JMXEnv@247] - expect:InMemoryDataTree
    [junit] 2017-05-11 02:42:52,756 [myid:] - INFO  [main:JMXEnv@251] - found:InMemoryDataTree
org.apache.ZooKeeperService:name0=StandaloneServer_port11221,name1=InMemoryDataTree
    [junit] 2017-05-11 02:42:52,756 [myid:] - INFO  [main:JMXEnv@247] - expect:StandaloneServer_port
    [junit] 2017-05-11 02:42:52,756 [myid:] - INFO  [main:JMXEnv@251] - found:StandaloneServer_port
org.apache.ZooKeeperService:name0=StandaloneServer_port11221
    [junit] 2017-05-11 02:42:52,757 [myid:] - INFO  [main:JUnit4ZKTestRunner$LoggedInvokeMethod@58]
- Memory used 35692
    [junit] 2017-05-11 02:42:52,757 [myid:] - INFO  [main:JUnit4ZKTestRunner$LoggedInvokeMethod@63]
- Number of threads 20
    [junit] 2017-05-11 02:42:52,757 [myid:] - INFO  [main:JUnit4ZKTestRunner$LoggedInvokeMethod@78]
- FINISHED TEST METHOD testQuota
    [junit] 2017-05-11 02:42:52,757 [myid:] - INFO  [main:ClientBase@546] - tearDown starting
    [junit] 2017-05-11 02:42:52,822 [myid:] - INFO  [main:ZooKeeper@684] - Session: 0x15bf5633a250000
closed
    [junit] 2017-05-11 02:42:52,822 [myid:] - INFO  [main:ClientBase@516] - STOPPING server
    [junit] 2017-05-11 02:42:52,822 [myid:] - INFO  [main-EventThread:ClientCnxn$EventThread@519]
- EventThread shut down for session: 0x15bf5633a250000
    [junit] 2017-05-11 02:42:52,822 [myid:] - INFO  [NIOServerCxn.Factory:0.0.0.0/0.0.0.0:11221:NIOServerCnxnFactory@219]
- NIOServerCnxn factory exited run method
    [junit] 2017-05-11 02:42:52,823 [myid:] - INFO  [main:ZooKeeperServer@505] - shutting
down
    [junit] 2017-05-11 02:42:52,823 [myid:] - ERROR [main:ZooKeeperServer@472] - ZKShutdownHandler
is not registered, so ZooKeeper server won't take any action on ERROR or SHUTDOWN server state
changes
    [junit] 2017-05-11 02:42:52,823 [myid:] - INFO  [main:SessionTrackerImpl@225] - Shutting
down
    [junit] 2017-05-11 02:42:52,823 [myid:] - INFO  [main:PrepRequestProcessor@764] - Shutting
down
    [junit] 2017-05-11 02:42:52,824 [myid:] - INFO  [main:SyncRequestProcessor@208] - Shutting
down
    [junit] 2017-05-11 02:42:52,824 [myid:] - INFO  [SyncThread:0:SyncRequestProcessor@186]
- SyncRequestProcessor exited!
    [junit] 2017-05-11 02:42:52,824 [myid:] - INFO  [ProcessThread(sid:0 cport:11221)::PrepRequestProcessor@143]
- PrepRequestProcessor exited loop!
    [junit] 2017-05-11 02:42:52,824 [myid:] - INFO  [main:FinalRequestProcessor@402] - shutdown
of request processor complete
    [junit] 2017-05-11 02:42:52,825 [myid:] - INFO  [main:FourLetterWordMain@62] - connecting
to 127.0.0.1 11221
    [junit] 2017-05-11 02:42:52,826 [myid:] - INFO  [main:JMXEnv@147] - ensureOnly:[]
    [junit] 2017-05-11 02:42:52,830 [myid:] - INFO  [main:ClientBase@571] - fdcount after
test is: 93 at start it was 81
    [junit] 2017-05-11 02:42:52,831 [myid:] - INFO  [main:ClientBase@573] - sleeping for 20
secs
    [junit] 2017-05-11 02:42:52,831 [myid:] - INFO  [main:ZKTestCase$1@69] - SUCCEEDED testQuota
    [junit] 2017-05-11 02:42:52,832 [myid:] - INFO  [main:ZKTestCase$1@64] - FINISHED testQuota
    [junit] Tests run: 1, Failures: 0, Errors: 0, Skipped: 0, Time elapsed: 0.556 sec

fail.build.on.test.failure:

BUILD FAILED
/home/jenkins/jenkins-slave/workspace/ZooKeeper_branch34_jdk7/build.xml:1330: The following
error occurred while executing this line:
/home/jenkins/jenkins-slave/workspace/ZooKeeper_branch34_jdk7/build.xml:1333: Tests failed!

Total time: 28 minutes 50 seconds
Build step 'Invoke Ant' marked build as failure
Recording test results
Email was triggered for: Failure - Any
Sending email for trigger: Failure - Any



###################################################################################
############################## FAILED TESTS (if any) ##############################
1 tests failed.
FAILED:  org.apache.zookeeper.server.quorum.auth.QuorumAuthUpgradeTest.testRollingUpgrade

Error Message:
waiting for server0being up

Stack Trace:
junit.framework.AssertionFailedError: waiting for server0being up
	at org.apache.zookeeper.server.quorum.auth.QuorumAuthUpgradeTest.restartServer(QuorumAuthUpgradeTest.java:232)
	at org.apache.zookeeper.server.quorum.auth.QuorumAuthUpgradeTest.testRollingUpgrade(QuorumAuthUpgradeTest.java:194)
	at org.apache.zookeeper.JUnit4ZKTestRunner$LoggedInvokeMethod.evaluate(JUnit4ZKTestRunner.java:55)
Mime
  • Unnamed multipart/mixed (inline, None, 0 bytes)
View raw message