zookeeper-dev mailing list archives

Site index · List index
Message view « Date » · « Thread »
Top « Date » · « Thread »
From Apache Jenkins Server <jenk...@builds.apache.org>
Subject ZooKeeper_branch35_jdk7 - Build # 980 - Still Failing
Date Tue, 30 May 2017 08:49:26 GMT
See https://builds.apache.org/job/ZooKeeper_branch35_jdk7/980/

###################################################################################
########################## LAST 60 LINES OF THE CONSOLE ###########################
[...truncated 62.69 MB...]
    [junit] 2017-05-30 08:49:15,591 [myid:127.0.0.1:22120] - WARN  [main-SendThread(127.0.0.1:22120):ClientCnxn$SendThread@1235]
- Session 0x201d549ebf50000 for server 127.0.0.1/127.0.0.1:22120, unexpected error, closing
socket connection and attempting reconnect
    [junit] java.net.ConnectException: Connection refused
    [junit] 	at sun.nio.ch.SocketChannelImpl.checkConnect(Native Method)
    [junit] 	at sun.nio.ch.SocketChannelImpl.finishConnect(SocketChannelImpl.java:744)
    [junit] 	at org.apache.zookeeper.ClientCnxnSocketNIO.doTransport(ClientCnxnSocketNIO.java:357)
    [junit] 	at org.apache.zookeeper.ClientCnxn$SendThread.run(ClientCnxn.java:1214)
    [junit] 2017-05-30 08:49:15,824 [myid:127.0.0.1:22240] - INFO  [main-SendThread(127.0.0.1:22240):ClientCnxn$SendThread@1113]
- Opening socket connection to server 127.0.0.1/127.0.0.1:22240. Will not attempt to authenticate
using SASL (unknown error)
    [junit] 2017-05-30 08:49:15,825 [myid:127.0.0.1:22240] - INFO  [main-SendThread(127.0.0.1:22240):ClientCnxn$SendThread@948]
- Socket connection established, initiating session, client: /127.0.0.1:51734, server: 127.0.0.1/127.0.0.1:22240
    [junit] 2017-05-30 08:49:15,825 [myid:] - INFO  [New I/O worker #6701:ZooKeeperServer@1025]
- Client attempting to renew session 0x101d54d33af0000 at /127.0.0.1:51734
    [junit] 2017-05-30 08:49:15,826 [myid:] - INFO  [New I/O worker #6701:ZooKeeperServer@727]
- Established session 0x101d54d33af0000 with negotiated timeout 6000 for client /127.0.0.1:51734
    [junit] 2017-05-30 08:49:15,826 [myid:127.0.0.1:22240] - INFO  [main-SendThread(127.0.0.1:22240):ClientCnxn$SendThread@1381]
- Session establishment complete on server 127.0.0.1/127.0.0.1:22240, sessionid = 0x101d54d33af0000,
negotiated timeout = 6000
    [junit] 2017-05-30 08:49:15,829 [myid:] - INFO  [SyncThread:0:FileTxnLog@206] - Creating
new log file: log.7
    [junit] 2017-05-30 08:49:16,834 [myid:] - INFO  [ProcessThread(sid:0 cport:22240)::PrepRequestProcessor@613]
- Processed session termination for sessionid: 0x101d54d33af0000
    [junit] 2017-05-30 08:49:16,834 [myid:] - INFO  [SyncThread:0:MBeanRegistry@128] - Unregister
MBean [org.apache.ZooKeeperService:name0=StandaloneServer_port22240,name1=Connections,name2=127.0.0.1,name3=0x101d54d33af0000]
    [junit] 2017-05-30 08:49:16,835 [myid:] - INFO  [main-EventThread:ClientCnxn$EventThread@513]
- EventThread shut down for session: 0x101d54d33af0000
    [junit] 2017-05-30 08:49:16,835 [myid:] - INFO  [main:ZooKeeper@1331] - Session: 0x101d54d33af0000
closed
    [junit] 2017-05-30 08:49:16,835 [myid:] - INFO  [main:JUnit4ZKTestRunner$LoggedInvokeMethod@82]
- Memory used 181448
    [junit] 2017-05-30 08:49:16,835 [myid:] - INFO  [main:JUnit4ZKTestRunner$LoggedInvokeMethod@87]
- Number of threads 1644
    [junit] 2017-05-30 08:49:16,835 [myid:] - INFO  [main:JUnit4ZKTestRunner$LoggedInvokeMethod@102]
- FINISHED TEST METHOD testWatcherAutoResetWithLocal
    [junit] 2017-05-30 08:49:16,835 [myid:] - INFO  [main:ClientBase@567] - tearDown starting
    [junit] 2017-05-30 08:49:16,836 [myid:] - INFO  [main:ClientBase@537] - STOPPING server
    [junit] 2017-05-30 08:49:16,836 [myid:] - INFO  [main:NettyServerCnxnFactory@464] - shutdown
called 0.0.0.0/0.0.0.0:22240
    [junit] 2017-05-30 08:49:16,839 [myid:127.0.0.1:22123] - INFO  [main-SendThread(127.0.0.1:22123):ClientCnxn$SendThread@1113]
- Opening socket connection to server 127.0.0.1/127.0.0.1:22123. Will not attempt to authenticate
using SASL (unknown error)
    [junit] 2017-05-30 08:49:16,839 [myid:] - INFO  [main:ZooKeeperServer@541] - shutting
down
    [junit] 2017-05-30 08:49:16,839 [myid:] - ERROR [main:ZooKeeperServer@505] - ZKShutdownHandler
is not registered, so ZooKeeper server won't take any action on ERROR or SHUTDOWN server state
changes
    [junit] 2017-05-30 08:49:16,840 [myid:] - INFO  [main:SessionTrackerImpl@232] - Shutting
down
    [junit] 2017-05-30 08:49:16,840 [myid:] - INFO  [main:PrepRequestProcessor@1004] - Shutting
down
    [junit] 2017-05-30 08:49:16,839 [myid:127.0.0.1:22123] - WARN  [main-SendThread(127.0.0.1:22123):ClientCnxn$SendThread@1235]
- Session 0x301d549ebf90000 for server 127.0.0.1/127.0.0.1:22123, unexpected error, closing
socket connection and attempting reconnect
    [junit] java.net.ConnectException: Connection refused
    [junit] 	at sun.nio.ch.SocketChannelImpl.checkConnect(Native Method)
    [junit] 	at sun.nio.ch.SocketChannelImpl.finishConnect(SocketChannelImpl.java:744)
    [junit] 	at org.apache.zookeeper.ClientCnxnSocketNIO.doTransport(ClientCnxnSocketNIO.java:357)
    [junit] 	at org.apache.zookeeper.ClientCnxn$SendThread.run(ClientCnxn.java:1214)
    [junit] 2017-05-30 08:49:16,840 [myid:] - INFO  [ProcessThread(sid:0 cport:22240)::PrepRequestProcessor@156]
- PrepRequestProcessor exited loop!
    [junit] 2017-05-30 08:49:16,840 [myid:] - INFO  [main:SyncRequestProcessor@191] - Shutting
down
    [junit] 2017-05-30 08:49:16,843 [myid:] - INFO  [SyncThread:0:SyncRequestProcessor@169]
- SyncRequestProcessor exited!
    [junit] 2017-05-30 08:49:16,843 [myid:] - INFO  [main:FinalRequestProcessor@481] - shutdown
of request processor complete
    [junit] 2017-05-30 08:49:16,843 [myid:] - INFO  [main:MBeanRegistry@128] - Unregister
MBean [org.apache.ZooKeeperService:name0=StandaloneServer_port22240,name1=InMemoryDataTree]
    [junit] 2017-05-30 08:49:16,843 [myid:] - INFO  [main:MBeanRegistry@128] - Unregister
MBean [org.apache.ZooKeeperService:name0=StandaloneServer_port22240]
    [junit] 2017-05-30 08:49:16,845 [myid:] - INFO  [main:FourLetterWordMain@85] - connecting
to 127.0.0.1 22240
    [junit] 2017-05-30 08:49:16,846 [myid:] - INFO  [main:JMXEnv@146] - ensureOnly:[]
    [junit] 2017-05-30 08:49:16,851 [myid:] - INFO  [main:ClientBase@592] - fdcount after
test is: 4833 at start it was 4833
    [junit] 2017-05-30 08:49:16,851 [myid:] - INFO  [main:ZKTestCase$1@68] - SUCCEEDED testWatcherAutoResetWithLocal
    [junit] 2017-05-30 08:49:16,851 [myid:] - INFO  [main:ZKTestCase$1@63] - FINISHED testWatcherAutoResetWithLocal
    [junit] Tests run: 103, Failures: 0, Errors: 0, Skipped: 0, Time elapsed: 468.61 sec,
Thread: 5, Class: org.apache.zookeeper.test.NioNettySuiteTest
    [junit] 2017-05-30 08:49:16,932 [myid:] - INFO  [SessionTracker:SessionTrackerImpl@158]
- SessionTrackerImpl exited loop!
    [junit] 2017-05-30 08:49:16,933 [myid:] - INFO  [SessionTracker:SessionTrackerImpl@158]
- SessionTrackerImpl exited loop!

fail.build.on.test.failure:

BUILD FAILED
/home/jenkins/jenkins-slave/workspace/ZooKeeper_branch35_jdk7/build.xml:1219: The following
error occurred while executing this line:
/home/jenkins/jenkins-slave/workspace/ZooKeeper_branch35_jdk7/build.xml:1223: Tests failed!

Total time: 10 minutes 58 seconds
Build step 'Invoke Ant' marked build as failure
Recording test results
Email was triggered for: Failure - Any
Sending email for trigger: Failure - Any



###################################################################################
############################## FAILED TESTS (if any) ##############################
2 tests failed.
FAILED:  org.apache.zookeeper.server.quorum.ReconfigDuringLeaderSyncTest.testDuringLeaderSync

Error Message:
zoo.cfg.dynamic.next is not deleted.

Stack Trace:
junit.framework.AssertionFailedError: zoo.cfg.dynamic.next is not deleted.
	at org.apache.zookeeper.server.quorum.ReconfigDuringLeaderSyncTest.testDuringLeaderSync(ReconfigDuringLeaderSyncTest.java:165)
	at org.apache.zookeeper.JUnit4ZKTestRunner$LoggedInvokeMethod.evaluate(JUnit4ZKTestRunner.java:79)


FAILED:  org.apache.zookeeper.ZooKeeperTest.testCreateNodeWithoutData

Error Message:
Path must start with / character

Stack Trace:
org.apache.zookeeper.cli.MalformedPathException: Path must start with / character
	at org.apache.zookeeper.cli.CreateCommand.exec(CreateCommand.java:122)
	at org.apache.zookeeper.ZooKeeperMain.processZKCmd(ZooKeeperMain.java:655)
	at org.apache.zookeeper.ZooKeeperTest.testCreateNodeWithoutData(ZooKeeperTest.java:292)
	at org.apache.zookeeper.JUnit4ZKTestRunner$LoggedInvokeMethod.evaluate(JUnit4ZKTestRunner.java:79)
Mime
  • Unnamed multipart/mixed (inline, None, 0 bytes)
View raw message