zookeeper-dev mailing list archives

Site index · List index
Message view « Date » · « Thread »
Top « Date » · « Thread »
From Apache Jenkins Server <jenk...@builds.apache.org>
Subject ZooKeeper_branch35_openjdk7 - Build # 538 - Still Failing
Date Sat, 27 May 2017 01:29:28 GMT
See https://builds.apache.org/job/ZooKeeper_branch35_openjdk7/538/

###################################################################################
########################## LAST 60 LINES OF THE CONSOLE ###########################
[...truncated 62.88 MB...]
    [junit] 2017-05-27 01:29:19,489 [myid:127.0.0.1:14044] - INFO  [main-SendThread(127.0.0.1:14044):ClientCnxn$SendThread@1113]
- Opening socket connection to server 127.0.0.1/127.0.0.1:14044. Will not attempt to authenticate
using SASL (unknown error)
    [junit] 2017-05-27 01:29:19,490 [myid:127.0.0.1:14044] - WARN  [main-SendThread(127.0.0.1:14044):ClientCnxn$SendThread@1235]
- Session 0x3047276227a0000 for server 127.0.0.1/127.0.0.1:14044, unexpected error, closing
socket connection and attempting reconnect
    [junit] java.net.ConnectException: Connection refused
    [junit] 	at sun.nio.ch.SocketChannelImpl.checkConnect(Native Method)
    [junit] 	at sun.nio.ch.SocketChannelImpl.finishConnect(SocketChannelImpl.java:739)
    [junit] 	at org.apache.zookeeper.ClientCnxnSocketNIO.doTransport(ClientCnxnSocketNIO.java:357)
    [junit] 	at org.apache.zookeeper.ClientCnxn$SendThread.run(ClientCnxn.java:1214)
    [junit] 2017-05-27 01:29:19,525 [myid:127.0.0.1:14038] - INFO  [main-SendThread(127.0.0.1:14038):ClientCnxn$SendThread@1113]
- Opening socket connection to server 127.0.0.1/127.0.0.1:14038. Will not attempt to authenticate
using SASL (unknown error)
    [junit] 2017-05-27 01:29:19,526 [myid:127.0.0.1:14038] - WARN  [main-SendThread(127.0.0.1:14038):ClientCnxn$SendThread@1235]
- Session 0x104727622750000 for server 127.0.0.1/127.0.0.1:14038, unexpected error, closing
socket connection and attempting reconnect
    [junit] java.net.ConnectException: Connection refused
    [junit] 	at sun.nio.ch.SocketChannelImpl.checkConnect(Native Method)
    [junit] 	at sun.nio.ch.SocketChannelImpl.finishConnect(SocketChannelImpl.java:739)
    [junit] 	at org.apache.zookeeper.ClientCnxnSocketNIO.doTransport(ClientCnxnSocketNIO.java:357)
    [junit] 	at org.apache.zookeeper.ClientCnxn$SendThread.run(ClientCnxn.java:1214)
    [junit] 2017-05-27 01:29:20,327 [myid:] - INFO  [ProcessThread(sid:0 cport:14161)::PrepRequestProcessor@613]
- Processed session termination for sessionid: 0x1047279494e0000
    [junit] 2017-05-27 01:29:20,328 [myid:] - INFO  [SyncThread:0:MBeanRegistry@128] - Unregister
MBean [org.apache.ZooKeeperService:name0=StandaloneServer_port14161,name1=Connections,name2=127.0.0.1,name3=0x1047279494e0000]
    [junit] 2017-05-27 01:29:20,328 [myid:] - INFO  [main:ZooKeeper@1331] - Session: 0x1047279494e0000
closed
    [junit] 2017-05-27 01:29:20,328 [myid:] - INFO  [main-EventThread:ClientCnxn$EventThread@513]
- EventThread shut down for session: 0x1047279494e0000
    [junit] 2017-05-27 01:29:20,328 [myid:] - INFO  [main:JUnit4ZKTestRunner$LoggedInvokeMethod@82]
- Memory used 219679
    [junit] 2017-05-27 01:29:20,329 [myid:] - INFO  [main:JUnit4ZKTestRunner$LoggedInvokeMethod@87]
- Number of threads 2427
    [junit] 2017-05-27 01:29:20,329 [myid:] - INFO  [main:JUnit4ZKTestRunner$LoggedInvokeMethod@102]
- FINISHED TEST METHOD testWatcherAutoResetWithLocal
    [junit] 2017-05-27 01:29:20,329 [myid:] - INFO  [main:ClientBase@567] - tearDown starting
    [junit] 2017-05-27 01:29:20,329 [myid:] - INFO  [main:ClientBase@537] - STOPPING server
    [junit] 2017-05-27 01:29:20,330 [myid:] - INFO  [main:NettyServerCnxnFactory@464] - shutdown
called 0.0.0.0/0.0.0.0:14161
    [junit] 2017-05-27 01:29:20,335 [myid:] - INFO  [main:ZooKeeperServer@541] - shutting
down
    [junit] 2017-05-27 01:29:20,336 [myid:] - ERROR [main:ZooKeeperServer@505] - ZKShutdownHandler
is not registered, so ZooKeeper server won't take any action on ERROR or SHUTDOWN server state
changes
    [junit] 2017-05-27 01:29:20,336 [myid:] - INFO  [main:SessionTrackerImpl@232] - Shutting
down
    [junit] 2017-05-27 01:29:20,336 [myid:] - INFO  [main:PrepRequestProcessor@1004] - Shutting
down
    [junit] 2017-05-27 01:29:20,336 [myid:] - INFO  [main:SyncRequestProcessor@191] - Shutting
down
    [junit] 2017-05-27 01:29:20,337 [myid:] - INFO  [SyncThread:0:SyncRequestProcessor@169]
- SyncRequestProcessor exited!
    [junit] 2017-05-27 01:29:20,336 [myid:] - INFO  [ProcessThread(sid:0 cport:14161)::PrepRequestProcessor@156]
- PrepRequestProcessor exited loop!
    [junit] 2017-05-27 01:29:20,337 [myid:] - INFO  [main:FinalRequestProcessor@481] - shutdown
of request processor complete
    [junit] 2017-05-27 01:29:20,337 [myid:] - INFO  [main:MBeanRegistry@128] - Unregister
MBean [org.apache.ZooKeeperService:name0=StandaloneServer_port14161,name1=InMemoryDataTree]
    [junit] 2017-05-27 01:29:20,339 [myid:] - INFO  [main:MBeanRegistry@128] - Unregister
MBean [org.apache.ZooKeeperService:name0=StandaloneServer_port14161]
    [junit] 2017-05-27 01:29:20,340 [myid:] - INFO  [main:FourLetterWordMain@85] - connecting
to 127.0.0.1 14161
    [junit] 2017-05-27 01:29:20,341 [myid:] - INFO  [main:JMXEnv@146] - ensureOnly:[]
    [junit] 2017-05-27 01:29:20,353 [myid:] - INFO  [main:ClientBase@592] - fdcount after
test is: 7138 at start it was 7138
    [junit] 2017-05-27 01:29:20,354 [myid:] - INFO  [main:ZKTestCase$1@68] - SUCCEEDED testWatcherAutoResetWithLocal
    [junit] 2017-05-27 01:29:20,354 [myid:] - INFO  [main:ZKTestCase$1@63] - FINISHED testWatcherAutoResetWithLocal
    [junit] Tests run: 103, Failures: 0, Errors: 0, Skipped: 0, Time elapsed: 462.842 sec,
Thread: 2, Class: org.apache.zookeeper.test.NioNettySuiteTest
    [junit] 2017-05-27 01:29:20,665 [myid:127.0.0.1:13915] - INFO  [main-SendThread(127.0.0.1:13915):ClientCnxn$SendThread@1113]
- Opening socket connection to server 127.0.0.1/127.0.0.1:13915. Will not attempt to authenticate
using SASL (unknown error)
    [junit] 2017-05-27 01:29:20,666 [myid:127.0.0.1:13915] - WARN  [main-SendThread(127.0.0.1:13915):ClientCnxn$SendThread@1235]
- Session 0x104727254100000 for server 127.0.0.1/127.0.0.1:13915, unexpected error, closing
socket connection and attempting reconnect
    [junit] java.net.ConnectException: Connection refused
    [junit] 	at sun.nio.ch.SocketChannelImpl.checkConnect(Native Method)
    [junit] 	at sun.nio.ch.SocketChannelImpl.finishConnect(SocketChannelImpl.java:739)
    [junit] 	at org.apache.zookeeper.ClientCnxnSocketNIO.doTransport(ClientCnxnSocketNIO.java:357)
    [junit] 	at org.apache.zookeeper.ClientCnxn$SendThread.run(ClientCnxn.java:1214)

fail.build.on.test.failure:

BUILD FAILED
/home/jenkins/jenkins-slave/workspace/ZooKeeper_branch35_openjdk7/build.xml:1219: The following
error occurred while executing this line:
/home/jenkins/jenkins-slave/workspace/ZooKeeper_branch35_openjdk7/build.xml:1223: Tests failed!

Total time: 11 minutes 6 seconds
Build step 'Invoke Ant' marked build as failure
Recording test results
Email was triggered for: Failure - Any
Sending email for trigger: Failure - Any



###################################################################################
############################## FAILED TESTS (if any) ##############################
1 tests failed.
FAILED:  org.apache.zookeeper.ZooKeeperTest.testCreateNodeWithoutData

Error Message:
Path must start with / character

Stack Trace:
org.apache.zookeeper.cli.MalformedPathException: Path must start with / character
	at org.apache.zookeeper.cli.CreateCommand.exec(CreateCommand.java:122)
	at org.apache.zookeeper.ZooKeeperMain.processZKCmd(ZooKeeperMain.java:655)
	at org.apache.zookeeper.ZooKeeperTest.testCreateNodeWithoutData(ZooKeeperTest.java:292)
	at org.apache.zookeeper.JUnit4ZKTestRunner$LoggedInvokeMethod.evaluate(JUnit4ZKTestRunner.java:79)
Mime
  • Unnamed multipart/mixed (inline, None, 0 bytes)
View raw message