zookeeper-dev mailing list archives

Site index · List index
Message view « Date » · « Thread »
Top « Date » · « Thread »
From Apache Jenkins Server <jenk...@builds.apache.org>
Subject ZooKeeper-trunk-openjdk7 - Build # 1474 - Failure
Date Thu, 18 May 2017 23:30:51 GMT
See https://builds.apache.org/job/ZooKeeper-trunk-openjdk7/1474/

###################################################################################
########################## LAST 60 LINES OF THE CONSOLE ###########################
[...truncated 64.37 MB...]
    [junit] 	at org.apache.zookeeper.ClientCnxnSocketNIO.doTransport(ClientCnxnSocketNIO.java:357)
    [junit] 	at org.apache.zookeeper.ClientCnxn$SendThread.run(ClientCnxn.java:1214)
    [junit] 2017-05-18 23:30:44,802 [myid:127.0.0.1:24690] - INFO  [main-SendThread(127.0.0.1:24690):ClientCnxn$SendThread@1113]
- Opening socket connection to server 127.0.0.1/127.0.0.1:24690. Will not attempt to authenticate
using SASL (unknown error)
    [junit] 2017-05-18 23:30:44,803 [myid:127.0.0.1:24690] - WARN  [main-SendThread(127.0.0.1:24690):ClientCnxn$SendThread@1235]
- Session 0x10448cf95c70001 for server 127.0.0.1/127.0.0.1:24690, unexpected error, closing
socket connection and attempting reconnect
    [junit] java.net.ConnectException: Connection refused
    [junit] 	at sun.nio.ch.SocketChannelImpl.checkConnect(Native Method)
    [junit] 	at sun.nio.ch.SocketChannelImpl.finishConnect(SocketChannelImpl.java:739)
    [junit] 	at org.apache.zookeeper.ClientCnxnSocketNIO.doTransport(ClientCnxnSocketNIO.java:357)
    [junit] 	at org.apache.zookeeper.ClientCnxn$SendThread.run(ClientCnxn.java:1214)
    [junit] 2017-05-18 23:30:45,110 [myid:127.0.0.1:24690] - INFO  [main-SendThread(127.0.0.1:24690):ClientCnxn$SendThread@1113]
- Opening socket connection to server 127.0.0.1/127.0.0.1:24690. Will not attempt to authenticate
using SASL (unknown error)
    [junit] 2017-05-18 23:30:45,111 [myid:127.0.0.1:24690] - WARN  [main-SendThread(127.0.0.1:24690):ClientCnxn$SendThread@1235]
- Session 0x10448cf95c70000 for server 127.0.0.1/127.0.0.1:24690, unexpected error, closing
socket connection and attempting reconnect
    [junit] java.net.ConnectException: Connection refused
    [junit] 	at sun.nio.ch.SocketChannelImpl.checkConnect(Native Method)
    [junit] 	at sun.nio.ch.SocketChannelImpl.finishConnect(SocketChannelImpl.java:739)
    [junit] 	at org.apache.zookeeper.ClientCnxnSocketNIO.doTransport(ClientCnxnSocketNIO.java:357)
    [junit] 	at org.apache.zookeeper.ClientCnxn$SendThread.run(ClientCnxn.java:1214)
    [junit] 2017-05-18 23:30:45,647 [myid:127.0.0.1:24687] - INFO  [main-SendThread(127.0.0.1:24687):ClientCnxn$SendThread@1113]
- Opening socket connection to server 127.0.0.1/127.0.0.1:24687. Will not attempt to authenticate
using SASL (unknown error)
    [junit] 2017-05-18 23:30:45,647 [myid:127.0.0.1:24687] - WARN  [main-SendThread(127.0.0.1:24687):ClientCnxn$SendThread@1235]
- Session 0x448cf94830001 for server 127.0.0.1/127.0.0.1:24687, unexpected error, closing
socket connection and attempting reconnect
    [junit] java.net.ConnectException: Connection refused
    [junit] 	at sun.nio.ch.SocketChannelImpl.checkConnect(Native Method)
    [junit] 	at sun.nio.ch.SocketChannelImpl.finishConnect(SocketChannelImpl.java:739)
    [junit] 	at org.apache.zookeeper.ClientCnxnSocketNIO.doTransport(ClientCnxnSocketNIO.java:357)
    [junit] 	at org.apache.zookeeper.ClientCnxn$SendThread.run(ClientCnxn.java:1214)
    [junit] 2017-05-18 23:30:46,197 [myid:127.0.0.1:24690] - INFO  [main-SendThread(127.0.0.1:24690):ClientCnxn$SendThread@1113]
- Opening socket connection to server 127.0.0.1/127.0.0.1:24690. Will not attempt to authenticate
using SASL (unknown error)
    [junit] 2017-05-18 23:30:46,198 [myid:127.0.0.1:24690] - WARN  [main-SendThread(127.0.0.1:24690):ClientCnxn$SendThread@1235]
- Session 0x10448cf95c70001 for server 127.0.0.1/127.0.0.1:24690, unexpected error, closing
socket connection and attempting reconnect
    [junit] java.net.ConnectException: Connection refused
    [junit] 	at sun.nio.ch.SocketChannelImpl.checkConnect(Native Method)
    [junit] 	at sun.nio.ch.SocketChannelImpl.finishConnect(SocketChannelImpl.java:739)
    [junit] 	at org.apache.zookeeper.ClientCnxnSocketNIO.doTransport(ClientCnxnSocketNIO.java:357)
    [junit] 	at org.apache.zookeeper.ClientCnxn$SendThread.run(ClientCnxn.java:1214)
    [junit] 2017-05-18 23:30:46,272 [myid:127.0.0.1:24687] - INFO  [main-SendThread(127.0.0.1:24687):ClientCnxn$SendThread@1113]
- Opening socket connection to server 127.0.0.1/127.0.0.1:24687. Will not attempt to authenticate
using SASL (unknown error)
    [junit] 2017-05-18 23:30:46,273 [myid:127.0.0.1:24687] - WARN  [main-SendThread(127.0.0.1:24687):ClientCnxn$SendThread@1235]
- Session 0x448cf94830000 for server 127.0.0.1/127.0.0.1:24687, unexpected error, closing
socket connection and attempting reconnect
    [junit] java.net.ConnectException: Connection refused
    [junit] 	at sun.nio.ch.SocketChannelImpl.checkConnect(Native Method)
    [junit] 	at sun.nio.ch.SocketChannelImpl.finishConnect(SocketChannelImpl.java:739)
    [junit] 	at org.apache.zookeeper.ClientCnxnSocketNIO.doTransport(ClientCnxnSocketNIO.java:357)
    [junit] 	at org.apache.zookeeper.ClientCnxn$SendThread.run(ClientCnxn.java:1214)
    [junit] 2017-05-18 23:30:46,457 [myid:127.0.0.1:24690] - INFO  [main-SendThread(127.0.0.1:24690):ClientCnxn$SendThread@1113]
- Opening socket connection to server 127.0.0.1/127.0.0.1:24690. Will not attempt to authenticate
using SASL (unknown error)
    [junit] 2017-05-18 23:30:46,458 [myid:127.0.0.1:24690] - WARN  [main-SendThread(127.0.0.1:24690):ClientCnxn$SendThread@1235]
- Session 0x10448cf95c70000 for server 127.0.0.1/127.0.0.1:24690, unexpected error, closing
socket connection and attempting reconnect
    [junit] java.net.ConnectException: Connection refused
    [junit] 	at sun.nio.ch.SocketChannelImpl.checkConnect(Native Method)
    [junit] 	at sun.nio.ch.SocketChannelImpl.finishConnect(SocketChannelImpl.java:739)
    [junit] 	at org.apache.zookeeper.ClientCnxnSocketNIO.doTransport(ClientCnxnSocketNIO.java:357)
    [junit] 	at org.apache.zookeeper.ClientCnxn$SendThread.run(ClientCnxn.java:1214)
    [junit] Running org.apache.zookeeper.server.quorum.StandaloneDisabledTest in thread 6
    [junit] Tests run: 1, Failures: 0, Errors: 1, Skipped: 0, Time elapsed: 0 sec, Thread:
6, Class: org.apache.zookeeper.server.quorum.StandaloneDisabledTest
    [junit] Test org.apache.zookeeper.server.quorum.StandaloneDisabledTest FAILED (timeout)

fail.build.on.test.failure:

BUILD FAILED
/home/jenkins/jenkins-slave/workspace/ZooKeeper-trunk-openjdk7/build.xml:1219: The following
error occurred while executing this line:
/home/jenkins/jenkins-slave/workspace/ZooKeeper-trunk-openjdk7/build.xml:1223: Tests failed!

Total time: 16 minutes 7 seconds
Build step 'Invoke Ant' marked build as failure
Recording test results
Email was triggered for: Failure - Any
Sending email for trigger: Failure - Any



###################################################################################
############################## FAILED TESTS (if any) ##############################
1 tests failed.
FAILED:  org.apache.zookeeper.server.quorum.StandaloneDisabledTest.startSingleServerTest

Error Message:
Timeout occurred. Please note the time in the report does not reflect the time until the timeout.

Stack Trace:
junit.framework.AssertionFailedError: Timeout occurred. Please note the time in the report
does not reflect the time until the timeout.
	at java.lang.Thread.run(Thread.java:745)
Mime
  • Unnamed multipart/mixed (inline, None, 0 bytes)
View raw message