zookeeper-dev mailing list archives

Site index · List index
Message view « Date » · « Thread »
Top « Date » · « Thread »
From Apache Jenkins Server <jenk...@builds.apache.org>
Subject ZooKeeper-trunk-openjdk7 - Build # 1465 - Still Failing
Date Thu, 11 May 2017 16:33:27 GMT
See https://builds.apache.org/job/ZooKeeper-trunk-openjdk7/1465/

###################################################################################
########################## LAST 60 LINES OF THE CONSOLE ###########################
[...truncated 60.34 MB...]
    [junit] 2017-05-11 16:32:26,221 [myid:] - INFO  [SyncThread:0:MBeanRegistry@128] - Unregister
MBean [org.apache.ZooKeeperService:name0=StandaloneServer_port19547,name1=Connections,name2=127.0.0.1,name3=0x104234e57280000]
    [junit] 2017-05-11 16:32:26,221 [myid:] - INFO  [main:ZooKeeper@1329] - Session: 0x104234e57280000
closed
    [junit] 2017-05-11 16:32:26,221 [myid:] - INFO  [main-EventThread:ClientCnxn$EventThread@513]
- EventThread shut down for session: 0x104234e57280000
    [junit] 2017-05-11 16:32:26,221 [myid:] - INFO  [main:JUnit4ZKTestRunner$LoggedInvokeMethod@82]
- Memory used 216040
    [junit] 2017-05-11 16:32:26,221 [myid:] - INFO  [main:JUnit4ZKTestRunner$LoggedInvokeMethod@87]
- Number of threads 2455
    [junit] 2017-05-11 16:32:26,222 [myid:] - INFO  [main:JUnit4ZKTestRunner$LoggedInvokeMethod@102]
- FINISHED TEST METHOD testWatcherAutoResetWithLocal
    [junit] 2017-05-11 16:32:26,222 [myid:] - INFO  [main:ClientBase@582] - tearDown starting
    [junit] 2017-05-11 16:32:26,222 [myid:] - INFO  [main:ClientBase@552] - STOPPING server
    [junit] 2017-05-11 16:32:26,222 [myid:] - INFO  [main:NettyServerCnxnFactory@464] - shutdown
called 0.0.0.0/0.0.0.0:19547
    [junit] 2017-05-11 16:32:26,226 [myid:] - INFO  [main:ZooKeeperServer@542] - shutting
down
    [junit] 2017-05-11 16:32:26,226 [myid:] - ERROR [main:ZooKeeperServer@506] - ZKShutdownHandler
is not registered, so ZooKeeper server won't take any action on ERROR or SHUTDOWN server state
changes
    [junit] 2017-05-11 16:32:26,226 [myid:] - INFO  [main:SessionTrackerImpl@232] - Shutting
down
    [junit] 2017-05-11 16:32:26,227 [myid:] - INFO  [main:PrepRequestProcessor@1008] - Shutting
down
    [junit] 2017-05-11 16:32:26,227 [myid:] - INFO  [main:SyncRequestProcessor@191] - Shutting
down
    [junit] 2017-05-11 16:32:26,227 [myid:] - INFO  [ProcessThread(sid:0 cport:19547)::PrepRequestProcessor@157]
- PrepRequestProcessor exited loop!
    [junit] 2017-05-11 16:32:26,227 [myid:] - INFO  [SyncThread:0:SyncRequestProcessor@169]
- SyncRequestProcessor exited!
    [junit] 2017-05-11 16:32:26,227 [myid:] - INFO  [main:FinalRequestProcessor@481] - shutdown
of request processor complete
    [junit] 2017-05-11 16:32:26,227 [myid:] - INFO  [main:MBeanRegistry@128] - Unregister
MBean [org.apache.ZooKeeperService:name0=StandaloneServer_port19547,name1=InMemoryDataTree]
    [junit] 2017-05-11 16:32:26,227 [myid:] - INFO  [main:MBeanRegistry@128] - Unregister
MBean [org.apache.ZooKeeperService:name0=StandaloneServer_port19547]
    [junit] 2017-05-11 16:32:26,228 [myid:] - INFO  [main:FourLetterWordMain@85] - connecting
to 127.0.0.1 19547
    [junit] 2017-05-11 16:32:26,228 [myid:] - INFO  [main:JMXEnv@146] - ensureOnly:[]
    [junit] 2017-05-11 16:32:26,235 [myid:] - INFO  [main:ClientBase@607] - fdcount after
test is: 7201 at start it was 7201
    [junit] 2017-05-11 16:32:26,235 [myid:] - INFO  [main:ZKTestCase$1@68] - SUCCEEDED testWatcherAutoResetWithLocal
    [junit] 2017-05-11 16:32:26,235 [myid:] - INFO  [main:ZKTestCase$1@63] - FINISHED testWatcherAutoResetWithLocal
    [junit] Tests run: 103, Failures: 1, Errors: 0, Skipped: 0, Time elapsed: 512.378 sec,
Thread: 4, Class: org.apache.zookeeper.test.NioNettySuiteTest
    [junit] 2017-05-11 16:32:26,469 [myid:127.0.0.1:19376] - INFO  [main-SendThread(127.0.0.1:19376):ClientCnxn$SendThread@1113]
- Opening socket connection to server 127.0.0.1/127.0.0.1:19376. Will not attempt to authenticate
using SASL (unknown error)
    [junit] 2017-05-11 16:32:26,470 [myid:127.0.0.1:19376] - WARN  [main-SendThread(127.0.0.1:19376):ClientCnxn$SendThread@1235]
- Session 0x1042348badd0001 for server 127.0.0.1/127.0.0.1:19376, unexpected error, closing
socket connection and attempting reconnect
    [junit] java.net.ConnectException: Connection refused
    [junit] 	at sun.nio.ch.SocketChannelImpl.checkConnect(Native Method)
    [junit] 	at sun.nio.ch.SocketChannelImpl.finishConnect(SocketChannelImpl.java:739)
    [junit] 	at org.apache.zookeeper.ClientCnxnSocketNIO.doTransport(ClientCnxnSocketNIO.java:357)
    [junit] 	at org.apache.zookeeper.ClientCnxn$SendThread.run(ClientCnxn.java:1214)
    [junit] 2017-05-11 16:32:26,478 [myid:127.0.0.1:19382] - INFO  [main-SendThread(127.0.0.1:19382):ClientCnxn$SendThread@1113]
- Opening socket connection to server 127.0.0.1/127.0.0.1:19382. Will not attempt to authenticate
using SASL (unknown error)
    [junit] 2017-05-11 16:32:26,479 [myid:127.0.0.1:19382] - WARN  [main-SendThread(127.0.0.1:19382):ClientCnxn$SendThread@1235]
- Session 0x3042348bb630001 for server 127.0.0.1/127.0.0.1:19382, unexpected error, closing
socket connection and attempting reconnect
    [junit] java.net.ConnectException: Connection refused
    [junit] 	at sun.nio.ch.SocketChannelImpl.checkConnect(Native Method)
    [junit] 	at sun.nio.ch.SocketChannelImpl.finishConnect(SocketChannelImpl.java:739)
    [junit] 	at org.apache.zookeeper.ClientCnxnSocketNIO.doTransport(ClientCnxnSocketNIO.java:357)
    [junit] 	at org.apache.zookeeper.ClientCnxn$SendThread.run(ClientCnxn.java:1214)
    [junit] 2017-05-11 16:32:26,714 [myid:127.0.0.1:19394] - INFO  [main-SendThread(127.0.0.1:19394):ClientCnxn$SendThread@1113]
- Opening socket connection to server 127.0.0.1/127.0.0.1:19394. Will not attempt to authenticate
using SASL (unknown error)
    [junit] 2017-05-11 16:32:26,715 [myid:127.0.0.1:19394] - WARN  [main-SendThread(127.0.0.1:19394):ClientCnxn$SendThread@1235]
- Session 0x7042348b99c0000 for server 127.0.0.1/127.0.0.1:19394, unexpected error, closing
socket connection and attempting reconnect
    [junit] java.net.ConnectException: Connection refused
    [junit] 	at sun.nio.ch.SocketChannelImpl.checkConnect(Native Method)
    [junit] 	at sun.nio.ch.SocketChannelImpl.finishConnect(SocketChannelImpl.java:739)
    [junit] 	at org.apache.zookeeper.ClientCnxnSocketNIO.doTransport(ClientCnxnSocketNIO.java:357)
    [junit] 	at org.apache.zookeeper.ClientCnxn$SendThread.run(ClientCnxn.java:1214)
    [junit] Test org.apache.zookeeper.test.NioNettySuiteTest FAILED

fail.build.on.test.failure:

BUILD FAILED
/home/jenkins/jenkins-slave/workspace/ZooKeeper-trunk-openjdk7/build.xml:1219: The following
error occurred while executing this line:
/home/jenkins/jenkins-slave/workspace/ZooKeeper-trunk-openjdk7/build.xml:1223: Tests failed!

Total time: 13 minutes 26 seconds
Build step 'Invoke Ant' marked build as failure
Recording test results
Email was triggered for: Failure - Any
Sending email for trigger: Failure - Any



###################################################################################
############################## FAILED TESTS (if any) ##############################
5 tests failed.
FAILED:  org.apache.zookeeper.server.ZooKeeperServerMainTest.testWithOnlyMinSessionTimeout

Error Message:
Failed to establish zkclient connection!

Stack Trace:
junit.framework.AssertionFailedError: Failed to establish zkclient connection!
	at org.apache.zookeeper.server.ZooKeeperServerMainTest.verifySessionTimeOut(ZooKeeperServerMainTest.java:420)
	at org.apache.zookeeper.server.ZooKeeperServerMainTest.testWithOnlyMinSessionTimeout(ZooKeeperServerMainTest.java:370)
	at org.apache.zookeeper.JUnit4ZKTestRunner$LoggedInvokeMethod.evaluate(JUnit4ZKTestRunner.java:79)


FAILED:  org.apache.zookeeper.test.FourLetterWordsQuorumTest.testNull

Error Message:
waiting for server up

Stack Trace:
junit.framework.AssertionFailedError: waiting for server up
	at org.apache.zookeeper.test.QuorumBase.startServers(QuorumBase.java:223)
	at org.apache.zookeeper.test.QuorumBase.setUp(QuorumBase.java:120)
	at org.apache.zookeeper.test.QuorumBase.setUp(QuorumBase.java:78)


FAILED:  org.apache.zookeeper.test.ReconfigTest.testPortChange

Error Message:
Existing client disconnected when client port changed!

Stack Trace:
junit.framework.AssertionFailedError: Existing client disconnected when client port changed!
	at org.apache.zookeeper.test.ReconfigTest.testPortChange(ReconfigTest.java:621)
	at org.apache.zookeeper.JUnit4ZKTestRunner$LoggedInvokeMethod.evaluate(JUnit4ZKTestRunner.java:79)


FAILED:  org.apache.zookeeper.test.ReconfigTest.testQuorumSystemChange

Error Message:
Waiting for server up

Stack Trace:
junit.framework.AssertionFailedError: Waiting for server up
	at org.apache.zookeeper.test.QuorumUtil.restart(QuorumUtil.java:216)
	at org.apache.zookeeper.test.ReconfigTest.testQuorumSystemChange(ReconfigTest.java:859)
	at org.apache.zookeeper.JUnit4ZKTestRunner$LoggedInvokeMethod.evaluate(JUnit4ZKTestRunner.java:79)


FAILED:  org.apache.zookeeper.test.QuorumZxidSyncTest.testLateLogs

Error Message:
waiting for server up

Stack Trace:
junit.framework.AssertionFailedError: waiting for server up
	at org.apache.zookeeper.test.QuorumBase.startServers(QuorumBase.java:223)
	at org.apache.zookeeper.test.QuorumBase.setUp(QuorumBase.java:120)
	at org.apache.zookeeper.test.QuorumBase.setUp(QuorumBase.java:78)
	at org.apache.zookeeper.test.QuorumZxidSyncTest.setUp(QuorumZxidSyncTest.java:40)
Mime
  • Unnamed multipart/mixed (inline, None, 0 bytes)
View raw message