zookeeper-dev mailing list archives

Site index · List index
Message view « Date » · « Thread »
Top « Date » · « Thread »
From Apache Jenkins Server <jenk...@builds.apache.org>
Subject ZooKeeper-trunk-openjdk7 - Build # 1484 - Still Failing
Date Sat, 27 May 2017 20:02:37 GMT
See https://builds.apache.org/job/ZooKeeper-trunk-openjdk7/1484/

###################################################################################
########################## LAST 60 LINES OF THE CONSOLE ###########################
[...truncated 64.10 MB...]
    [junit] 	at org.jboss.netty.channel.socket.nio.AbstractNioWorker.close(AbstractNioWorker.java:373)
    [junit] 	at org.jboss.netty.channel.socket.nio.NioServerSocketPipelineSink.handleAcceptedSocket(NioServerSocketPipelineSink.java:81)
    [junit] 	at org.jboss.netty.channel.socket.nio.NioServerSocketPipelineSink.eventSunk(NioServerSocketPipelineSink.java:36)
    [junit] 	at org.jboss.netty.channel.DefaultChannelPipeline$DefaultChannelHandlerContext.sendDownstream(DefaultChannelPipeline.java:779)
    [junit] 	at org.jboss.netty.channel.SimpleChannelHandler.closeRequested(SimpleChannelHandler.java:334)
    [junit] 	at org.jboss.netty.channel.SimpleChannelHandler.handleDownstream(SimpleChannelHandler.java:260)
    [junit] 	at org.jboss.netty.channel.DefaultChannelPipeline.sendDownstream(DefaultChannelPipeline.java:591)
    [junit] 	at org.jboss.netty.channel.DefaultChannelPipeline.sendDownstream(DefaultChannelPipeline.java:582)
    [junit] 	at org.jboss.netty.channel.Channels.close(Channels.java:812)
    [junit] 	at org.jboss.netty.channel.AbstractChannel.close(AbstractChannel.java:206)
    [junit] 	at org.apache.zookeeper.server.NettyServerCnxn.close(NettyServerCnxn.java:118)
    [junit] 	at org.apache.zookeeper.server.NettyServerCnxn.sendBuffer(NettyServerCnxn.java:221)
    [junit] 	at org.apache.zookeeper.server.NettyServerCnxn.sendCloseSession(NettyServerCnxn.java:460)
    [junit] 	at org.apache.zookeeper.server.FinalRequestProcessor.processRequest(FinalRequestProcessor.java:461)
    [junit] 	at org.apache.zookeeper.server.SyncRequestProcessor.flush(SyncRequestProcessor.java:182)
    [junit] 	at org.apache.zookeeper.server.SyncRequestProcessor.run(SyncRequestProcessor.java:113)
    [junit] 2017-05-27 20:02:32,537 [myid:] - INFO  [main:ZooKeeper@1329] - Session: 0x1047677cc370000
closed
    [junit] 2017-05-27 20:02:32,537 [myid:] - INFO  [main-EventThread:ClientCnxn$EventThread@513]
- EventThread shut down for session: 0x1047677cc370000
    [junit] 2017-05-27 20:02:32,537 [myid:] - INFO  [main:JUnit4ZKTestRunner$LoggedInvokeMethod@82]
- Memory used 227186
    [junit] 2017-05-27 20:02:32,537 [myid:] - INFO  [main:JUnit4ZKTestRunner$LoggedInvokeMethod@87]
- Number of threads 2426
    [junit] 2017-05-27 20:02:32,537 [myid:] - INFO  [main:JUnit4ZKTestRunner$LoggedInvokeMethod@102]
- FINISHED TEST METHOD testWatcherAutoResetWithLocal
    [junit] 2017-05-27 20:02:32,537 [myid:] - INFO  [main:ClientBase@582] - tearDown starting
    [junit] 2017-05-27 20:02:32,538 [myid:] - INFO  [main:ClientBase@552] - STOPPING server
    [junit] 2017-05-27 20:02:32,538 [myid:] - INFO  [main:NettyServerCnxnFactory@464] - shutdown
called 0.0.0.0/0.0.0.0:19547
    [junit] 2017-05-27 20:02:32,541 [myid:] - INFO  [main:ZooKeeperServer@542] - shutting
down
    [junit] 2017-05-27 20:02:32,541 [myid:] - ERROR [main:ZooKeeperServer@506] - ZKShutdownHandler
is not registered, so ZooKeeper server won't take any action on ERROR or SHUTDOWN server state
changes
    [junit] 2017-05-27 20:02:32,541 [myid:] - INFO  [main:SessionTrackerImpl@232] - Shutting
down
    [junit] 2017-05-27 20:02:32,541 [myid:] - INFO  [main:PrepRequestProcessor@1008] - Shutting
down
    [junit] 2017-05-27 20:02:32,541 [myid:] - INFO  [main:SyncRequestProcessor@191] - Shutting
down
    [junit] 2017-05-27 20:02:32,541 [myid:] - INFO  [ProcessThread(sid:0 cport:19547)::PrepRequestProcessor@157]
- PrepRequestProcessor exited loop!
    [junit] 2017-05-27 20:02:32,541 [myid:] - INFO  [SyncThread:0:SyncRequestProcessor@169]
- SyncRequestProcessor exited!
    [junit] 2017-05-27 20:02:32,542 [myid:] - INFO  [main:FinalRequestProcessor@481] - shutdown
of request processor complete
    [junit] 2017-05-27 20:02:32,542 [myid:] - INFO  [main:MBeanRegistry@128] - Unregister
MBean [org.apache.ZooKeeperService:name0=StandaloneServer_port19547,name1=InMemoryDataTree]
    [junit] 2017-05-27 20:02:32,542 [myid:] - INFO  [main:MBeanRegistry@128] - Unregister
MBean [org.apache.ZooKeeperService:name0=StandaloneServer_port19547]
    [junit] 2017-05-27 20:02:32,542 [myid:] - INFO  [main:FourLetterWordMain@85] - connecting
to 127.0.0.1 19547
    [junit] 2017-05-27 20:02:32,543 [myid:] - INFO  [main:JMXEnv@146] - ensureOnly:[]
    [junit] 2017-05-27 20:02:32,549 [myid:] - INFO  [main:ClientBase@607] - fdcount after
test is: 7134 at start it was 7134
    [junit] 2017-05-27 20:02:32,550 [myid:] - INFO  [main:ZKTestCase$1@68] - SUCCEEDED testWatcherAutoResetWithLocal
    [junit] 2017-05-27 20:02:32,550 [myid:] - INFO  [main:ZKTestCase$1@63] - FINISHED testWatcherAutoResetWithLocal
    [junit] Tests run: 103, Failures: 0, Errors: 0, Skipped: 0, Time elapsed: 490.977 sec,
Thread: 4, Class: org.apache.zookeeper.test.NioNettySuiteTest
    [junit] 2017-05-27 20:02:32,635 [myid:127.0.0.1:19430] - INFO  [main-SendThread(127.0.0.1:19430):ClientCnxn$SendThread@1113]
- Opening socket connection to server 127.0.0.1/127.0.0.1:19430. Will not attempt to authenticate
using SASL (unknown error)
    [junit] 2017-05-27 20:02:32,635 [myid:127.0.0.1:19430] - WARN  [main-SendThread(127.0.0.1:19430):ClientCnxn$SendThread@1235]
- Session 0x304767431c70000 for server 127.0.0.1/127.0.0.1:19430, unexpected error, closing
socket connection and attempting reconnect
    [junit] java.net.ConnectException: Connection refused
    [junit] 	at sun.nio.ch.SocketChannelImpl.checkConnect(Native Method)
    [junit] 	at sun.nio.ch.SocketChannelImpl.finishConnect(SocketChannelImpl.java:739)
    [junit] 	at org.apache.zookeeper.ClientCnxnSocketNIO.doTransport(ClientCnxnSocketNIO.java:357)
    [junit] 	at org.apache.zookeeper.ClientCnxn$SendThread.run(ClientCnxn.java:1214)

fail.build.on.test.failure:

BUILD FAILED
/home/jenkins/jenkins-slave/workspace/ZooKeeper-trunk-openjdk7/build.xml:1219: The following
error occurred while executing this line:
/home/jenkins/jenkins-slave/workspace/ZooKeeper-trunk-openjdk7/build.xml:1223: Tests failed!

Total time: 11 minutes 27 seconds
Build step 'Invoke Ant' marked build as failure
Recording test results
Email was triggered for: Failure - Any
Sending email for trigger: Failure - Any



###################################################################################
############################## FAILED TESTS (if any) ##############################
2 tests failed.
FAILED:  org.apache.zookeeper.test.WatchEventWhenAutoResetTest.testNodeDataChanged

Error Message:
expected:<NodeDataChanged> but was:<NodeDeleted>

Stack Trace:
junit.framework.AssertionFailedError: expected:<NodeDataChanged> but was:<NodeDeleted>
	at org.apache.zookeeper.test.WatchEventWhenAutoResetTest$EventsWatcher.assertEvent(WatchEventWhenAutoResetTest.java:67)
	at org.apache.zookeeper.test.WatchEventWhenAutoResetTest.testNodeDataChanged(WatchEventWhenAutoResetTest.java:126)
	at org.apache.zookeeper.JUnit4ZKTestRunner$LoggedInvokeMethod.evaluate(JUnit4ZKTestRunner.java:79)


FAILED:  org.apache.zookeeper.ZooKeeperTest.testCreateNodeWithoutData

Error Message:
Path must start with / character

Stack Trace:
org.apache.zookeeper.cli.MalformedPathException: Path must start with / character
	at org.apache.zookeeper.cli.CreateCommand.exec(CreateCommand.java:122)
	at org.apache.zookeeper.ZooKeeperMain.processZKCmd(ZooKeeperMain.java:655)
	at org.apache.zookeeper.ZooKeeperTest.testCreateNodeWithoutData(ZooKeeperTest.java:292)
	at org.apache.zookeeper.JUnit4ZKTestRunner$LoggedInvokeMethod.evaluate(JUnit4ZKTestRunner.java:79)
Mime
  • Unnamed multipart/mixed (inline, None, 0 bytes)
View raw message