zookeeper-dev mailing list archives

Site index · List index
Message view « Date » · « Thread »
Top « Date » · « Thread »
From Apache Jenkins Server <jenk...@builds.apache.org>
Subject ZooKeeper-trunk-jdk8 - Build # 1064 - Still Failing
Date Mon, 29 May 2017 12:05:08 GMT
See https://builds.apache.org/job/ZooKeeper-trunk-jdk8/1064/

###################################################################################
########################## LAST 60 LINES OF THE CONSOLE ###########################
[...truncated 60.94 MB...]
    [junit] 	at org.apache.zookeeper.ClientCnxnSocketNIO.doTransport(ClientCnxnSocketNIO.java:357)
    [junit] 	at org.apache.zookeeper.ClientCnxn$SendThread.run(ClientCnxn.java:1214)
    [junit] 2017-05-29 12:03:39,492 [myid:127.0.0.1:19476] - INFO  [main-SendThread(127.0.0.1:19476):ClientCnxn$SendThread@1113]
- Opening socket connection to server 127.0.0.1/127.0.0.1:19476. Will not attempt to authenticate
using SASL (unknown error)
    [junit] 2017-05-29 12:03:39,493 [myid:127.0.0.1:19476] - INFO  [main-SendThread(127.0.0.1:19476):ClientCnxn$SendThread@948]
- Socket connection established, initiating session, client: /127.0.0.1:54726, server: 127.0.0.1/127.0.0.1:19476
    [junit] 2017-05-29 12:03:39,493 [myid:] - INFO  [New I/O worker #2457:ZooKeeperServer@1026]
- Client attempting to renew session 0x103cd80a6310000 at /127.0.0.1:54726
    [junit] 2017-05-29 12:03:39,493 [myid:] - INFO  [New I/O worker #2457:Learner@110] - Revalidating
client: 0x103cd80a6310000
    [junit] 2017-05-29 12:03:39,494 [myid:] - INFO  [QuorumPeer[myid=1](plain=/127.0.0.1:19476)(secure=disabled):ZooKeeperServer@728]
- Established session 0x103cd80a6310000 with negotiated timeout 30000 for client /127.0.0.1:54726
    [junit] 2017-05-29 12:03:39,494 [myid:127.0.0.1:19476] - INFO  [main-SendThread(127.0.0.1:19476):ClientCnxn$SendThread@1381]
- Session establishment complete on server 127.0.0.1/127.0.0.1:19476, sessionid = 0x103cd80a6310000,
negotiated timeout = 30000
    [junit] 2017-05-29 12:03:39,781 [myid:127.0.0.1:19301] - INFO  [main-SendThread(127.0.0.1:19301):ClientCnxn$SendThread@1113]
- Opening socket connection to server 127.0.0.1/127.0.0.1:19301. Will not attempt to authenticate
using SASL (unknown error)
    [junit] 2017-05-29 12:03:39,782 [myid:127.0.0.1:19301] - WARN  [main-SendThread(127.0.0.1:19301):ClientCnxn$SendThread@1235]
- Session 0x103cd7afd2e0000 for server 127.0.0.1/127.0.0.1:19301, unexpected error, closing
socket connection and attempting reconnect
    [junit] java.net.ConnectException: Connection refused
    [junit] 	at sun.nio.ch.SocketChannelImpl.checkConnect(Native Method)
    [junit] 	at sun.nio.ch.SocketChannelImpl.finishConnect(SocketChannelImpl.java:717)
    [junit] 	at org.apache.zookeeper.ClientCnxnSocketNIO.doTransport(ClientCnxnSocketNIO.java:357)
    [junit] 	at org.apache.zookeeper.ClientCnxn$SendThread.run(ClientCnxn.java:1214)
    [junit] 2017-05-29 12:03:40,561 [myid:127.0.0.1:19427] - INFO  [main-SendThread(127.0.0.1:19427):ClientCnxn$SendThread@1113]
- Opening socket connection to server 127.0.0.1/127.0.0.1:19427. Will not attempt to authenticate
using SASL (unknown error)
    [junit] 2017-05-29 12:03:40,562 [myid:127.0.0.1:19427] - WARN  [main-SendThread(127.0.0.1:19427):ClientCnxn$SendThread@1235]
- Session 0x203cd7f0f980000 for server 127.0.0.1/127.0.0.1:19427, unexpected error, closing
socket connection and attempting reconnect
    [junit] java.net.ConnectException: Connection refused
    [junit] 	at sun.nio.ch.SocketChannelImpl.checkConnect(Native Method)
    [junit] 	at sun.nio.ch.SocketChannelImpl.finishConnect(SocketChannelImpl.java:717)
    [junit] 	at org.apache.zookeeper.ClientCnxnSocketNIO.doTransport(ClientCnxnSocketNIO.java:357)
    [junit] 	at org.apache.zookeeper.ClientCnxn$SendThread.run(ClientCnxn.java:1214)
    [junit] 2017-05-29 12:03:40,935 [myid:127.0.0.1:19424] - INFO  [main-SendThread(127.0.0.1:19424):ClientCnxn$SendThread@1113]
- Opening socket connection to server 127.0.0.1/127.0.0.1:19424. Will not attempt to authenticate
using SASL (unknown error)
    [junit] 2017-05-29 12:03:40,936 [myid:127.0.0.1:19424] - WARN  [main-SendThread(127.0.0.1:19424):ClientCnxn$SendThread@1235]
- Session 0x103cd7f0f5a0000 for server 127.0.0.1/127.0.0.1:19424, unexpected error, closing
socket connection and attempting reconnect
    [junit] java.net.ConnectException: Connection refused
    [junit] 	at sun.nio.ch.SocketChannelImpl.checkConnect(Native Method)
    [junit] 	at sun.nio.ch.SocketChannelImpl.finishConnect(SocketChannelImpl.java:717)
    [junit] 	at org.apache.zookeeper.ClientCnxnSocketNIO.doTransport(ClientCnxnSocketNIO.java:357)
    [junit] 	at org.apache.zookeeper.ClientCnxn$SendThread.run(ClientCnxn.java:1214)
    [junit] 2017-05-29 12:03:41,067 [myid:127.0.0.1:19430] - INFO  [main-SendThread(127.0.0.1:19430):ClientCnxn$SendThread@1113]
- Opening socket connection to server 127.0.0.1/127.0.0.1:19430. Will not attempt to authenticate
using SASL (unknown error)
    [junit] 2017-05-29 12:03:41,068 [myid:127.0.0.1:19430] - WARN  [main-SendThread(127.0.0.1:19430):ClientCnxn$SendThread@1235]
- Session 0x303cd7f0f640000 for server 127.0.0.1/127.0.0.1:19430, unexpected error, closing
socket connection and attempting reconnect
    [junit] java.net.ConnectException: Connection refused
    [junit] 	at sun.nio.ch.SocketChannelImpl.checkConnect(Native Method)
    [junit] 	at sun.nio.ch.SocketChannelImpl.finishConnect(SocketChannelImpl.java:717)
    [junit] 	at org.apache.zookeeper.ClientCnxnSocketNIO.doTransport(ClientCnxnSocketNIO.java:357)
    [junit] 	at org.apache.zookeeper.ClientCnxn$SendThread.run(ClientCnxn.java:1214)
    [junit] 2017-05-29 12:03:41,442 [myid:127.0.0.1:19301] - INFO  [main-SendThread(127.0.0.1:19301):ClientCnxn$SendThread@1113]
- Opening socket connection to server 127.0.0.1/127.0.0.1:19301. Will not attempt to authenticate
using SASL (unknown error)
    [junit] 2017-05-29 12:03:41,442 [myid:127.0.0.1:19301] - WARN  [main-SendThread(127.0.0.1:19301):ClientCnxn$SendThread@1235]
- Session 0x103cd7afd2e0000 for server 127.0.0.1/127.0.0.1:19301, unexpected error, closing
socket connection and attempting reconnect
    [junit] java.net.ConnectException: Connection refused
    [junit] 	at sun.nio.ch.SocketChannelImpl.checkConnect(Native Method)
    [junit] 	at sun.nio.ch.SocketChannelImpl.finishConnect(SocketChannelImpl.java:717)
    [junit] 	at org.apache.zookeeper.ClientCnxnSocketNIO.doTransport(ClientCnxnSocketNIO.java:357)
    [junit] 	at org.apache.zookeeper.ClientCnxn$SendThread.run(ClientCnxn.java:1214)
    [junit] Running org.apache.zookeeper.test.NioNettySuiteTest in thread 4
    [junit] Tests run: 1, Failures: 0, Errors: 1, Skipped: 0, Time elapsed: 0 sec, Thread:
4, Class: org.apache.zookeeper.test.NioNettySuiteTest
    [junit] Test org.apache.zookeeper.test.NioNettySuiteTest FAILED (timeout)

fail.build.on.test.failure:

BUILD FAILED
/home/jenkins/jenkins-slave/workspace/ZooKeeper-trunk-jdk8/build.xml:1219: The following error
occurred while executing this line:
/home/jenkins/jenkins-slave/workspace/ZooKeeper-trunk-jdk8/build.xml:1223: Tests failed!

Total time: 19 minutes 22 seconds
Build step 'Invoke Ant' marked build as failure
[WARNINGS] Skipping publisher since build result is FAILURE
Recording test results
Email was triggered for: Failure - Any
Sending email for trigger: Failure - Any



###################################################################################
############################## FAILED TESTS (if any) ##############################
2 tests failed.
FAILED:  org.apache.zookeeper.test.NioNettySuiteTest.testRoleChange

Error Message:
Timeout occurred. Please note the time in the report does not reflect the time until the timeout.

Stack Trace:
junit.framework.AssertionFailedError: Timeout occurred. Please note the time in the report
does not reflect the time until the timeout.
	at java.lang.Thread.run(Thread.java:745)


FAILED:  org.apache.zookeeper.ZooKeeperTest.testCreateNodeWithoutData

Error Message:
Path must start with / character

Stack Trace:
org.apache.zookeeper.cli.MalformedPathException: Path must start with / character
	at org.apache.zookeeper.cli.CreateCommand.exec(CreateCommand.java:122)
	at org.apache.zookeeper.ZooKeeperMain.processZKCmd(ZooKeeperMain.java:655)
	at org.apache.zookeeper.ZooKeeperTest.testCreateNodeWithoutData(ZooKeeperTest.java:293)
	at org.apache.zookeeper.JUnit4ZKTestRunner$LoggedInvokeMethod.evaluate(JUnit4ZKTestRunner.java:79)
Mime
  • Unnamed multipart/mixed (inline, None, 0 bytes)
View raw message