zookeeper-dev mailing list archives

Site index · List index
Message view « Date » · « Thread »
Top « Date » · « Thread »
From Apache Jenkins Server <jenk...@builds.apache.org>
Subject ZooKeeper-trunk-openjdk7 - Build # 1485 - Still Failing
Date Sun, 28 May 2017 20:02:23 GMT
See https://builds.apache.org/job/ZooKeeper-trunk-openjdk7/1485/

###################################################################################
########################## LAST 60 LINES OF THE CONSOLE ###########################
[...truncated 62.54 MB...]
    [junit] 2017-05-28 20:02:18,757 [myid:127.0.0.1:30073] - WARN  [main-SendThread(127.0.0.1:30073):ClientCnxn$SendThread@1235]
- Session 0x1047b96b68d0000 for server 127.0.0.1/127.0.0.1:30073, unexpected error, closing
socket connection and attempting reconnect
    [junit] java.net.ConnectException: Connection refused
    [junit] 	at sun.nio.ch.SocketChannelImpl.checkConnect(Native Method)
    [junit] 	at sun.nio.ch.SocketChannelImpl.finishConnect(SocketChannelImpl.java:739)
    [junit] 	at org.apache.zookeeper.ClientCnxnSocketNIO.doTransport(ClientCnxnSocketNIO.java:357)
    [junit] 	at org.apache.zookeeper.ClientCnxn$SendThread.run(ClientCnxn.java:1214)
    [junit] 2017-05-28 20:02:18,915 [myid:127.0.0.1:30202] - INFO  [main-SendThread(127.0.0.1:30202):ClientCnxn$SendThread@1113]
- Opening socket connection to server 127.0.0.1/127.0.0.1:30202. Will not attempt to authenticate
using SASL (unknown error)
    [junit] 2017-05-28 20:02:18,916 [myid:127.0.0.1:30202] - WARN  [main-SendThread(127.0.0.1:30202):ClientCnxn$SendThread@1235]
- Session 0x3047b9a6abd0000 for server 127.0.0.1/127.0.0.1:30202, unexpected error, closing
socket connection and attempting reconnect
    [junit] java.net.ConnectException: Connection refused
    [junit] 	at sun.nio.ch.SocketChannelImpl.checkConnect(Native Method)
    [junit] 	at sun.nio.ch.SocketChannelImpl.finishConnect(SocketChannelImpl.java:739)
    [junit] 	at org.apache.zookeeper.ClientCnxnSocketNIO.doTransport(ClientCnxnSocketNIO.java:357)
    [junit] 	at org.apache.zookeeper.ClientCnxn$SendThread.run(ClientCnxn.java:1214)
    [junit] 2017-05-28 20:02:19,484 [myid:] - INFO  [ProcessThread(sid:0 cport:30319)::PrepRequestProcessor@617]
- Processed session termination for sessionid: 0x1047b9df31e0000
    [junit] 2017-05-28 20:02:19,485 [myid:] - INFO  [SyncThread:0:MBeanRegistry@128] - Unregister
MBean [org.apache.ZooKeeperService:name0=StandaloneServer_port30319,name1=Connections,name2=127.0.0.1,name3=0x1047b9df31e0000]
    [junit] 2017-05-28 20:02:19,485 [myid:] - INFO  [main:ZooKeeper@1329] - Session: 0x1047b9df31e0000
closed
    [junit] 2017-05-28 20:02:19,485 [myid:] - INFO  [main:JUnit4ZKTestRunner$LoggedInvokeMethod@82]
- Memory used 198025
    [junit] 2017-05-28 20:02:19,485 [myid:] - INFO  [main:JUnit4ZKTestRunner$LoggedInvokeMethod@87]
- Number of threads 2428
    [junit] 2017-05-28 20:02:19,485 [myid:] - INFO  [main:JUnit4ZKTestRunner$LoggedInvokeMethod@102]
- FINISHED TEST METHOD testWatcherAutoResetWithLocal
    [junit] 2017-05-28 20:02:19,485 [myid:] - INFO  [main:ClientBase@582] - tearDown starting
    [junit] 2017-05-28 20:02:19,485 [myid:] - INFO  [main:ClientBase@552] - STOPPING server
    [junit] 2017-05-28 20:02:19,485 [myid:] - INFO  [main:NettyServerCnxnFactory@464] - shutdown
called 0.0.0.0/0.0.0.0:30319
    [junit] 2017-05-28 20:02:19,486 [myid:] - INFO  [main-EventThread:ClientCnxn$EventThread@513]
- EventThread shut down for session: 0x1047b9df31e0000
    [junit] 2017-05-28 20:02:19,488 [myid:] - INFO  [main:ZooKeeperServer@542] - shutting
down
    [junit] 2017-05-28 20:02:19,489 [myid:] - ERROR [main:ZooKeeperServer@506] - ZKShutdownHandler
is not registered, so ZooKeeper server won't take any action on ERROR or SHUTDOWN server state
changes
    [junit] 2017-05-28 20:02:19,489 [myid:] - INFO  [main:SessionTrackerImpl@232] - Shutting
down
    [junit] 2017-05-28 20:02:19,489 [myid:] - INFO  [main:PrepRequestProcessor@1008] - Shutting
down
    [junit] 2017-05-28 20:02:19,489 [myid:] - INFO  [main:SyncRequestProcessor@191] - Shutting
down
    [junit] 2017-05-28 20:02:19,489 [myid:] - INFO  [SyncThread:0:SyncRequestProcessor@169]
- SyncRequestProcessor exited!
    [junit] 2017-05-28 20:02:19,491 [myid:] - INFO  [ProcessThread(sid:0 cport:30319)::PrepRequestProcessor@157]
- PrepRequestProcessor exited loop!
    [junit] 2017-05-28 20:02:19,491 [myid:] - INFO  [main:FinalRequestProcessor@481] - shutdown
of request processor complete
    [junit] 2017-05-28 20:02:19,491 [myid:] - INFO  [main:MBeanRegistry@128] - Unregister
MBean [org.apache.ZooKeeperService:name0=StandaloneServer_port30319,name1=InMemoryDataTree]
    [junit] 2017-05-28 20:02:19,491 [myid:] - INFO  [main:MBeanRegistry@128] - Unregister
MBean [org.apache.ZooKeeperService:name0=StandaloneServer_port30319]
    [junit] 2017-05-28 20:02:19,492 [myid:] - INFO  [main:FourLetterWordMain@85] - connecting
to 127.0.0.1 30319
    [junit] 2017-05-28 20:02:19,492 [myid:] - INFO  [main:JMXEnv@146] - ensureOnly:[]
    [junit] 2017-05-28 20:02:19,500 [myid:] - INFO  [main:ClientBase@607] - fdcount after
test is: 7141 at start it was 7137
    [junit] 2017-05-28 20:02:19,500 [myid:] - INFO  [main:ClientBase@609] - sleeping for 20
secs
    [junit] 2017-05-28 20:02:19,501 [myid:] - INFO  [main:ZKTestCase$1@68] - SUCCEEDED testWatcherAutoResetWithLocal
    [junit] 2017-05-28 20:02:19,501 [myid:] - INFO  [main:ZKTestCase$1@63] - FINISHED testWatcherAutoResetWithLocal
    [junit] Tests run: 103, Failures: 0, Errors: 0, Skipped: 0, Time elapsed: 481.327 sec,
Thread: 8, Class: org.apache.zookeeper.test.NioNettySuiteTest
    [junit] 2017-05-28 20:02:19,710 [myid:127.0.0.1:30196] - INFO  [main-SendThread(127.0.0.1:30196):ClientCnxn$SendThread@1113]
- Opening socket connection to server 127.0.0.1/127.0.0.1:30196. Will not attempt to authenticate
using SASL (unknown error)
    [junit] 2017-05-28 20:02:19,711 [myid:127.0.0.1:30196] - WARN  [main-SendThread(127.0.0.1:30196):ClientCnxn$SendThread@1235]
- Session 0x1047b9a6aba0000 for server 127.0.0.1/127.0.0.1:30196, unexpected error, closing
socket connection and attempting reconnect
    [junit] java.net.ConnectException: Connection refused
    [junit] 	at sun.nio.ch.SocketChannelImpl.checkConnect(Native Method)
    [junit] 	at sun.nio.ch.SocketChannelImpl.finishConnect(SocketChannelImpl.java:739)
    [junit] 	at org.apache.zookeeper.ClientCnxnSocketNIO.doTransport(ClientCnxnSocketNIO.java:357)
    [junit] 	at org.apache.zookeeper.ClientCnxn$SendThread.run(ClientCnxn.java:1214)

fail.build.on.test.failure:

BUILD FAILED
/home/jenkins/jenkins-slave/workspace/ZooKeeper-trunk-openjdk7/build.xml:1219: The following
error occurred while executing this line:
/home/jenkins/jenkins-slave/workspace/ZooKeeper-trunk-openjdk7/build.xml:1223: Tests failed!

Total time: 11 minutes 16 seconds
Build step 'Invoke Ant' marked build as failure
Recording test results
Email was triggered for: Failure - Any
Sending email for trigger: Failure - Any



###################################################################################
############################## FAILED TESTS (if any) ##############################
1 tests failed.
FAILED:  org.apache.zookeeper.ZooKeeperTest.testCreateNodeWithoutData

Error Message:
Path must start with / character

Stack Trace:
org.apache.zookeeper.cli.MalformedPathException: Path must start with / character
	at org.apache.zookeeper.cli.CreateCommand.exec(CreateCommand.java:122)
	at org.apache.zookeeper.ZooKeeperMain.processZKCmd(ZooKeeperMain.java:655)
	at org.apache.zookeeper.ZooKeeperTest.testCreateNodeWithoutData(ZooKeeperTest.java:292)
	at org.apache.zookeeper.JUnit4ZKTestRunner$LoggedInvokeMethod.evaluate(JUnit4ZKTestRunner.java:79)
Mime
  • Unnamed multipart/mixed (inline, None, 0 bytes)
View raw message