zookeeper-dev mailing list archives

Site index · List index
Message view « Date » · « Thread »
Top « Date » · « Thread »
From Apache Jenkins Server <jenk...@builds.apache.org>
Subject ZooKeeper-trunk-jdk8 - Build # 1012 - Still Failing
Date Tue, 11 Apr 2017 11:57:27 GMT
See https://builds.apache.org/job/ZooKeeper-trunk-jdk8/1012/

###################################################################################
########################## LAST 60 LINES OF THE CONSOLE ###########################
[...truncated 62.11 MB...]
    [junit] java.net.ConnectException: Connection refused
    [junit] 	at sun.nio.ch.SocketChannelImpl.checkConnect(Native Method)
    [junit] 	at sun.nio.ch.SocketChannelImpl.finishConnect(SocketChannelImpl.java:717)
    [junit] 	at org.apache.zookeeper.ClientCnxnSocketNIO.doTransport(ClientCnxnSocketNIO.java:357)
    [junit] 	at org.apache.zookeeper.ClientCnxn$SendThread.run(ClientCnxn.java:1214)
    [junit] 2017-04-11 11:56:52,869 [myid:127.0.0.1:30202] - INFO  [main-SendThread(127.0.0.1:30202):ClientCnxn$SendThread@1113]
- Opening socket connection to server 127.0.0.1/127.0.0.1:30202. Will not attempt to authenticate
using SASL (unknown error)
    [junit] 2017-04-11 11:56:52,870 [myid:127.0.0.1:30202] - WARN  [main-SendThread(127.0.0.1:30202):ClientCnxn$SendThread@1235]
- Session 0x302d64dc36b0000 for server 127.0.0.1/127.0.0.1:30202, unexpected error, closing
socket connection and attempting reconnect
    [junit] java.net.ConnectException: Connection refused
    [junit] 	at sun.nio.ch.SocketChannelImpl.checkConnect(Native Method)
    [junit] 	at sun.nio.ch.SocketChannelImpl.finishConnect(SocketChannelImpl.java:717)
    [junit] 	at org.apache.zookeeper.ClientCnxnSocketNIO.doTransport(ClientCnxnSocketNIO.java:357)
    [junit] 	at org.apache.zookeeper.ClientCnxn$SendThread.run(ClientCnxn.java:1214)
    [junit] 2017-04-11 11:56:52,913 [myid:] - INFO  [SessionTracker:SessionTrackerImpl@158]
- SessionTrackerImpl exited loop!
    [junit] 2017-04-11 11:56:53,104 [myid:] - INFO  [ProcessThread(sid:0 cport:30319)::PrepRequestProcessor@617]
- Processed session termination for sessionid: 0x102d6511d280000
    [junit] 2017-04-11 11:56:53,106 [myid:] - INFO  [SyncThread:0:MBeanRegistry@128] - Unregister
MBean [org.apache.ZooKeeperService:name0=StandaloneServer_port30319,name1=Connections,name2=127.0.0.1,name3=0x102d6511d280000]
    [junit] 2017-04-11 11:56:53,106 [myid:] - INFO  [main-EventThread:ClientCnxn$EventThread@513]
- EventThread shut down for session: 0x102d6511d280000
    [junit] 2017-04-11 11:56:53,106 [myid:] - INFO  [main:ZooKeeper@1324] - Session: 0x102d6511d280000
closed
    [junit] 2017-04-11 11:56:53,106 [myid:] - INFO  [main:JUnit4ZKTestRunner$LoggedInvokeMethod@82]
- Memory used 163238
    [junit] 2017-04-11 11:56:53,107 [myid:] - INFO  [main:JUnit4ZKTestRunner$LoggedInvokeMethod@87]
- Number of threads 859
    [junit] 2017-04-11 11:56:53,107 [myid:] - INFO  [main:JUnit4ZKTestRunner$LoggedInvokeMethod@102]
- FINISHED TEST METHOD testWatcherAutoResetWithLocal
    [junit] 2017-04-11 11:56:53,107 [myid:] - INFO  [main:ClientBase@558] - tearDown starting
    [junit] 2017-04-11 11:56:53,107 [myid:] - INFO  [main:ClientBase@528] - STOPPING server
    [junit] 2017-04-11 11:56:53,107 [myid:] - INFO  [main:NettyServerCnxnFactory@464] - shutdown
called 0.0.0.0/0.0.0.0:30319
    [junit] 2017-04-11 11:56:53,110 [myid:] - INFO  [main:ZooKeeperServer@542] - shutting
down
    [junit] 2017-04-11 11:56:53,110 [myid:] - ERROR [main:ZooKeeperServer@506] - ZKShutdownHandler
is not registered, so ZooKeeper server won't take any action on ERROR or SHUTDOWN server state
changes
    [junit] 2017-04-11 11:56:53,110 [myid:] - INFO  [main:SessionTrackerImpl@232] - Shutting
down
    [junit] 2017-04-11 11:56:53,111 [myid:] - INFO  [main:PrepRequestProcessor@1008] - Shutting
down
    [junit] 2017-04-11 11:56:53,111 [myid:] - INFO  [main:SyncRequestProcessor@191] - Shutting
down
    [junit] 2017-04-11 11:56:53,111 [myid:] - INFO  [SyncThread:0:SyncRequestProcessor@169]
- SyncRequestProcessor exited!
    [junit] 2017-04-11 11:56:53,111 [myid:] - INFO  [main:FinalRequestProcessor@481] - shutdown
of request processor complete
    [junit] 2017-04-11 11:56:53,111 [myid:] - INFO  [ProcessThread(sid:0 cport:30319)::PrepRequestProcessor@157]
- PrepRequestProcessor exited loop!
    [junit] 2017-04-11 11:56:53,111 [myid:] - INFO  [main:MBeanRegistry@128] - Unregister
MBean [org.apache.ZooKeeperService:name0=StandaloneServer_port30319,name1=InMemoryDataTree]
    [junit] 2017-04-11 11:56:53,112 [myid:] - INFO  [main:MBeanRegistry@128] - Unregister
MBean [org.apache.ZooKeeperService:name0=StandaloneServer_port30319]
    [junit] 2017-04-11 11:56:53,112 [myid:] - INFO  [main:FourLetterWordMain@85] - connecting
to 127.0.0.1 30319
    [junit] 2017-04-11 11:56:53,112 [myid:] - INFO  [main:JMXEnv@146] - ensureOnly:[]
    [junit] 2017-04-11 11:56:53,116 [myid:] - INFO  [main:ClientBase@583] - fdcount after
test is: 2547 at start it was 2547
    [junit] 2017-04-11 11:56:53,117 [myid:] - INFO  [main:ZKTestCase$1@68] - SUCCEEDED testWatcherAutoResetWithLocal
    [junit] 2017-04-11 11:56:53,117 [myid:] - INFO  [main:ZKTestCase$1@63] - FINISHED testWatcherAutoResetWithLocal
    [junit] Tests run: 103, Failures: 0, Errors: 0, Skipped: 0, Time elapsed: 496.778 sec,
Thread: 8, Class: org.apache.zookeeper.test.NioNettySuiteTest
    [junit] 2017-04-11 11:56:53,367 [myid:127.0.0.1:30196] - INFO  [main-SendThread(127.0.0.1:30196):ClientCnxn$SendThread@1113]
- Opening socket connection to server 127.0.0.1/127.0.0.1:30196. Will not attempt to authenticate
using SASL (unknown error)
    [junit] 2017-04-11 11:56:53,367 [myid:127.0.0.1:30196] - WARN  [main-SendThread(127.0.0.1:30196):ClientCnxn$SendThread@1235]
- Session 0x102d64dc3630000 for server 127.0.0.1/127.0.0.1:30196, unexpected error, closing
socket connection and attempting reconnect
    [junit] java.net.ConnectException: Connection refused
    [junit] 	at sun.nio.ch.SocketChannelImpl.checkConnect(Native Method)
    [junit] 	at sun.nio.ch.SocketChannelImpl.finishConnect(SocketChannelImpl.java:717)
    [junit] 	at org.apache.zookeeper.ClientCnxnSocketNIO.doTransport(ClientCnxnSocketNIO.java:357)
    [junit] 	at org.apache.zookeeper.ClientCnxn$SendThread.run(ClientCnxn.java:1214)

fail.build.on.test.failure:

BUILD FAILED
/home/jenkins/jenkins-slave/workspace/ZooKeeper-trunk-jdk8/build.xml:1219: The following error
occurred while executing this line:
/home/jenkins/jenkins-slave/workspace/ZooKeeper-trunk-jdk8/build.xml:1223: Tests failed!

Total time: 12 minutes 46 seconds
Build step 'Invoke Ant' marked build as failure
[WARNINGS] Skipping publisher since build result is FAILURE
Recording test results
Email was triggered for: Failure - Any
Sending email for trigger: Failure - Any



###################################################################################
############################## FAILED TESTS (if any) ##############################
3 tests failed.
FAILED:  org.apache.zookeeper.server.quorum.CommitProcessorConcurrencyTest.noStarvationOfNonLocalCommittedRequestsTest

Error Message:
test timed out after 1000 milliseconds

Stack Trace:
org.junit.runners.model.TestTimedOutException: test timed out after 1000 milliseconds
	at org.apache.zookeeper.server.quorum.CommitProcessor.needCommit(CommitProcessor.java:133)
	at org.apache.zookeeper.server.quorum.CommitProcessor.run(CommitProcessor.java:199)
	at org.apache.zookeeper.server.quorum.CommitProcessorConcurrencyTest.noStarvationOfNonLocalCommittedRequestsTest(CommitProcessorConcurrencyTest.java:297)
	at org.apache.zookeeper.JUnit4ZKTestRunner$LoggedInvokeMethod.evaluate(JUnit4ZKTestRunner.java:79)
	at java.util.concurrent.FutureTask.run(FutureTask.java:266)
	at java.lang.Thread.run(Thread.java:745)


FAILED:  org.apache.zookeeper.test.ReadOnlyModeTest.testSessionEstablishment

Error Message:
KeeperErrorCode = ConnectionLoss for /test

Stack Trace:
org.apache.zookeeper.KeeperException$ConnectionLossException: KeeperErrorCode = ConnectionLoss
for /test
	at org.apache.zookeeper.KeeperException.create(KeeperException.java:99)
	at org.apache.zookeeper.KeeperException.create(KeeperException.java:51)
	at org.apache.zookeeper.ZooKeeper.create(ZooKeeper.java:1424)
	at org.apache.zookeeper.test.ReadOnlyModeTest.testSessionEstablishment(ReadOnlyModeTest.java:238)
	at org.apache.zookeeper.JUnit4ZKTestRunner$LoggedInvokeMethod.evaluate(JUnit4ZKTestRunner.java:79)
	at java.util.concurrent.FutureTask.run(FutureTask.java:266)
	at java.lang.Thread.run(Thread.java:745)


FAILED:  org.apache.zookeeper.test.SSLTest.testSecureQuorumServer

Error Message:
waiting for server 0 being up

Stack Trace:
junit.framework.AssertionFailedError: waiting for server 0 being up
	at org.apache.zookeeper.test.SSLTest.testSecureQuorumServer(SSLTest.java:96)
	at org.apache.zookeeper.JUnit4ZKTestRunner$LoggedInvokeMethod.evaluate(JUnit4ZKTestRunner.java:79)



Mime
  • Unnamed multipart/mixed (inline, None, 0 bytes)
View raw message