zookeeper-dev mailing list archives

Site index · List index
Message view « Date » · « Thread »
Top « Date » · « Thread »
From Apache Jenkins Server <jenk...@builds.apache.org>
Subject Failed: ZOOKEEPER- PreCommit Build #624
Date Tue, 25 Apr 2017 16:07:22 GMT
Build: https://builds.apache.org/job/PreCommit-ZOOKEEPER-github-pr-build/624/

###################################################################################
########################## LAST 60 LINES OF THE CONSOLE ###########################
[...truncated 206.66 MB...]
     [exec]     +1 tests included.  The patch appears to include 3 new or modified tests.
     [exec] 
     [exec]     -1 javadoc.  The javadoc tool appears to have generated 1 warning messages.
     [exec] 
     [exec]     +1 javac.  The applied patch does not increase the total number of javac compiler warnings.
     [exec] 
     [exec]     -1 findbugs.  The patch appears to introduce 103 new Findbugs (version 3.0.1) warnings.
     [exec] 
     [exec]     +1 release audit.  The applied patch does not increase the total number of release audit warnings.
     [exec] 
     [exec]     -1 core tests.  The patch failed core unit tests.
     [exec] 
     [exec]     +1 contrib tests.  The patch passed contrib unit tests.
     [exec] 
     [exec] Test results: https://builds.apache.org/job/PreCommit-ZOOKEEPER-github-pr-build/624//testReport/
     [exec] Findbugs warnings: https://builds.apache.org/job/PreCommit-ZOOKEEPER-github-pr-build/624//artifact/trunk/build/test/findbugs/newPatchFindbugsWarnings.html
     [exec] Console output: https://builds.apache.org/job/PreCommit-ZOOKEEPER-github-pr-build/624//console
     [exec] 
     [exec] This message is automatically generated.
     [exec] 
     [exec] 
     [exec] ======================================================================
     [exec] ======================================================================
     [exec]     Adding comment to Jira.
     [exec] ======================================================================
     [exec] ======================================================================
     [exec] 
     [exec] 
     [exec] Comment added.
     [exec] 0d8a0a03a2c319d4fc8f264629a9d550c72b09c0 logged out
     [exec] 
     [exec] 
     [exec] ======================================================================
     [exec] ======================================================================
     [exec]     Finished build.
     [exec] ======================================================================
     [exec] ======================================================================
     [exec] 
     [exec] 
     [exec] mv: '/home/jenkins/jenkins-slave/workspace/PreCommit-ZOOKEEPER-github-pr-build/patchprocess' and '/home/jenkins/jenkins-slave/workspace/PreCommit-ZOOKEEPER-github-pr-build/patchprocess' are the same file

BUILD FAILED
/home/jenkins/jenkins-slave/workspace/PreCommit-ZOOKEEPER-github-pr-build/build.xml:1703: exec returned: 3

Total time: 81 minutes 27 seconds
Build step 'Execute shell' marked build as failure
Archiving artifacts
Setting JDK_1_7_LATEST__HOME=/home/jenkins/tools/java/latest1.7
Recording test results
Setting JDK_1_7_LATEST__HOME=/home/jenkins/tools/java/latest1.7
Setting JDK_1_7_LATEST__HOME=/home/jenkins/tools/java/latest1.7
[description-setter] Description set: ZOOKEEPER-2731
Putting comment on the pull request
Setting JDK_1_7_LATEST__HOME=/home/jenkins/tools/java/latest1.7
Email was triggered for: Failure - Any
Sending email for trigger: Failure - Any
Setting JDK_1_7_LATEST__HOME=/home/jenkins/tools/java/latest1.7
Setting JDK_1_7_LATEST__HOME=/home/jenkins/tools/java/latest1.7
Setting JDK_1_7_LATEST__HOME=/home/jenkins/tools/java/latest1.7



###################################################################################
############################## FAILED TESTS (if any) ##############################
166 tests failed.
FAILED:  org.apache.zookeeper.test.FLETest.testJoin

Error Message:
Peer 2 failed to join the cluster within 10000 ms

Stack Trace:
junit.framework.AssertionFailedError: Peer 2 failed to join the cluster within 10000 ms
	at org.apache.zookeeper.test.FLETest.testJoin(FLETest.java:398)
	at org.apache.zookeeper.JUnit4ZKTestRunner$LoggedInvokeMethod.evaluate(JUnit4ZKTestRunner.java:55)


FAILED:  org.apache.zookeeper.test.ChrootClientTest.testPing

Error Message:
null

Stack Trace:
java.lang.NullPointerException
	at org.apache.zookeeper.proto.CreateRequest.setData(CreateRequest.java:50)
	at org.apache.zookeeper.ZooKeeper.create(ZooKeeper.java:774)
	at org.apache.zookeeper.test.ChrootClientTest.setUp(ChrootClientTest.java:43)


FAILED:  org.apache.zookeeper.test.ChrootClientTest.testClientwithoutWatcherObj

Error Message:
null

Stack Trace:
java.lang.NullPointerException
	at org.apache.zookeeper.proto.CreateRequest.setData(CreateRequest.java:50)
	at org.apache.zookeeper.ZooKeeper.create(ZooKeeper.java:774)
	at org.apache.zookeeper.test.ChrootClientTest.setUp(ChrootClientTest.java:43)


FAILED:  org.apache.zookeeper.test.ChrootClientTest.testClientWithWatcherObj

Error Message:
null

Stack Trace:
java.lang.NullPointerException
	at org.apache.zookeeper.proto.CreateRequest.setData(CreateRequest.java:50)
	at org.apache.zookeeper.ZooKeeper.create(ZooKeeper.java:774)
	at org.apache.zookeeper.test.ChrootClientTest.setUp(ChrootClientTest.java:43)


FAILED:  org.apache.zookeeper.test.ChrootClientTest.testClientWithIPv6Address

Error Message:
null

Stack Trace:
java.lang.NullPointerException
	at org.apache.zookeeper.proto.CreateRequest.setData(CreateRequest.java:50)
	at org.apache.zookeeper.ZooKeeper.create(ZooKeeper.java:774)
	at org.apache.zookeeper.test.ChrootClientTest.setUp(ChrootClientTest.java:43)


FAILED:  org.apache.zookeeper.test.ChrootClientTest.testTestability

Error Message:
null

Stack Trace:
java.lang.NullPointerException
	at org.apache.zookeeper.proto.CreateRequest.setData(CreateRequest.java:50)
	at org.apache.zookeeper.ZooKeeper.create(ZooKeeper.java:774)
	at org.apache.zookeeper.test.ChrootClientTest.setUp(ChrootClientTest.java:43)


FAILED:  org.apache.zookeeper.test.ChrootClientTest.testACLs

Error Message:
null

Stack Trace:
java.lang.NullPointerException
	at org.apache.zookeeper.proto.CreateRequest.setData(CreateRequest.java:50)
	at org.apache.zookeeper.ZooKeeper.create(ZooKeeper.java:774)
	at org.apache.zookeeper.test.ChrootClientTest.setUp(ChrootClientTest.java:43)


FAILED:  org.apache.zookeeper.test.ChrootClientTest.testMutipleWatcherObjs

Error Message:
null

Stack Trace:
java.lang.NullPointerException
	at org.apache.zookeeper.proto.CreateRequest.setData(CreateRequest.java:50)
	at org.apache.zookeeper.ZooKeeper.create(ZooKeeper.java:774)
	at org.apache.zookeeper.test.ChrootClientTest.setUp(ChrootClientTest.java:43)


FAILED:  org.apache.zookeeper.test.ChrootClientTest.testSequentialNodeNames

Error Message:
null

Stack Trace:
java.lang.NullPointerException
	at org.apache.zookeeper.proto.CreateRequest.setData(CreateRequest.java:50)
	at org.apache.zookeeper.ZooKeeper.create(ZooKeeper.java:774)
	at org.apache.zookeeper.test.ChrootClientTest.setUp(ChrootClientTest.java:43)


FAILED:  org.apache.zookeeper.test.ChrootClientTest.testSequentialNodeData

Error Message:
null

Stack Trace:
java.lang.NullPointerException
	at org.apache.zookeeper.proto.CreateRequest.setData(CreateRequest.java:50)
	at org.apache.zookeeper.ZooKeeper.create(ZooKeeper.java:774)
	at org.apache.zookeeper.test.ChrootClientTest.setUp(ChrootClientTest.java:43)


FAILED:  org.apache.zookeeper.test.ChrootClientTest.testLargeNodeData

Error Message:
null

Stack Trace:
java.lang.NullPointerException
	at org.apache.zookeeper.proto.CreateRequest.setData(CreateRequest.java:50)
	at org.apache.zookeeper.ZooKeeper.create(ZooKeeper.java:774)
	at org.apache.zookeeper.test.ChrootClientTest.setUp(ChrootClientTest.java:43)


FAILED:  org.apache.zookeeper.test.ChrootClientTest.testDeleteWithChildren

Error Message:
null

Stack Trace:
java.lang.NullPointerException
	at org.apache.zookeeper.proto.CreateRequest.setData(CreateRequest.java:50)
	at org.apache.zookeeper.ZooKeeper.create(ZooKeeper.java:774)
	at org.apache.zookeeper.test.ChrootClientTest.setUp(ChrootClientTest.java:43)


FAILED:  org.apache.zookeeper.test.ChrootClientTest.testClientCleanup

Error Message:
null

Stack Trace:
java.lang.NullPointerException
	at org.apache.zookeeper.proto.CreateRequest.setData(CreateRequest.java:50)
	at org.apache.zookeeper.ZooKeeper.create(ZooKeeper.java:774)
	at org.apache.zookeeper.test.ChrootClientTest.setUp(ChrootClientTest.java:43)


FAILED:  org.apache.zookeeper.test.ChrootClientTest.testNonExistingOpCode

Error Message:
null

Stack Trace:
java.lang.NullPointerException
	at org.apache.zookeeper.proto.CreateRequest.setData(CreateRequest.java:50)
	at org.apache.zookeeper.ZooKeeper.create(ZooKeeper.java:774)
	at org.apache.zookeeper.test.ChrootClientTest.setUp(ChrootClientTest.java:43)


FAILED:  org.apache.zookeeper.server.DataTreeTest.testPathTrieClearOnDeserialize

Error Message:
null

Stack Trace:
java.lang.NullPointerException
	at org.apache.zookeeper.server.DataNode.<init>(DataNode.java:86)
	at org.apache.zookeeper.server.DataTree.createNode(DataTree.java:399)
	at org.apache.zookeeper.server.DataTreeTest.testPathTrieClearOnDeserialize(DataTreeTest.java:161)
	at org.apache.zookeeper.JUnit4ZKTestRunner$LoggedInvokeMethod.evaluate(JUnit4ZKTestRunner.java:55)


FAILED:  org.apache.zookeeper.server.ToStringTest.testJuteToString

Error Message:
null

Stack Trace:
java.lang.NullPointerException
	at org.apache.zookeeper.proto.SetDataRequest.<init>(SetDataRequest.java:34)
	at org.apache.zookeeper.server.ToStringTest.testJuteToString(ToStringTest.java:35)
	at org.apache.zookeeper.JUnit4ZKTestRunner$LoggedInvokeMethod.evaluate(JUnit4ZKTestRunner.java:55)


FAILED:  org.apache.zookeeper.server.ZxidRolloverTest.testSimpleRolloverFollower

Error Message:
waiting for server up

Stack Trace:
java.lang.AssertionError: waiting for server up
	at org.apache.zookeeper.test.QuorumUtil.startAll(QuorumUtil.java:137)
	at org.apache.zookeeper.server.ZxidRolloverTest.startAll(ZxidRolloverTest.java:149)
	at org.apache.zookeeper.server.ZxidRolloverTest.setUp(ZxidRolloverTest.java:64)


FAILED:  org.apache.zookeeper.server.ZxidRolloverTest.testRolloverThenRestart

Error Message:
waiting for server up

Stack Trace:
java.lang.AssertionError: waiting for server up
	at org.apache.zookeeper.test.QuorumUtil.startAll(QuorumUtil.java:137)
	at org.apache.zookeeper.server.ZxidRolloverTest.startAll(ZxidRolloverTest.java:149)
	at org.apache.zookeeper.server.ZxidRolloverTest.setUp(ZxidRolloverTest.java:64)


FAILED:  org.apache.zookeeper.server.ZxidRolloverTest.testRolloverThenFollowerRestart

Error Message:
waiting for server up

Stack Trace:
java.lang.AssertionError: waiting for server up
	at org.apache.zookeeper.test.QuorumUtil.startAll(QuorumUtil.java:137)
	at org.apache.zookeeper.server.ZxidRolloverTest.startAll(ZxidRolloverTest.java:149)
	at org.apache.zookeeper.server.ZxidRolloverTest.setUp(ZxidRolloverTest.java:64)


FAILED:  org.apache.zookeeper.server.ZxidRolloverTest.testRolloverThenLeaderRestart

Error Message:
waiting for server up

Stack Trace:
java.lang.AssertionError: waiting for server up
	at org.apache.zookeeper.test.QuorumUtil.startAll(QuorumUtil.java:137)
	at org.apache.zookeeper.server.ZxidRolloverTest.startAll(ZxidRolloverTest.java:149)
	at org.apache.zookeeper.server.ZxidRolloverTest.setUp(ZxidRolloverTest.java:64)


FAILED:  org.apache.zookeeper.server.ZxidRolloverTest.testMultipleRollover

Error Message:
waiting for server up

Stack Trace:
java.lang.AssertionError: waiting for server up
	at org.apache.zookeeper.test.QuorumUtil.startAll(QuorumUtil.java:137)
	at org.apache.zookeeper.server.ZxidRolloverTest.startAll(ZxidRolloverTest.java:149)
	at org.apache.zookeeper.server.ZxidRolloverTest.setUp(ZxidRolloverTest.java:64)


FAILED:  org.apache.zookeeper.server.quorum.LearnerTest.syncTest

Error Message:
null

Stack Trace:
java.lang.NullPointerException
	at org.apache.zookeeper.server.quorum.QuorumPacket.<init>(QuorumPacket.java:37)
	at org.apache.zookeeper.server.quorum.LearnerTest.syncTest(LearnerTest.java:107)
	at org.apache.zookeeper.JUnit4ZKTestRunner$LoggedInvokeMethod.evaluate(JUnit4ZKTestRunner.java:55)


FAILED:  org.apache.zookeeper.server.quorum.QuorumCnxManagerTest.testSaslQuorumAuthServerWithInvalidQuorumAuthPacket

Error Message:
null

Stack Trace:
java.lang.NullPointerException
	at org.apache.zookeeper.server.quorum.QuorumAuthPacket.<init>(QuorumAuthPacket.java:35)
	at org.apache.zookeeper.server.quorum.auth.QuorumAuth.createPacket(QuorumAuth.java:83)
	at org.apache.zookeeper.server.quorum.QuorumCnxManagerTest.testSaslQuorumAuthServerWithInvalidQuorumAuthPacket(QuorumCnxManagerTest.java:624)
	at org.apache.zookeeper.JUnit4ZKTestRunner$LoggedInvokeMethod.evaluate(JUnit4ZKTestRunner.java:55)


FAILED:  org.apache.zookeeper.server.quorum.QuorumCnxManagerTest.testNullQuorumAuthServerWithValidQuorumAuthPacket

Error Message:
null

Stack Trace:
java.lang.NullPointerException
	at org.apache.zookeeper.server.quorum.QuorumAuthPacket.<init>(QuorumAuthPacket.java:35)
	at org.apache.zookeeper.server.quorum.auth.QuorumAuth.createPacket(QuorumAuth.java:83)
	at org.apache.zookeeper.server.quorum.QuorumCnxManagerTest.testNullQuorumAuthServerWithValidQuorumAuthPacket(QuorumCnxManagerTest.java:669)
	at org.apache.zookeeper.JUnit4ZKTestRunner$LoggedInvokeMethod.evaluate(JUnit4ZKTestRunner.java:55)


FAILED:  org.apache.zookeeper.server.quorum.QuorumPeerMainTest.testUpdatingEpoch

Error Message:
Waiting too long

Stack Trace:
java.lang.RuntimeException: Waiting too long
	at org.apache.zookeeper.server.quorum.QuorumPeerMainTest.waitForAll(QuorumPeerMainTest.java:348)
	at org.apache.zookeeper.server.quorum.QuorumPeerMainTest.LaunchServers(QuorumPeerMainTest.java:394)
	at org.apache.zookeeper.server.quorum.QuorumPeerMainTest.testUpdatingEpoch(QuorumPeerMainTest.java:862)
	at org.apache.zookeeper.JUnit4ZKTestRunner$LoggedInvokeMethod.evaluate(JUnit4ZKTestRunner.java:55)


FAILED:  org.apache.zookeeper.server.quorum.QuorumPeerMainTest.testNewFollowerRestartAfterNewEpoch

Error Message:
Waiting too long

Stack Trace:
java.lang.RuntimeException: Waiting too long
	at org.apache.zookeeper.server.quorum.QuorumPeerMainTest.waitForAll(QuorumPeerMainTest.java:348)
	at org.apache.zookeeper.server.quorum.QuorumPeerMainTest.LaunchServers(QuorumPeerMainTest.java:394)
	at org.apache.zookeeper.server.quorum.QuorumPeerMainTest.testNewFollowerRestartAfterNewEpoch(QuorumPeerMainTest.java:932)
	at org.apache.zookeeper.JUnit4ZKTestRunner$LoggedInvokeMethod.evaluate(JUnit4ZKTestRunner.java:55)


FAILED:  org.apache.zookeeper.server.quorum.QuorumPeerMainTest.testHighestZxidJoinLate

Error Message:
Waiting too long

Stack Trace:
java.lang.RuntimeException: Waiting too long
	at org.apache.zookeeper.server.quorum.QuorumPeerMainTest.waitForAll(QuorumPeerMainTest.java:348)
	at org.apache.zookeeper.server.quorum.QuorumPeerMainTest.LaunchServers(QuorumPeerMainTest.java:394)
	at org.apache.zookeeper.server.quorum.QuorumPeerMainTest.testHighestZxidJoinLate(QuorumPeerMainTest.java:246)
	at org.apache.zookeeper.JUnit4ZKTestRunner$LoggedInvokeMethod.evaluate(JUnit4ZKTestRunner.java:55)


FAILED:  org.apache.zookeeper.server.quorum.QuorumPeerMainTest.testValidIpv6AddressInQuorum

Error Message:
waiting for server 1 being up

Stack Trace:
junit.framework.AssertionFailedError: waiting for server 1 being up
	at org.apache.zookeeper.server.quorum.QuorumPeerMainTest.testValidIpv6AddressInQuorum(QuorumPeerMainTest.java:493)
	at org.apache.zookeeper.JUnit4ZKTestRunner$LoggedInvokeMethod.evaluate(JUnit4ZKTestRunner.java:55)


FAILED:  org.apache.zookeeper.server.quorum.QuorumPeerMainTest.testInconsistentPeerType

Error Message:
waiting for server 1 being up

Stack Trace:
junit.framework.AssertionFailedError: waiting for server 1 being up
	at org.apache.zookeeper.server.quorum.QuorumPeerMainTest.testInconsistentPeerType(QuorumPeerMainTest.java:628)
	at org.apache.zookeeper.JUnit4ZKTestRunner$LoggedInvokeMethod.evaluate(JUnit4ZKTestRunner.java:55)


FAILED:  org.apache.zookeeper.server.quorum.QuorumPeerMainTest.testBadPackets

Error Message:
waiting for server 1 being up

Stack Trace:
junit.framework.AssertionFailedError: waiting for server 1 being up
	at org.apache.zookeeper.server.quorum.QuorumPeerMainTest.testBadPackets(QuorumPeerMainTest.java:701)
	at org.apache.zookeeper.JUnit4ZKTestRunner$LoggedInvokeMethod.evaluate(JUnit4ZKTestRunner.java:55)


FAILED:  org.apache.zookeeper.server.quorum.QuorumPeerMainTest.testQuorumDefaults

Error Message:
waiting for server 1 being up

Stack Trace:
junit.framework.AssertionFailedError: waiting for server 1 being up
	at org.apache.zookeeper.server.quorum.QuorumPeerMainTest.testQuorumDefaults(QuorumPeerMainTest.java:766)
	at org.apache.zookeeper.JUnit4ZKTestRunner$LoggedInvokeMethod.evaluate(JUnit4ZKTestRunner.java:55)


FAILED:  org.apache.zookeeper.server.quorum.QuorumPeerMainTest.testEarlyLeaderAbandonment

Error Message:
Waiting too long

Stack Trace:
java.lang.RuntimeException: Waiting too long
	at org.apache.zookeeper.server.quorum.QuorumPeerMainTest.waitForAll(QuorumPeerMainTest.java:348)
	at org.apache.zookeeper.server.quorum.QuorumPeerMainTest.testEarlyLeaderAbandonment(QuorumPeerMainTest.java:163)
	at org.apache.zookeeper.JUnit4ZKTestRunner$LoggedInvokeMethod.evaluate(JUnit4ZKTestRunner.java:55)


FAILED:  org.apache.zookeeper.server.quorum.QuorumPeerMainTest.testQuorum

Error Message:
waiting for server 1 being up

Stack Trace:
junit.framework.AssertionFailedError: waiting for server 1 being up
	at org.apache.zookeeper.server.quorum.QuorumPeerMainTest.testQuorum(QuorumPeerMainTest.java:104)
	at org.apache.zookeeper.JUnit4ZKTestRunner$LoggedInvokeMethod.evaluate(JUnit4ZKTestRunner.java:55)


FAILED:  org.apache.zookeeper.server.quorum.Zab1_0Test.testUnnecessarySnap

Error Message:
null

Stack Trace:
java.io.EOFException
	at java.io.DataInputStream.readInt(DataInputStream.java:392)
	at org.apache.jute.BinaryInputArchive.readInt(BinaryInputArchive.java:63)
	at org.apache.zookeeper.server.quorum.QuorumPacket.deserialize(QuorumPacket.java:83)
	at org.apache.jute.BinaryInputArchive.readRecord(BinaryInputArchive.java:99)
	at org.apache.zookeeper.server.quorum.Zab1_0Test.readPacketSkippingPing(Zab1_0Test.java:331)
	at org.apache.zookeeper.server.quorum.Zab1_0Test$3.converseWithLeader(Zab1_0Test.java:609)
	at org.apache.zookeeper.server.quorum.Zab1_0Test.testPopulatedLeaderConversation(Zab1_0Test.java:456)
	at org.apache.zookeeper.server.quorum.Zab1_0Test.testUnnecessarySnap(Zab1_0Test.java:578)


FAILED:  org.apache.zookeeper.server.quorum.Zab1_0Test.testNormalFollowerRun

Error Message:
Connection reset

Stack Trace:
java.net.SocketException: Connection reset
	at java.net.SocketOutputStream.socketWrite(SocketOutputStream.java:118)
	at java.net.SocketOutputStream.write(SocketOutputStream.java:138)
	at java.io.DataOutputStream.writeInt(DataOutputStream.java:197)
	at org.apache.jute.BinaryOutputArchive.writeInt(BinaryOutputArchive.java:55)
	at org.apache.jute.BinaryOutputArchive.writeString(BinaryOutputArchive.java:108)
	at org.apache.zookeeper.server.DataTree.serializeNode(DataTree.java:1040)
	at org.apache.zookeeper.server.DataTree.serializeNode(DataTree.java:1050)
	at org.apache.zookeeper.server.DataTree.serialize(DataTree.java:1061)
	at org.apache.zookeeper.server.util.SerializeUtils.serializeSnapshot(SerializeUtils.java:138)
	at org.apache.zookeeper.server.ZKDatabase.serializeSnapshot(ZKDatabase.java:461)
	at org.apache.zookeeper.server.quorum.Zab1_0Test$4.converseWithFollower(Zab1_0Test.java:693)
	at org.apache.zookeeper.server.quorum.Zab1_0Test.testFollowerConversation(Zab1_0Test.java:507)
	at org.apache.zookeeper.server.quorum.Zab1_0Test.testNormalFollowerRun(Zab1_0Test.java:642)


FAILED:  org.apache.zookeeper.server.quorum.Zab1_0Test.testNormalFollowerRunWithDiff

Error Message:
Connection reset

Stack Trace:
java.net.SocketException: Connection reset
	at java.net.SocketOutputStream.socketWrite(SocketOutputStream.java:118)
	at java.net.SocketOutputStream.write(SocketOutputStream.java:138)
	at java.io.DataOutputStream.writeInt(DataOutputStream.java:197)
	at org.apache.jute.BinaryOutputArchive.writeInt(BinaryOutputArchive.java:55)
	at org.apache.zookeeper.server.quorum.QuorumPacket.serialize(QuorumPacket.java:66)
	at org.apache.jute.BinaryOutputArchive.writeRecord(BinaryOutputArchive.java:123)
	at org.apache.zookeeper.server.quorum.Zab1_0Test$5.converseWithFollower(Zab1_0Test.java:830)
	at org.apache.zookeeper.server.quorum.Zab1_0Test.testFollowerConversation(Zab1_0Test.java:507)
	at org.apache.zookeeper.server.quorum.Zab1_0Test.testNormalFollowerRunWithDiff(Zab1_0Test.java:777)


FAILED:  org.apache.zookeeper.server.quorum.Zab1_0Test.testNormalRun

Error Message:
null

Stack Trace:
java.io.EOFException
	at java.io.DataInputStream.readInt(DataInputStream.java:392)
	at org.apache.jute.BinaryInputArchive.readInt(BinaryInputArchive.java:63)
	at org.apache.zookeeper.server.quorum.QuorumPacket.deserialize(QuorumPacket.java:83)
	at org.apache.jute.BinaryInputArchive.readRecord(BinaryInputArchive.java:99)
	at org.apache.zookeeper.server.quorum.Zab1_0Test.readPacketSkippingPing(Zab1_0Test.java:331)
	at org.apache.zookeeper.server.quorum.Zab1_0Test$6.converseWithLeader(Zab1_0Test.java:924)
	at org.apache.zookeeper.server.quorum.Zab1_0Test.testLeaderConversation(Zab1_0Test.java:385)
	at org.apache.zookeeper.server.quorum.Zab1_0Test.testNormalRun(Zab1_0Test.java:898)


FAILED:  org.apache.zookeeper.server.quorum.Zab1_0Test.testTxnTimeout

Error Message:
null

Stack Trace:
java.io.EOFException
	at java.io.DataInputStream.readInt(DataInputStream.java:392)
	at org.apache.jute.BinaryInputArchive.readInt(BinaryInputArchive.java:63)
	at org.apache.zookeeper.server.quorum.QuorumPacket.deserialize(QuorumPacket.java:83)
	at org.apache.jute.BinaryInputArchive.readRecord(BinaryInputArchive.java:99)
	at org.apache.zookeeper.server.quorum.Zab1_0Test.readPacketSkippingPing(Zab1_0Test.java:331)
	at org.apache.zookeeper.server.quorum.Zab1_0Test$7.converseWithLeader(Zab1_0Test.java:969)
	at org.apache.zookeeper.server.quorum.Zab1_0Test.testLeaderConversation(Zab1_0Test.java:385)
	at org.apache.zookeeper.server.quorum.Zab1_0Test.testTxnTimeout(Zab1_0Test.java:944)


FAILED:  org.apache.zookeeper.server.quorum.Zab1_0Test.testNormalObserverRun

Error Message:
Connection reset

Stack Trace:
java.net.SocketException: Connection reset
	at java.net.SocketOutputStream.socketWrite(SocketOutputStream.java:118)
	at java.net.SocketOutputStream.write(SocketOutputStream.java:138)
	at java.io.DataOutputStream.writeInt(DataOutputStream.java:197)
	at org.apache.jute.BinaryOutputArchive.writeInt(BinaryOutputArchive.java:55)
	at org.apache.jute.BinaryOutputArchive.writeString(BinaryOutputArchive.java:108)
	at org.apache.zookeeper.server.DataTree.serializeNode(DataTree.java:1040)
	at org.apache.zookeeper.server.DataTree.serializeNode(DataTree.java:1050)
	at org.apache.zookeeper.server.DataTree.serialize(DataTree.java:1061)
	at org.apache.zookeeper.server.util.SerializeUtils.serializeSnapshot(SerializeUtils.java:138)
	at org.apache.zookeeper.server.ZKDatabase.serializeSnapshot(ZKDatabase.java:461)
	at org.apache.zookeeper.server.quorum.Zab1_0Test$8.converseWithObserver(Zab1_0Test.java:1094)
	at org.apache.zookeeper.server.quorum.Zab1_0Test.testObserverConversation(Zab1_0Test.java:560)
	at org.apache.zookeeper.server.quorum.Zab1_0Test.testNormalObserverRun(Zab1_0Test.java:1032)


FAILED:  org.apache.zookeeper.server.quorum.Zab1_0Test.testLeaderBehind

Error Message:
null

Stack Trace:
java.io.EOFException
	at java.io.DataInputStream.readInt(DataInputStream.java:392)
	at org.apache.jute.BinaryInputArchive.readInt(BinaryInputArchive.java:63)
	at org.apache.zookeeper.server.quorum.QuorumPacket.deserialize(QuorumPacket.java:83)
	at org.apache.jute.BinaryInputArchive.readRecord(BinaryInputArchive.java:99)
	at org.apache.zookeeper.server.quorum.Zab1_0Test.readPacketSkippingPing(Zab1_0Test.java:331)
	at org.apache.zookeeper.server.quorum.Zab1_0Test$9.converseWithLeader(Zab1_0Test.java:1206)
	at org.apache.zookeeper.server.quorum.Zab1_0Test.testLeaderConversation(Zab1_0Test.java:385)
	at org.apache.zookeeper.server.quorum.Zab1_0Test.testLeaderBehind(Zab1_0Test.java:1187)


FAILED:  org.apache.zookeeper.server.quorum.auth.QuorumAuthUpgradeTest.testNullAuthLearnerServer

Error Message:
test timed out after 30000 milliseconds

Stack Trace:
java.lang.Exception: test timed out after 30000 milliseconds
	at java.lang.Thread.sleep(Native Method)
	at org.apache.zookeeper.test.ClientBase.waitForServerUp(ClientBase.java:276)
	at org.apache.zookeeper.server.quorum.auth.QuorumAuthTestBase.startQuorum(QuorumAuthTestBase.java:75)
	at org.apache.zookeeper.server.quorum.auth.QuorumAuthUpgradeTest.testNullAuthLearnerServer(QuorumAuthUpgradeTest.java:86)
	at org.apache.zookeeper.JUnit4ZKTestRunner$LoggedInvokeMethod.evaluate(JUnit4ZKTestRunner.java:55)


FAILED:  org.apache.zookeeper.server.quorum.auth.QuorumAuthUpgradeTest.testAuthLearnerAgainstNullAuthServer

Error Message:
test timed out after 30000 milliseconds

Stack Trace:
java.lang.Exception: test timed out after 30000 milliseconds
	at java.lang.Thread.sleep(Native Method)
	at org.apache.zookeeper.test.ClientBase.waitForServerUp(ClientBase.java:276)
	at org.apache.zookeeper.server.quorum.auth.QuorumAuthTestBase.startQuorum(QuorumAuthTestBase.java:75)
	at org.apache.zookeeper.server.quorum.auth.QuorumAuthUpgradeTest.testAuthLearnerAgainstNullAuthServer(QuorumAuthUpgradeTest.java:106)
	at org.apache.zookeeper.JUnit4ZKTestRunner$LoggedInvokeMethod.evaluate(JUnit4ZKTestRunner.java:55)


FAILED:  org.apache.zookeeper.server.quorum.auth.QuorumAuthUpgradeTest.testAuthLearnerAgainstNoAuthRequiredServer

Error Message:
test timed out after 30000 milliseconds

Stack Trace:
java.lang.Exception: test timed out after 30000 milliseconds
	at java.lang.Thread.sleep(Native Method)
	at org.apache.zookeeper.test.ClientBase.waitForServerUp(ClientBase.java:276)
	at org.apache.zookeeper.server.quorum.auth.QuorumAuthTestBase.startQuorum(QuorumAuthTestBase.java:75)
	at org.apache.zookeeper.server.quorum.auth.QuorumAuthUpgradeTest.testAuthLearnerAgainstNoAuthRequiredServer(QuorumAuthUpgradeTest.java:126)
	at org.apache.zookeeper.JUnit4ZKTestRunner$LoggedInvokeMethod.evaluate(JUnit4ZKTestRunner.java:55)


FAILED:  org.apache.zookeeper.server.quorum.auth.QuorumAuthUpgradeTest.testAuthLearnerServer

Error Message:
test timed out after 30000 milliseconds

Stack Trace:
java.lang.Exception: test timed out after 30000 milliseconds
	at java.lang.Thread.sleep(Native Method)
	at org.apache.zookeeper.test.ClientBase.waitForServerUp(ClientBase.java:276)
	at org.apache.zookeeper.server.quorum.auth.QuorumAuthTestBase.startQuorum(QuorumAuthTestBase.java:75)
	at org.apache.zookeeper.server.quorum.auth.QuorumAuthUpgradeTest.testAuthLearnerServer(QuorumAuthUpgradeTest.java:148)
	at org.apache.zookeeper.JUnit4ZKTestRunner$LoggedInvokeMethod.evaluate(JUnit4ZKTestRunner.java:55)


FAILED:  org.apache.zookeeper.server.quorum.auth.QuorumAuthUpgradeTest.testRollingUpgrade

Error Message:
waiting for server 0 being up

Stack Trace:
junit.framework.AssertionFailedError: waiting for server 0 being up
	at org.apache.zookeeper.server.quorum.auth.QuorumAuthTestBase.startQuorum(QuorumAuthTestBase.java:75)
	at org.apache.zookeeper.server.quorum.auth.QuorumAuthUpgradeTest.testRollingUpgrade(QuorumAuthUpgradeTest.java:181)
	at org.apache.zookeeper.JUnit4ZKTestRunner$LoggedInvokeMethod.evaluate(JUnit4ZKTestRunner.java:55)


FAILED:  org.apache.zookeeper.server.quorum.auth.QuorumDigestAuthTest.testRelectionWithValidCredentials

Error Message:
test timed out after 30000 milliseconds

Stack Trace:
java.lang.Exception: test timed out after 30000 milliseconds
	at java.lang.Thread.sleep(Native Method)
	at org.apache.zookeeper.test.ClientBase.waitForServerUp(ClientBase.java:276)
	at org.apache.zookeeper.server.quorum.auth.QuorumAuthTestBase.startQuorum(QuorumAuthTestBase.java:75)
	at org.apache.zookeeper.server.quorum.auth.QuorumDigestAuthTest.testRelectionWithValidCredentials(QuorumDigestAuthTest.java:313)
	at org.apache.zookeeper.JUnit4ZKTestRunner$LoggedInvokeMethod.evaluate(JUnit4ZKTestRunner.java:55)


FAILED:  org.apache.zookeeper.server.quorum.auth.QuorumDigestAuthTest.testValidCredentials

Error Message:
test timed out after 30000 milliseconds

Stack Trace:
java.lang.Exception: test timed out after 30000 milliseconds
	at java.lang.Thread.sleep(Native Method)
	at org.apache.zookeeper.test.ClientBase.waitForServerUp(ClientBase.java:276)
	at org.apache.zookeeper.server.quorum.auth.QuorumAuthTestBase.startQuorum(QuorumAuthTestBase.java:75)
	at org.apache.zookeeper.server.quorum.auth.QuorumDigestAuthTest.testValidCredentials(QuorumDigestAuthTest.java:90)
	at org.apache.zookeeper.JUnit4ZKTestRunner$LoggedInvokeMethod.evaluate(JUnit4ZKTestRunner.java:55)


FAILED:  org.apache.zookeeper.server.quorum.auth.QuorumDigestAuthTest.testSaslNotRequiredWithInvalidCredentials

Error Message:
test timed out after 30000 milliseconds

Stack Trace:
java.lang.Exception: test timed out after 30000 milliseconds
	at java.lang.Thread.sleep(Native Method)
	at org.apache.zookeeper.test.ClientBase.waitForServerUp(ClientBase.java:276)
	at org.apache.zookeeper.server.quorum.auth.QuorumAuthTestBase.startQuorum(QuorumAuthTestBase.java:75)
	at org.apache.zookeeper.server.quorum.auth.QuorumDigestAuthTest.testSaslNotRequiredWithInvalidCredentials(QuorumDigestAuthTest.java:111)
	at org.apache.zookeeper.JUnit4ZKTestRunner$LoggedInvokeMethod.evaluate(JUnit4ZKTestRunner.java:55)


FAILED:  org.apache.zookeeper.server.quorum.auth.QuorumDigestAuthTest.testObserverWithValidCredentials

Error Message:
test timed out after 30000 milliseconds

Stack Trace:
java.lang.Exception: test timed out after 30000 milliseconds
	at java.lang.Thread.sleep(Native Method)
	at org.apache.zookeeper.test.ClientBase.waitForServerUp(ClientBase.java:276)
	at org.apache.zookeeper.server.quorum.auth.QuorumAuthTestBase.startQuorum(QuorumAuthTestBase.java:104)
	at org.apache.zookeeper.server.quorum.auth.QuorumDigestAuthTest.testObserverWithValidCredentials(QuorumDigestAuthTest.java:240)
	at org.apache.zookeeper.JUnit4ZKTestRunner$LoggedInvokeMethod.evaluate(JUnit4ZKTestRunner.java:55)


FAILED:  org.apache.zookeeper.server.quorum.auth.QuorumDigestAuthTest.testNonAuthEnabledObserverJoiningAuthEnabledQuorum

Error Message:
test timed out after 30000 milliseconds

Stack Trace:
java.lang.Exception: test timed out after 30000 milliseconds
	at java.lang.Thread.sleep(Native Method)
	at org.apache.zookeeper.test.ClientBase.waitForServerUp(ClientBase.java:276)
	at org.apache.zookeeper.server.quorum.auth.QuorumAuthTestBase.startQuorum(QuorumAuthTestBase.java:75)
	at org.apache.zookeeper.server.quorum.auth.QuorumDigestAuthTest.testNonAuthEnabledObserverJoiningAuthEnabledQuorum(QuorumDigestAuthTest.java:264)
	at org.apache.zookeeper.JUnit4ZKTestRunner$LoggedInvokeMethod.evaluate(JUnit4ZKTestRunner.java:55)


FAILED:  org.apache.zookeeper.server.quorum.auth.QuorumKerberosAuthTest.testValidCredentials

Error Message:
waiting for server 0 being up

Stack Trace:
junit.framework.AssertionFailedError: waiting for server 0 being up
	at org.apache.zookeeper.server.quorum.auth.QuorumAuthTestBase.startQuorum(QuorumAuthTestBase.java:75)
	at org.apache.zookeeper.server.quorum.auth.QuorumKerberosAuthTest.testValidCredentials(QuorumKerberosAuthTest.java:106)
	at org.apache.zookeeper.JUnit4ZKTestRunner$LoggedInvokeMethod.evaluate(JUnit4ZKTestRunner.java:55)


FAILED:  org.apache.zookeeper.server.quorum.auth.QuorumKerberosHostBasedAuthTest.testValidCredentials

Error Message:
waiting for server 0 being up

Stack Trace:
junit.framework.AssertionFailedError: waiting for server 0 being up
	at org.apache.zookeeper.server.quorum.auth.QuorumAuthTestBase.startQuorum(QuorumAuthTestBase.java:75)
	at org.apache.zookeeper.server.quorum.auth.QuorumKerberosHostBasedAuthTest.testValidCredentials(QuorumKerberosHostBasedAuthTest.java:133)
	at org.apache.zookeeper.JUnit4ZKTestRunner$LoggedInvokeMethod.evaluate(JUnit4ZKTestRunner.java:55)


FAILED:  org.apache.zookeeper.server.quorum.auth.QuorumKerberosHostBasedAuthTest.testConnectBadServer

Error Message:
waiting for server 0 being up

Stack Trace:
junit.framework.AssertionFailedError: waiting for server 0 being up
	at org.apache.zookeeper.server.quorum.auth.QuorumAuthTestBase.startQuorum(QuorumAuthTestBase.java:75)
	at org.apache.zookeeper.server.quorum.auth.QuorumKerberosHostBasedAuthTest.testConnectBadServer(QuorumKerberosHostBasedAuthTest.java:154)
	at org.apache.zookeeper.JUnit4ZKTestRunner$LoggedInvokeMethod.evaluate(JUnit4ZKTestRunner.java:55)


FAILED:  org.apache.zookeeper.test.ACLRootTest.testRootAcl

Error Message:
null

Stack Trace:
java.lang.NullPointerException
	at org.apache.zookeeper.proto.CreateRequest.setData(CreateRequest.java:50)
	at org.apache.zookeeper.ZooKeeper.create(ZooKeeper.java:774)
	at org.apache.zookeeper.test.ACLRootTest.testRootAcl(ACLRootTest.java:51)
	at org.apache.zookeeper.JUnit4ZKTestRunner$LoggedInvokeMethod.evaluate(JUnit4ZKTestRunner.java:55)


FAILED:  org.apache.zookeeper.test.AsyncHammerTest.testObserversHammer

Error Message:
waiting for server up

Stack Trace:
junit.framework.AssertionFailedError: waiting for server up
	at org.apache.zookeeper.test.QuorumBase.startServers(QuorumBase.java:183)
	at org.apache.zookeeper.test.QuorumBase.setUp(QuorumBase.java:101)
	at org.apache.zookeeper.test.AsyncHammerTest.setUp(AsyncHammerTest.java:52)
	at org.apache.zookeeper.test.AsyncHammerTest.testObserversHammer(AsyncHammerTest.java:203)
	at org.apache.zookeeper.JUnit4ZKTestRunner$LoggedInvokeMethod.evaluate(JUnit4ZKTestRunner.java:55)


FAILED:  org.apache.zookeeper.test.AsyncHammerTest.testHammer

Error Message:
waiting for server up

Stack Trace:
junit.framework.AssertionFailedError: waiting for server up
	at org.apache.zookeeper.test.QuorumBase.startServers(QuorumBase.java:183)
	at org.apache.zookeeper.test.QuorumBase.setUp(QuorumBase.java:101)
	at org.apache.zookeeper.test.AsyncHammerTest.setUp(AsyncHammerTest.java:52)
	at org.apache.zookeeper.test.AsyncHammerTest.testHammer(AsyncHammerTest.java:171)
	at org.apache.zookeeper.JUnit4ZKTestRunner$LoggedInvokeMethod.evaluate(JUnit4ZKTestRunner.java:55)


FAILED:  org.apache.zookeeper.test.AsyncTest.testAsync

Error Message:
waiting for server up

Stack Trace:
junit.framework.AssertionFailedError: waiting for server up
	at org.apache.zookeeper.test.QuorumBase.startServers(QuorumBase.java:183)
	at org.apache.zookeeper.test.QuorumBase.setUp(QuorumBase.java:101)
	at org.apache.zookeeper.test.QuorumBase.setUp(QuorumBase.java:65)
	at org.apache.zookeeper.test.AsyncTest.setUp(AsyncTest.java:57)


FAILED:  org.apache.zookeeper.test.AuthTest.testSuper

Error Message:
null

Stack Trace:
java.lang.NullPointerException
	at org.apache.zookeeper.proto.CreateRequest.setData(CreateRequest.java:50)
	at org.apache.zookeeper.ZooKeeper.create(ZooKeeper.java:774)
	at org.apache.zookeeper.test.AuthTest.testSuper(AuthTest.java:110)
	at org.apache.zookeeper.JUnit4ZKTestRunner$LoggedInvokeMethod.evaluate(JUnit4ZKTestRunner.java:55)


FAILED:  org.apache.zookeeper.test.AuthTest.testSuperACL

Error Message:
null

Stack Trace:
java.lang.NullPointerException
	at org.apache.zookeeper.proto.CreateRequest.setData(CreateRequest.java:50)
	at org.apache.zookeeper.ZooKeeper.create(ZooKeeper.java:774)
	at org.apache.zookeeper.test.AuthTest.testSuperACL(AuthTest.java:156)
	at org.apache.zookeeper.JUnit4ZKTestRunner$LoggedInvokeMethod.evaluate(JUnit4ZKTestRunner.java:55)


FAILED:  org.apache.zookeeper.test.ChrootAsyncTest.testAsyncCreate

Error Message:
null

Stack Trace:
java.lang.NullPointerException
	at org.apache.zookeeper.proto.CreateRequest.setData(CreateRequest.java:50)
	at org.apache.zookeeper.ZooKeeper.create(ZooKeeper.java:774)
	at org.apache.zookeeper.test.ChrootAsyncTest.setUp(ChrootAsyncTest.java:41)


FAILED:  org.apache.zookeeper.test.ChrootAsyncTest.testAsyncGetChildren2Single

Error Message:
null

Stack Trace:
java.lang.NullPointerException
	at org.apache.zookeeper.proto.CreateRequest.setData(CreateRequest.java:50)
	at org.apache.zookeeper.ZooKeeper.create(ZooKeeper.java:774)
	at org.apache.zookeeper.test.ChrootAsyncTest.setUp(ChrootAsyncTest.java:41)


FAILED:  org.apache.zookeeper.test.ChrootAsyncTest.testAsyncGetChildren2Two

Error Message:
null

Stack Trace:
java.lang.NullPointerException
	at org.apache.zookeeper.proto.CreateRequest.setData(CreateRequest.java:50)
	at org.apache.zookeeper.ZooKeeper.create(ZooKeeper.java:774)
	at org.apache.zookeeper.test.ChrootAsyncTest.setUp(ChrootAsyncTest.java:41)


FAILED:  org.apache.zookeeper.test.ChrootAsyncTest.testAsyncGetChildren2Failure_NoNode

Error Message:
null

Stack Trace:
java.lang.NullPointerException
	at org.apache.zookeeper.proto.CreateRequest.setData(CreateRequest.java:50)
	at org.apache.zookeeper.ZooKeeper.create(ZooKeeper.java:774)
	at org.apache.zookeeper.test.ChrootAsyncTest.setUp(ChrootAsyncTest.java:41)


FAILED:  org.apache.zookeeper.test.ChrootAsyncTest.testAsyncGetData

Error Message:
null

Stack Trace:
java.lang.NullPointerException
	at org.apache.zookeeper.proto.CreateRequest.setData(CreateRequest.java:50)
	at org.apache.zookeeper.ZooKeeper.create(ZooKeeper.java:774)
	at org.apache.zookeeper.test.ChrootAsyncTest.setUp(ChrootAsyncTest.java:41)


FAILED:  org.apache.zookeeper.test.ChrootAsyncTest.testAsyncGetDataFailure_NoNode

Error Message:
null

Stack Trace:
java.lang.NullPointerException
	at org.apache.zookeeper.proto.CreateRequest.setData(CreateRequest.java:50)
	at org.apache.zookeeper.ZooKeeper.create(ZooKeeper.java:774)
	at org.apache.zookeeper.test.ChrootAsyncTest.setUp(ChrootAsyncTest.java:41)


FAILED:  org.apache.zookeeper.test.ChrootAsyncTest.testAsyncCreateFailure_NoChildForEphemeral

Error Message:
null

Stack Trace:
java.lang.NullPointerException
	at org.apache.zookeeper.proto.CreateRequest.setData(CreateRequest.java:50)
	at org.apache.zookeeper.ZooKeeper.create(ZooKeeper.java:774)
	at org.apache.zookeeper.test.ChrootAsyncTest.setUp(ChrootAsyncTest.java:41)


FAILED:  org.apache.zookeeper.test.ChrootAsyncTest.testAsyncDelete

Error Message:
null

Stack Trace:
java.lang.NullPointerException
	at org.apache.zookeeper.proto.CreateRequest.setData(CreateRequest.java:50)
	at org.apache.zookeeper.ZooKeeper.create(ZooKeeper.java:774)
	at org.apache.zookeeper.test.ChrootAsyncTest.setUp(ChrootAsyncTest.java:41)


FAILED:  org.apache.zookeeper.test.ChrootAsyncTest.testAsyncDeleteFailure_NoNode

Error Message:
null

Stack Trace:
java.lang.NullPointerException
	at org.apache.zookeeper.proto.CreateRequest.setData(CreateRequest.java:50)
	at org.apache.zookeeper.ZooKeeper.create(ZooKeeper.java:774)
	at org.apache.zookeeper.test.ChrootAsyncTest.setUp(ChrootAsyncTest.java:41)


FAILED:  org.apache.zookeeper.test.ChrootAsyncTest.testAsyncDeleteFailure_BadVersion

Error Message:
null

Stack Trace:
java.lang.NullPointerException
	at org.apache.zookeeper.proto.CreateRequest.setData(CreateRequest.java:50)
	at org.apache.zookeeper.ZooKeeper.create(ZooKeeper.java:774)
	at org.apache.zookeeper.test.ChrootAsyncTest.setUp(ChrootAsyncTest.java:41)


FAILED:  org.apache.zookeeper.test.ChrootAsyncTest.testAsyncDeleteFailure_NotEmpty

Error Message:
null

Stack Trace:
java.lang.NullPointerException
	at org.apache.zookeeper.proto.CreateRequest.setData(CreateRequest.java:50)
	at org.apache.zookeeper.ZooKeeper.create(ZooKeeper.java:774)
	at org.apache.zookeeper.test.ChrootAsyncTest.setUp(ChrootAsyncTest.java:41)


FAILED:  org.apache.zookeeper.test.ChrootAsyncTest.testAsyncSetACL

Error Message:
null

Stack Trace:
java.lang.NullPointerException
	at org.apache.zookeeper.proto.CreateRequest.setData(CreateRequest.java:50)
	at org.apache.zookeeper.ZooKeeper.create(ZooKeeper.java:774)
	at org.apache.zookeeper.test.ChrootAsyncTest.setUp(ChrootAsyncTest.java:41)


FAILED:  org.apache.zookeeper.test.ChrootAsyncTest.testAsyncSetACLFailure_NoNode

Error Message:
null

Stack Trace:
java.lang.NullPointerException
	at org.apache.zookeeper.proto.CreateRequest.setData(CreateRequest.java:50)
	at org.apache.zookeeper.ZooKeeper.create(ZooKeeper.java:774)
	at org.apache.zookeeper.test.ChrootAsyncTest.setUp(ChrootAsyncTest.java:41)


FAILED:  org.apache.zookeeper.test.ChrootAsyncTest.testAsyncSetACLFailure_BadVersion

Error Message:
null

Stack Trace:
java.lang.NullPointerException
	at org.apache.zookeeper.proto.CreateRequest.setData(CreateRequest.java:50)
	at org.apache.zookeeper.ZooKeeper.create(ZooKeeper.java:774)
	at org.apache.zookeeper.test.ChrootAsyncTest.setUp(ChrootAsyncTest.java:41)


FAILED:  org.apache.zookeeper.test.ChrootAsyncTest.testAsyncSetData

Error Message:
null

Stack Trace:
java.lang.NullPointerException
	at org.apache.zookeeper.proto.CreateRequest.setData(CreateRequest.java:50)
	at org.apache.zookeeper.ZooKeeper.create(ZooKeeper.java:774)
	at org.apache.zookeeper.test.ChrootAsyncTest.setUp(ChrootAsyncTest.java:41)


FAILED:  org.apache.zookeeper.test.ChrootAsyncTest.testAsyncSetDataFailure_NoNode

Error Message:
null

Stack Trace:
java.lang.NullPointerException
	at org.apache.zookeeper.proto.CreateRequest.setData(CreateRequest.java:50)
	at org.apache.zookeeper.ZooKeeper.create(ZooKeeper.java:774)
	at org.apache.zookeeper.test.ChrootAsyncTest.setUp(ChrootAsyncTest.java:41)


FAILED:  org.apache.zookeeper.test.ChrootAsyncTest.testAsyncSetDataFailure_BadVersion

Error Message:
null

Stack Trace:
java.lang.NullPointerException
	at org.apache.zookeeper.proto.CreateRequest.setData(CreateRequest.java:50)
	at org.apache.zookeeper.ZooKeeper.create(ZooKeeper.java:774)
	at org.apache.zookeeper.test.ChrootAsyncTest.setUp(ChrootAsyncTest.java:41)


FAILED:  org.apache.zookeeper.test.ChrootAsyncTest.testAsyncExists

Error Message:
null

Stack Trace:
java.lang.NullPointerException
	at org.apache.zookeeper.proto.CreateRequest.setData(CreateRequest.java:50)
	at org.apache.zookeeper.ZooKeeper.create(ZooKeeper.java:774)
	at org.apache.zookeeper.test.ChrootAsyncTest.setUp(ChrootAsyncTest.java:41)


FAILED:  org.apache.zookeeper.test.ChrootAsyncTest.testAsyncExistsFailure_NoNode

Error Message:
null

Stack Trace:
java.lang.NullPointerException
	at org.apache.zookeeper.proto.CreateRequest.setData(CreateRequest.java:50)
	at org.apache.zookeeper.ZooKeeper.create(ZooKeeper.java:774)
	at org.apache.zookeeper.test.ChrootAsyncTest.setUp(ChrootAsyncTest.java:41)


FAILED:  org.apache.zookeeper.test.ChrootAsyncTest.testAsyncGetACL

Error Message:
null

Stack Trace:
java.lang.NullPointerException
	at org.apache.zookeeper.proto.CreateRequest.setData(CreateRequest.java:50)
	at org.apache.zookeeper.ZooKeeper.create(ZooKeeper.java:774)
	at org.apache.zookeeper.test.ChrootAsyncTest.setUp(ChrootAsyncTest.java:41)


FAILED:  org.apache.zookeeper.test.ChrootAsyncTest.testAsyncGetACLFailure_NoNode

Error Message:
null

Stack Trace:
java.lang.NullPointerException
	at org.apache.zookeeper.proto.CreateRequest.setData(CreateRequest.java:50)
	at org.apache.zookeeper.ZooKeeper.create(ZooKeeper.java:774)
	at org.apache.zookeeper.test.ChrootAsyncTest.setUp(ChrootAsyncTest.java:41)


FAILED:  org.apache.zookeeper.test.ChrootAsyncTest.testAsyncGetChildrenEmpty

Error Message:
null

Stack Trace:
java.lang.NullPointerException
	at org.apache.zookeeper.proto.CreateRequest.setData(CreateRequest.java:50)
	at org.apache.zookeeper.ZooKeeper.create(ZooKeeper.java:774)
	at org.apache.zookeeper.test.ChrootAsyncTest.setUp(ChrootAsyncTest.java:41)


FAILED:  org.apache.zookeeper.test.ChrootAsyncTest.testAsyncGetChildrenSingle

Error Message:
null

Stack Trace:
java.lang.NullPointerException
	at org.apache.zookeeper.proto.CreateRequest.setData(CreateRequest.java:50)
	at org.apache.zookeeper.ZooKeeper.create(ZooKeeper.java:774)
	at org.apache.zookeeper.test.ChrootAsyncTest.setUp(ChrootAsyncTest.java:41)


FAILED:  org.apache.zookeeper.test.ChrootAsyncTest.testAsyncGetChildrenTwo

Error Message:
null

Stack Trace:
java.lang.NullPointerException
	at org.apache.zookeeper.proto.CreateRequest.setData(CreateRequest.java:50)
	at org.apache.zookeeper.ZooKeeper.create(ZooKeeper.java:774)
	at org.apache.zookeeper.test.ChrootAsyncTest.setUp(ChrootAsyncTest.java:41)


FAILED:  org.apache.zookeeper.test.ChrootAsyncTest.testAsyncGetChildrenFailure_NoNode

Error Message:
null

Stack Trace:
java.lang.NullPointerException
	at org.apache.zookeeper.proto.CreateRequest.setData(CreateRequest.java:50)
	at org.apache.zookeeper.ZooKeeper.create(ZooKeeper.java:774)
	at org.apache.zookeeper.test.ChrootAsyncTest.setUp(ChrootAsyncTest.java:41)


FAILED:  org.apache.zookeeper.test.ChrootAsyncTest.testAsyncGetChildren2Empty

Error Message:
null

Stack Trace:
java.lang.NullPointerException
	at org.apache.zookeeper.proto.CreateRequest.setData(CreateRequest.java:50)
	at org.apache.zookeeper.ZooKeeper.create(ZooKeeper.java:774)
	at org.apache.zookeeper.test.ChrootAsyncTest.setUp(ChrootAsyncTest.java:41)


FAILED:  org.apache.zookeeper.test.ChrootAsyncTest.testAsyncCreateThree

Error Message:
null

Stack Trace:
java.lang.NullPointerException
	at org.apache.zookeeper.proto.CreateRequest.setData(CreateRequest.java:50)
	at org.apache.zookeeper.ZooKeeper.create(ZooKeeper.java:774)
	at org.apache.zookeeper.test.ChrootAsyncTest.setUp(ChrootAsyncTest.java:41)


FAILED:  org.apache.zookeeper.test.ChrootAsyncTest.testAsyncCreateFailure_NodeExists

Error Message:
null

Stack Trace:
java.lang.NullPointerException
	at org.apache.zookeeper.proto.CreateRequest.setData(CreateRequest.java:50)
	at org.apache.zookeeper.ZooKeeper.create(ZooKeeper.java:774)
	at org.apache.zookeeper.test.ChrootAsyncTest.setUp(ChrootAsyncTest.java:41)


FAILED:  org.apache.zookeeper.test.ChrootAsyncTest.testAsyncCreateFailure_NoNode

Error Message:
null

Stack Trace:
java.lang.NullPointerException
	at org.apache.zookeeper.proto.CreateRequest.setData(CreateRequest.java:50)
	at org.apache.zookeeper.ZooKeeper.create(ZooKeeper.java:774)
	at org.apache.zookeeper.test.ChrootAsyncTest.setUp(ChrootAsyncTest.java:41)


FAILED:  org.apache.zookeeper.test.ChrootAsyncTest.testAsyncSync

Error Message:
null

Stack Trace:
java.lang.NullPointerException
	at org.apache.zookeeper.proto.CreateRequest.setData(CreateRequest.java:50)
	at org.apache.zookeeper.ZooKeeper.create(ZooKeeper.java:774)
	at org.apache.zookeeper.test.ChrootAsyncTest.setUp(ChrootAsyncTest.java:41)


FAILED:  org.apache.zookeeper.test.ChrootClientTest.testPing

Error Message:
null

Stack Trace:
java.lang.NullPointerException
	at org.apache.zookeeper.proto.CreateRequest.setData(CreateRequest.java:50)
	at org.apache.zookeeper.ZooKeeper.create(ZooKeeper.java:774)
	at org.apache.zookeeper.test.ChrootClientTest.setUp(ChrootClientTest.java:43)


FAILED:  org.apache.zookeeper.test.ChrootClientTest.testClientwithoutWatcherObj

Error Message:
null

Stack Trace:
java.lang.NullPointerException
	at org.apache.zookeeper.proto.CreateRequest.setData(CreateRequest.java:50)
	at org.apache.zookeeper.ZooKeeper.create(ZooKeeper.java:774)
	at org.apache.zookeeper.test.ChrootClientTest.setUp(ChrootClientTest.java:43)


FAILED:  org.apache.zookeeper.test.ChrootClientTest.testClientWithWatcherObj

Error Message:
null

Stack Trace:
java.lang.NullPointerException
	at org.apache.zookeeper.proto.CreateRequest.setData(CreateRequest.java:50)
	at org.apache.zookeeper.ZooKeeper.create(ZooKeeper.java:774)
	at org.apache.zookeeper.test.ChrootClientTest.setUp(ChrootClientTest.java:43)


FAILED:  org.apache.zookeeper.test.ChrootClientTest.testClientWithIPv6Address

Error Message:
null

Stack Trace:
java.lang.NullPointerException
	at org.apache.zookeeper.proto.CreateRequest.setData(CreateRequest.java:50)
	at org.apache.zookeeper.ZooKeeper.create(ZooKeeper.java:774)
	at org.apache.zookeeper.test.ChrootClientTest.setUp(ChrootClientTest.java:43)


FAILED:  org.apache.zookeeper.test.ChrootClientTest.testTestability

Error Message:
null

Stack Trace:
java.lang.NullPointerException
	at org.apache.zookeeper.proto.CreateRequest.setData(CreateRequest.java:50)
	at org.apache.zookeeper.ZooKeeper.create(ZooKeeper.java:774)
	at org.apache.zookeeper.test.ChrootClientTest.setUp(ChrootClientTest.java:43)


FAILED:  org.apache.zookeeper.test.ChrootClientTest.testMutipleWatcherObjs

Error Message:
null

Stack Trace:
java.lang.NullPointerException
	at org.apache.zookeeper.proto.CreateRequest.setData(CreateRequest.java:50)
	at org.apache.zookeeper.ZooKeeper.create(ZooKeeper.java:774)
	at org.apache.zookeeper.test.ChrootClientTest.setUp(ChrootClientTest.java:43)


FAILED:  org.apache.zookeeper.test.ChrootClientTest.testACLs

Error Message:
null

Stack Trace:
java.lang.NullPointerException
	at org.apache.zookeeper.proto.CreateRequest.setData(CreateRequest.java:50)
	at org.apache.zookeeper.ZooKeeper.create(ZooKeeper.java:774)
	at org.apache.zookeeper.test.ChrootClientTest.setUp(ChrootClientTest.java:43)


FAILED:  org.apache.zookeeper.test.ChrootClientTest.testSequentialNodeNames

Error Message:
null

Stack Trace:
java.lang.NullPointerException
	at org.apache.zookeeper.proto.CreateRequest.setData(CreateRequest.java:50)
	at org.apache.zookeeper.ZooKeeper.create(ZooKeeper.java:774)
	at org.apache.zookeeper.test.ChrootClientTest.setUp(ChrootClientTest.java:43)


FAILED:  org.apache.zookeeper.test.ChrootClientTest.testSequentialNodeData

Error Message:
null

Stack Trace:
java.lang.NullPointerException
	at org.apache.zookeeper.proto.CreateRequest.setData(CreateRequest.java:50)
	at org.apache.zookeeper.ZooKeeper.create(ZooKeeper.java:774)
	at org.apache.zookeeper.test.ChrootClientTest.setUp(ChrootClientTest.java:43)


FAILED:  org.apache.zookeeper.test.ChrootClientTest.testLargeNodeData

Error Message:
null

Stack Trace:
java.lang.NullPointerException
	at org.apache.zookeeper.proto.CreateRequest.setData(CreateRequest.java:50)
	at org.apache.zookeeper.ZooKeeper.create(ZooKeeper.java:774)
	at org.apache.zookeeper.test.ChrootClientTest.setUp(ChrootClientTest.java:43)


FAILED:  org.apache.zookeeper.test.ChrootClientTest.testPathValidation

Error Message:
null

Stack Trace:
java.lang.NullPointerException
	at org.apache.zookeeper.proto.CreateRequest.setData(CreateRequest.java:50)
	at org.apache.zookeeper.ZooKeeper.create(ZooKeeper.java:774)
	at org.apache.zookeeper.test.ChrootClientTest.setUp(ChrootClientTest.java:43)


FAILED:  org.apache.zookeeper.test.ChrootClientTest.testDeleteWithChildren

Error Message:
null

Stack Trace:
java.lang.NullPointerException
	at org.apache.zookeeper.proto.CreateRequest.setData(CreateRequest.java:50)
	at org.apache.zookeeper.ZooKeeper.create(ZooKeeper.java:774)
	at org.apache.zookeeper.test.ChrootClientTest.setUp(ChrootClientTest.java:43)


FAILED:  org.apache.zookeeper.test.ChrootClientTest.testClientCleanup

Error Message:
null

Stack Trace:
java.lang.NullPointerException
	at org.apache.zookeeper.proto.CreateRequest.setData(CreateRequest.java:50)
	at org.apache.zookeeper.ZooKeeper.create(ZooKeeper.java:774)
	at org.apache.zookeeper.test.ChrootClientTest.setUp(ChrootClientTest.java:43)


FAILED:  org.apache.zookeeper.test.ChrootClientTest.testNonExistingOpCode

Error Message:
null

Stack Trace:
java.lang.NullPointerException
	at org.apache.zookeeper.proto.CreateRequest.setData(CreateRequest.java:50)
	at org.apache.zookeeper.ZooKeeper.create(ZooKeeper.java:774)
	at org.apache.zookeeper.test.ChrootClientTest.setUp(ChrootClientTest.java:43)


FAILED:  org.apache.zookeeper.test.ChrootTest.testChrootSynchronous

Error Message:
null

Stack Trace:
java.lang.NullPointerException
	at org.apache.zookeeper.proto.CreateRequest.setData(CreateRequest.java:50)
	at org.apache.zookeeper.ZooKeeper.create(ZooKeeper.java:774)
	at org.apache.zookeeper.test.ChrootTest.testChrootSynchronous(ChrootTest.java:63)
	at org.apache.zookeeper.JUnit4ZKTestRunner$LoggedInvokeMethod.evaluate(JUnit4ZKTestRunner.java:55)


FAILED:  org.apache.zookeeper.test.ClientTest.testPathValidation

Error Message:
null

Stack Trace:
java.lang.NullPointerException
	at org.apache.zookeeper.proto.CreateRequest.setData(CreateRequest.java:50)
	at org.apache.zookeeper.ZooKeeper.create(ZooKeeper.java:774)
	at org.apache.zookeeper.test.ClientTest.testPathValidation(ClientTest.java:597)
	at org.apache.zookeeper.JUnit4ZKTestRunner$LoggedInvokeMethod.evaluate(JUnit4ZKTestRunner.java:55)


FAILED:  org.apache.zookeeper.test.DisconnectedWatcherTest.testDefaultWatcherAutoResetWithChroot

Error Message:
null

Stack Trace:
java.lang.NullPointerException
	at org.apache.zookeeper.proto.CreateRequest.setData(CreateRequest.java:50)
	at org.apache.zookeeper.ZooKeeper.create(ZooKeeper.java:774)
	at org.apache.zookeeper.test.DisconnectedWatcherTest.testDefaultWatcherAutoResetWithChroot(DisconnectedWatcherTest.java:102)
	at org.apache.zookeeper.JUnit4ZKTestRunner$LoggedInvokeMethod.evaluate(JUnit4ZKTestRunner.java:55)


FAILED:  org.apache.zookeeper.test.DisconnectedWatcherTest.testDeepChildWatcherAutoResetWithChroot

Error Message:
null

Stack Trace:
java.lang.NullPointerException
	at org.apache.zookeeper.proto.CreateRequest.setData(CreateRequest.java:50)
	at org.apache.zookeeper.ZooKeeper.create(ZooKeeper.java:774)
	at org.apache.zookeeper.test.DisconnectedWatcherTest.testDeepChildWatcherAutoResetWithChroot(DisconnectedWatcherTest.java:141)
	at org.apache.zookeeper.JUnit4ZKTestRunner$LoggedInvokeMethod.evaluate(JUnit4ZKTestRunner.java:55)


FAILED:  org.apache.zookeeper.test.DisconnectedWatcherTest.testManyChildWatchersAutoReset

Error Message:
null

Stack Trace:
java.lang.NullPointerException
	at org.apache.zookeeper.proto.CreateRequest.setData(CreateRequest.java:50)
	at org.apache.zookeeper.ZooKeeper.create(ZooKeeper.java:774)
	at org.apache.zookeeper.test.DisconnectedWatcherTest.testManyChildWatchersAutoReset(DisconnectedWatcherTest.java:192)
	at org.apache.zookeeper.JUnit4ZKTestRunner$LoggedInvokeMethod.evaluate(JUnit4ZKTestRunner.java:55)


FAILED:  org.apache.zookeeper.test.DisconnectedWatcherTest.testChildWatcherAutoResetWithChroot

Error Message:
null

Stack Trace:
java.lang.NullPointerException
	at org.apache.zookeeper.proto.CreateRequest.setData(CreateRequest.java:50)
	at org.apache.zookeeper.ZooKeeper.create(ZooKeeper.java:774)
	at org.apache.zookeeper.test.DisconnectedWatcherTest.testChildWatcherAutoResetWithChroot(DisconnectedWatcherTest.java:62)
	at org.apache.zookeeper.JUnit4ZKTestRunner$LoggedInvokeMethod.evaluate(JUnit4ZKTestRunner.java:55)


FAILED:  org.apache.zookeeper.test.FollowerResyncConcurrencyTest.testResyncBySnapThenDiffAfterFollowerCrashes

Error Message:
waiting for server up

Stack Trace:
junit.framework.AssertionFailedError: waiting for server up
	at org.apache.zookeeper.test.QuorumUtil.startAll(QuorumUtil.java:137)
	at org.apache.zookeeper.test.FollowerResyncConcurrencyTest.testResyncBySnapThenDiffAfterFollowerCrashes(FollowerResyncConcurrencyTest.java:158)
	at org.apache.zookeeper.JUnit4ZKTestRunner$LoggedInvokeMethod.evaluate(JUnit4ZKTestRunner.java:55)


FAILED:  org.apache.zookeeper.test.FollowerResyncConcurrencyTest.testFollowerSendsLastZxid

Error Message:
waiting for server up

Stack Trace:
junit.framework.AssertionFailedError: waiting for server up
	at org.apache.zookeeper.test.QuorumUtil.startAll(QuorumUtil.java:137)
	at org.apache.zookeeper.test.FollowerResyncConcurrencyTest.testFollowerSendsLastZxid(FollowerResyncConcurrencyTest.java:533)
	at org.apache.zookeeper.JUnit4ZKTestRunner$LoggedInvokeMethod.evaluate(JUnit4ZKTestRunner.java:55)


FAILED:  org.apache.zookeeper.test.FollowerResyncConcurrencyTest.testFollowerWatcherResync

Error Message:
waiting for server up

Stack Trace:
junit.framework.AssertionFailedError: waiting for server up
	at org.apache.zookeeper.test.QuorumUtil.startAll(QuorumUtil.java:137)
	at org.apache.zookeeper.test.FollowerResyncConcurrencyTest.testFollowerWatcherResync(FollowerResyncConcurrencyTest.java:574)
	at org.apache.zookeeper.JUnit4ZKTestRunner$LoggedInvokeMethod.evaluate(JUnit4ZKTestRunner.java:55)


FAILED:  org.apache.zookeeper.test.FollowerResyncConcurrencyTest.testResyncByDiffAfterFollowerCrashes

Error Message:
waiting for server up

Stack Trace:
junit.framework.AssertionFailedError: waiting for server up
	at org.apache.zookeeper.test.QuorumUtil.startAll(QuorumUtil.java:137)
	at org.apache.zookeeper.test.FollowerResyncConcurrencyTest.testResyncByDiffAfterFollowerCrashes(FollowerResyncConcurrencyTest.java:322)
	at org.apache.zookeeper.JUnit4ZKTestRunner$LoggedInvokeMethod.evaluate(JUnit4ZKTestRunner.java:55)


FAILED:  org.apache.zookeeper.test.FollowerResyncConcurrencyTest.testLaggingFollowerResyncsUnderNewEpoch

Error Message:
Waiting for server up

Stack Trace:
junit.framework.AssertionFailedError: Waiting for server up
	at org.apache.zookeeper.test.FollowerResyncConcurrencyTest.testLaggingFollowerResyncsUnderNewEpoch(FollowerResyncConcurrencyTest.java:83)
	at org.apache.zookeeper.JUnit4ZKTestRunner$LoggedInvokeMethod.evaluate(JUnit4ZKTestRunner.java:55)


FAILED:  org.apache.zookeeper.test.FollowerTest.testFollowersStartAfterLeader

Error Message:
Waiting for server up

Stack Trace:
junit.framework.AssertionFailedError: Waiting for server up
	at org.apache.zookeeper.test.QuorumUtil.startQuorum(QuorumUtil.java:179)
	at org.apache.zookeeper.test.FollowerTest.testFollowersStartAfterLeader(FollowerTest.java:66)
	at org.apache.zookeeper.JUnit4ZKTestRunner$LoggedInvokeMethod.evaluate(JUnit4ZKTestRunner.java:55)


FAILED:  org.apache.zookeeper.test.FollowerTest.testNoLogBeforeLeaderEstablishment

Error Message:
Waiting for server up

Stack Trace:
junit.framework.AssertionFailedError: Waiting for server up
	at org.apache.zookeeper.test.QuorumUtil.startQuorum(QuorumUtil.java:179)
	at org.apache.zookeeper.test.FollowerTest.testNoLogBeforeLeaderEstablishment(FollowerTest.java:125)
	at org.apache.zookeeper.JUnit4ZKTestRunner$LoggedInvokeMethod.evaluate(JUnit4ZKTestRunner.java:55)


FAILED:  org.apache.zookeeper.test.FollowerTest.testMultiToFollower

Error Message:
Waiting for server up

Stack Trace:
junit.framework.AssertionFailedError: Waiting for server up
	at org.apache.zookeeper.test.QuorumUtil.startQuorum(QuorumUtil.java:179)
	at org.apache.zookeeper.test.FollowerTest.testMultiToFollower(FollowerTest.java:206)
	at org.apache.zookeeper.JUnit4ZKTestRunner$LoggedInvokeMethod.evaluate(JUnit4ZKTestRunner.java:55)


FAILED:  org.apache.zookeeper.test.FourLetterWordsQuorumTest.testFourLetterWords

Error Message:
waiting for server up

Stack Trace:
junit.framework.AssertionFailedError: waiting for server up
	at org.apache.zookeeper.test.QuorumBase.startServers(QuorumBase.java:183)
	at org.apache.zookeeper.test.QuorumBase.setUp(QuorumBase.java:101)
	at org.apache.zookeeper.test.QuorumBase.setUp(QuorumBase.java:65)


FAILED:  org.apache.zookeeper.test.FourLetterWordsQuorumTest.testNull

Error Message:
waiting for server up

Stack Trace:
junit.framework.AssertionFailedError: waiting for server up
	at org.apache.zookeeper.test.QuorumBase.startServers(QuorumBase.java:183)
	at org.apache.zookeeper.test.QuorumBase.setUp(QuorumBase.java:101)
	at org.apache.zookeeper.test.QuorumBase.setUp(QuorumBase.java:65)


FAILED:  org.apache.zookeeper.test.HierarchicalQuorumTest.testHierarchicalQuorum

Error Message:
waiting for server up

Stack Trace:
junit.framework.AssertionFailedError: waiting for server up
	at org.apache.zookeeper.test.HierarchicalQuorumTest.startServers(HierarchicalQuorumTest.java:205)
	at org.apache.zookeeper.test.HierarchicalQuorumTest.startServers(HierarchicalQuorumTest.java:121)
	at org.apache.zookeeper.test.HierarchicalQuorumTest.setUp(HierarchicalQuorumTest.java:107)


FAILED:  org.apache.zookeeper.test.MultiTransactionTest.testTransactionBuilder[0]

Error Message:
KeeperErrorCode = ConnectionLoss

Stack Trace:
org.apache.zookeeper.KeeperException$ConnectionLossException: KeeperErrorCode = ConnectionLoss
	at org.apache.zookeeper.KeeperException.create(KeeperException.java:99)
	at org.apache.zookeeper.ZooKeeper.multiInternal(ZooKeeper.java:992)
	at org.apache.zookeeper.ZooKeeper.multi(ZooKeeper.java:910)
	at org.apache.zookeeper.Transaction.commit(Transaction.java:62)
	at org.apache.zookeeper.test.MultiTransactionTest.commit(MultiTransactionTest.java:190)
	at org.apache.zookeeper.test.MultiTransactionTest.testTransactionBuilder(MultiTransactionTest.java:719)


FAILED:  org.apache.zookeeper.test.MultiTransactionTest.testTransactionBuilder[1]

Error Message:
KeeperErrorCode = ConnectionLoss

Stack Trace:
org.apache.zookeeper.KeeperException$ConnectionLossException: KeeperErrorCode = ConnectionLoss
	at org.apache.zookeeper.KeeperException.create(KeeperException.java:99)
	at org.apache.zookeeper.test.MultiTransactionTest.commit(MultiTransactionTest.java:185)
	at org.apache.zookeeper.test.MultiTransactionTest.testTransactionBuilder(MultiTransactionTest.java:719)


FAILED:  org.apache.zookeeper.test.AsyncHammerTest.testHammer

Error Message:
waiting for server up

Stack Trace:
junit.framework.AssertionFailedError: waiting for server up
	at org.apache.zookeeper.test.QuorumBase.startServers(QuorumBase.java:183)
	at org.apache.zookeeper.test.QuorumBase.setUp(QuorumBase.java:101)
	at org.apache.zookeeper.test.AsyncHammerTest.setUp(AsyncHammerTest.java:52)
	at org.apache.zookeeper.test.AsyncHammerTest.testHammer(AsyncHammerTest.java:171)
	at org.apache.zookeeper.JUnit4ZKTestRunner$LoggedInvokeMethod.evaluate(JUnit4ZKTestRunner.java:55)


FAILED:  org.apache.zookeeper.test.AsyncHammerTest.testObserversHammer

Error Message:
waiting for server up

Stack Trace:
junit.framework.AssertionFailedError: waiting for server up
	at org.apache.zookeeper.test.QuorumBase.startServers(QuorumBase.java:183)
	at org.apache.zookeeper.test.QuorumBase.setUp(QuorumBase.java:101)
	at org.apache.zookeeper.test.AsyncHammerTest.setUp(AsyncHammerTest.java:52)
	at org.apache.zookeeper.test.AsyncHammerTest.testObserversHammer(AsyncHammerTest.java:203)
	at org.apache.zookeeper.JUnit4ZKTestRunner$LoggedInvokeMethod.evaluate(JUnit4ZKTestRunner.java:55)


FAILED:  org.apache.zookeeper.test.ChrootClientTest.testPathValidation

Error Message:
null

Stack Trace:
java.lang.NullPointerException
	at org.apache.zookeeper.proto.CreateRequest.setData(CreateRequest.java:50)
	at org.apache.zookeeper.ZooKeeper.create(ZooKeeper.java:774)
	at org.apache.zookeeper.test.ChrootClientTest.setUp(ChrootClientTest.java:43)


FAILED:  org.apache.zookeeper.test.ClientTest.testPathValidation

Error Message:
null

Stack Trace:
java.lang.NullPointerException
	at org.apache.zookeeper.proto.CreateRequest.setData(CreateRequest.java:50)
	at org.apache.zookeeper.ZooKeeper.create(ZooKeeper.java:774)
	at org.apache.zookeeper.test.ClientTest.testPathValidation(ClientTest.java:597)
	at org.apache.zookeeper.JUnit4ZKTestRunner$LoggedInvokeMethod.evaluate(JUnit4ZKTestRunner.java:55)


FAILED:  org.apache.zookeeper.test.NullDataTest.testNullData

Error Message:
null

Stack Trace:
java.lang.NullPointerException
	at org.apache.zookeeper.proto.CreateRequest.setData(CreateRequest.java:50)
	at org.apache.zookeeper.ZooKeeper.create(ZooKeeper.java:774)
	at org.apache.zookeeper.test.NullDataTest.testNullData(NullDataTest.java:59)
	at org.apache.zookeeper.JUnit4ZKTestRunner$LoggedInvokeMethod.evaluate(JUnit4ZKTestRunner.java:55)


FAILED:  org.apache.zookeeper.test.NonRecoverableErrorTest.testZooKeeperServiceAvailableOnLeader

Error Message:
test timed out after 30000 milliseconds

Stack Trace:
java.lang.Exception: test timed out after 30000 milliseconds
	at java.lang.Thread.sleep(Native Method)
	at org.apache.zookeeper.test.ClientBase.waitForServerUp(ClientBase.java:276)
	at org.apache.zookeeper.test.NonRecoverableErrorTest.testZooKeeperServiceAvailableOnLeader(NonRecoverableErrorTest.java:75)
	at org.apache.zookeeper.JUnit4ZKTestRunner$LoggedInvokeMethod.evaluate(JUnit4ZKTestRunner.java:55)


FAILED:  org.apache.zookeeper.test.NullDataTest.testNullData

Error Message:
null

Stack Trace:
java.lang.NullPointerException
	at org.apache.zookeeper.proto.CreateRequest.setData(CreateRequest.java:50)
	at org.apache.zookeeper.ZooKeeper.create(ZooKeeper.java:774)
	at org.apache.zookeeper.test.NullDataTest.testNullData(NullDataTest.java:59)
	at org.apache.zookeeper.JUnit4ZKTestRunner$LoggedInvokeMethod.evaluate(JUnit4ZKTestRunner.java:55)


FAILED:  org.apache.zookeeper.test.ObserverHierarchicalQuorumTest.testHierarchicalQuorum

Error Message:
waiting for server up

Stack Trace:
junit.framework.AssertionFailedError: waiting for server up
	at org.apache.zookeeper.test.HierarchicalQuorumTest.startServers(HierarchicalQuorumTest.java:205)
	at org.apache.zookeeper.test.ObserverHierarchicalQuorumTest.startServers(ObserverHierarchicalQuorumTest.java:32)
	at org.apache.zookeeper.test.HierarchicalQuorumTest.setUp(HierarchicalQuorumTest.java:107)


FAILED:  org.apache.zookeeper.test.ObserverLETest.testLEWithObserver

Error Message:
waiting for server up

Stack Trace:
junit.framework.AssertionFailedError: waiting for server up
	at org.apache.zookeeper.test.QuorumBase.startServers(QuorumBase.java:183)
	at org.apache.zookeeper.test.QuorumBase.setUp(QuorumBase.java:101)
	at org.apache.zookeeper.test.ObserverLETest.establishThreeParticipantOneObserverEnsemble(ObserverLETest.java:37)


FAILED:  org.apache.zookeeper.test.ObserverQuorumHammerTest.testHammerBasic

Error Message:
waiting for server up

Stack Trace:
junit.framework.AssertionFailedError: waiting for server up
	at org.apache.zookeeper.test.QuorumBase.startServers(QuorumBase.java:183)
	at org.apache.zookeeper.test.QuorumBase.setUp(QuorumBase.java:101)
	at org.apache.zookeeper.test.ObserverQuorumHammerTest.setUp(ObserverQuorumHammerTest.java:30)


FAILED:  org.apache.zookeeper.test.ObserverTest.testObserver

Error Message:
waiting for server 1 being up

Stack Trace:
junit.framework.AssertionFailedError: waiting for server 1 being up
	at org.apache.zookeeper.test.ObserverTest.testObserver(ObserverTest.java:89)
	at org.apache.zookeeper.JUnit4ZKTestRunner$LoggedInvokeMethod.evaluate(JUnit4ZKTestRunner.java:55)


FAILED:  org.apache.zookeeper.test.QuorumHammerTest.testHammerBasic

Error Message:
waiting for server up

Stack Trace:
junit.framework.AssertionFailedError: waiting for server up
	at org.apache.zookeeper.test.QuorumBase.startServers(QuorumBase.java:183)
	at org.apache.zookeeper.test.QuorumBase.setUp(QuorumBase.java:101)
	at org.apache.zookeeper.test.QuorumBase.setUp(QuorumBase.java:65)
	at org.apache.zookeeper.test.QuorumHammerTest.setUp(QuorumHammerTest.java:36)


FAILED:  org.apache.zookeeper.test.QuorumQuotaTest.testQuotaWithQuorum

Error Message:
waiting for server up

Stack Trace:
junit.framework.AssertionFailedError: waiting for server up
	at org.apache.zookeeper.test.QuorumBase.startServers(QuorumBase.java:183)
	at org.apache.zookeeper.test.QuorumBase.setUp(QuorumBase.java:101)
	at org.apache.zookeeper.test.QuorumBase.setUp(QuorumBase.java:65)


FAILED:  org.apache.zookeeper.test.QuorumQuotaTest.testNull

Error Message:
waiting for server up

Stack Trace:
junit.framework.AssertionFailedError: waiting for server up
	at org.apache.zookeeper.test.QuorumBase.startServers(QuorumBase.java:183)
	at org.apache.zookeeper.test.QuorumBase.setUp(QuorumBase.java:101)
	at org.apache.zookeeper.test.QuorumBase.setUp(QuorumBase.java:65)


FAILED:  org.apache.zookeeper.test.QuorumTest.testMultipleWatcherObjs

Error Message:
waiting for server up

Stack Trace:
junit.framework.AssertionFailedError: waiting for server up
	at org.apache.zookeeper.test.QuorumBase.startServers(QuorumBase.java:183)
	at org.apache.zookeeper.test.QuorumBase.setUp(QuorumBase.java:101)
	at org.apache.zookeeper.test.QuorumBase.setUp(QuorumBase.java:65)
	at org.apache.zookeeper.test.QuorumTest.setUp(QuorumTest.java:61)


FAILED:  org.apache.zookeeper.test.QuorumTest.testSessionMoved

Error Message:
waiting for server up

Stack Trace:
junit.framework.AssertionFailedError: waiting for server up
	at org.apache.zookeeper.test.QuorumBase.startServers(QuorumBase.java:183)
	at org.apache.zookeeper.test.QuorumBase.setUp(QuorumBase.java:101)
	at org.apache.zookeeper.test.QuorumBase.setUp(QuorumBase.java:65)
	at org.apache.zookeeper.test.QuorumTest.setUp(QuorumTest.java:61)


FAILED:  org.apache.zookeeper.test.QuorumTest.testDeleteWithChildren

Error Message:
waiting for server up

Stack Trace:
junit.framework.AssertionFailedError: waiting for server up
	at org.apache.zookeeper.test.QuorumBase.startServers(QuorumBase.java:183)
	at org.apache.zookeeper.test.QuorumBase.setUp(QuorumBase.java:101)
	at org.apache.zookeeper.test.QuorumBase.setUp(QuorumBase.java:65)
	at org.apache.zookeeper.test.QuorumTest.setUp(QuorumTest.java:61)


FAILED:  org.apache.zookeeper.test.QuorumTest.testPing

Error Message:
waiting for server up

Stack Trace:
junit.framework.AssertionFailedError: waiting for server up
	at org.apache.zookeeper.test.QuorumBase.startServers(QuorumBase.java:183)
	at org.apache.zookeeper.test.QuorumBase.setUp(QuorumBase.java:101)
	at org.apache.zookeeper.test.QuorumBase.setUp(QuorumBase.java:65)
	at org.apache.zookeeper.test.QuorumTest.setUp(QuorumTest.java:61)


FAILED:  org.apache.zookeeper.test.QuorumTest.testACLs

Error Message:
waiting for server up

Stack Trace:
junit.framework.AssertionFailedError: waiting for server up
	at org.apache.zookeeper.test.QuorumBase.startServers(QuorumBase.java:183)
	at org.apache.zookeeper.test.QuorumBase.setUp(QuorumBase.java:101)
	at org.apache.zookeeper.test.QuorumBase.setUp(QuorumBase.java:65)
	at org.apache.zookeeper.test.QuorumTest.setUp(QuorumTest.java:61)


FAILED:  org.apache.zookeeper.test.QuorumTest.testSequentialNodeNames

Error Message:
waiting for server up

Stack Trace:
junit.framework.AssertionFailedError: waiting for server up
	at org.apache.zookeeper.test.QuorumBase.startServers(QuorumBase.java:183)
	at org.apache.zookeeper.test.QuorumBase.setUp(QuorumBase.java:101)
	at org.apache.zookeeper.test.QuorumBase.setUp(QuorumBase.java:65)
	at org.apache.zookeeper.test.QuorumTest.setUp(QuorumTest.java:61)


FAILED:  org.apache.zookeeper.test.QuorumTest.testClientwithoutWatcherObj

Error Message:
waiting for server up

Stack Trace:
junit.framework.AssertionFailedError: waiting for server up
	at org.apache.zookeeper.test.QuorumBase.startServers(QuorumBase.java:183)
	at org.apache.zookeeper.test.QuorumBase.setUp(QuorumBase.java:101)
	at org.apache.zookeeper.test.QuorumBase.setUp(QuorumBase.java:65)
	at org.apache.zookeeper.test.QuorumTest.setUp(QuorumTest.java:61)


FAILED:  org.apache.zookeeper.test.QuorumTest.testClientWithWatcherObj

Error Message:
waiting for server up

Stack Trace:
junit.framework.AssertionFailedError: waiting for server up
	at org.apache.zookeeper.test.QuorumBase.startServers(QuorumBase.java:183)
	at org.apache.zookeeper.test.QuorumBase.setUp(QuorumBase.java:101)
	at org.apache.zookeeper.test.QuorumBase.setUp(QuorumBase.java:65)
	at org.apache.zookeeper.test.QuorumTest.setUp(QuorumTest.java:61)


FAILED:  org.apache.zookeeper.test.QuorumTest.testGetView

Error Message:
waiting for server up

Stack Trace:
junit.framework.AssertionFailedError: waiting for server up
	at org.apache.zookeeper.test.QuorumBase.startServers(QuorumBase.java:183)
	at org.apache.zookeeper.test.QuorumBase.setUp(QuorumBase.java:101)
	at org.apache.zookeeper.test.QuorumBase.setUp(QuorumBase.java:65)
	at org.apache.zookeeper.test.QuorumTest.setUp(QuorumTest.java:61)


FAILED:  org.apache.zookeeper.test.QuorumTest.testViewContains

Error Message:
waiting for server up

Stack Trace:
junit.framework.AssertionFailedError: waiting for server up
	at org.apache.zookeeper.test.QuorumBase.startServers(QuorumBase.java:183)
	at org.apache.zookeeper.test.QuorumBase.setUp(QuorumBase.java:101)
	at org.apache.zookeeper.test.QuorumBase.setUp(QuorumBase.java:65)
	at org.apache.zookeeper.test.QuorumTest.setUp(QuorumTest.java:61)


FAILED:  org.apache.zookeeper.test.QuorumTest.testLeaderShutdown

Error Message:
waiting for server up

Stack Trace:
junit.framework.AssertionFailedError: waiting for server up
	at org.apache.zookeeper.test.QuorumBase.startServers(QuorumBase.java:183)
	at org.apache.zookeeper.test.QuorumBase.setUp(QuorumBase.java:101)
	at org.apache.zookeeper.test.QuorumBase.setUp(QuorumBase.java:65)
	at org.apache.zookeeper.test.QuorumTest.setUp(QuorumTest.java:61)


FAILED:  org.apache.zookeeper.test.QuorumZxidSyncTest.testLateLogs

Error Message:
waiting for server up

Stack Trace:
junit.framework.AssertionFailedError: waiting for server up
	at org.apache.zookeeper.test.QuorumBase.startServers(QuorumBase.java:183)
	at org.apache.zookeeper.test.QuorumBase.setUp(QuorumBase.java:101)
	at org.apache.zookeeper.test.QuorumBase.setUp(QuorumBase.java:65)
	at org.apache.zookeeper.test.QuorumZxidSyncTest.setUp(QuorumZxidSyncTest.java:39)


FAILED:  org.apache.zookeeper.test.QuorumZxidSyncTest.testBehindLeader

Error Message:
waiting for server up

Stack Trace:
junit.framework.AssertionFailedError: waiting for server up
	at org.apache.zookeeper.test.QuorumBase.startServers(QuorumBase.java:183)
	at org.apache.zookeeper.test.QuorumBase.setUp(QuorumBase.java:101)
	at org.apache.zookeeper.test.QuorumBase.setUp(QuorumBase.java:65)
	at org.apache.zookeeper.test.QuorumZxidSyncTest.setUp(QuorumZxidSyncTest.java:39)


FAILED:  org.apache.zookeeper.test.ReadOnlyModeTest.testMultiTransaction

Error Message:
Waiting for server up

Stack Trace:
junit.framework.AssertionFailedError: Waiting for server up
	at org.apache.zookeeper.test.QuorumUtil.startQuorum(QuorumUtil.java:179)
	at org.apache.zookeeper.test.ReadOnlyModeTest.setUp(ReadOnlyModeTest.java:60)


FAILED:  org.apache.zookeeper.test.ReadOnlyModeTest.testSeekForRwServer

Error Message:
Waiting for server up

Stack Trace:
junit.framework.AssertionFailedError: Waiting for server up
	at org.apache.zookeeper.test.QuorumUtil.startQuorum(QuorumUtil.java:179)
	at org.apache.zookeeper.test.ReadOnlyModeTest.setUp(ReadOnlyModeTest.java:60)


FAILED:  org.apache.zookeeper.test.ReadOnlyModeTest.testReadOnlyClient

Error Message:
Waiting for server up

Stack Trace:
junit.framework.AssertionFailedError: Waiting for server up
	at org.apache.zookeeper.test.QuorumUtil.startQuorum(QuorumUtil.java:179)
	at org.apache.zookeeper.test.ReadOnlyModeTest.setUp(ReadOnlyModeTest.java:60)


FAILED:  org.apache.zookeeper.test.ReadOnlyModeTest.testConnectionEvents

Error Message:
Waiting for server up

Stack Trace:
junit.framework.AssertionFailedError: Waiting for server up
	at org.apache.zookeeper.test.QuorumUtil.startQuorum(QuorumUtil.java:179)
	at org.apache.zookeeper.test.ReadOnlyModeTest.setUp(ReadOnlyModeTest.java:60)


FAILED:  org.apache.zookeeper.test.ReadOnlyModeTest.testSessionEstablishment

Error Message:
Waiting for server up

Stack Trace:
junit.framework.AssertionFailedError: Waiting for server up
	at org.apache.zookeeper.test.QuorumUtil.startQuorum(QuorumUtil.java:179)
	at org.apache.zookeeper.test.ReadOnlyModeTest.setUp(ReadOnlyModeTest.java:60)


FAILED:  org.apache.zookeeper.test.RepeatStartupTest.testFail

Error Message:
waiting for server up

Stack Trace:
junit.framework.AssertionFailedError: waiting for server up
	at org.apache.zookeeper.test.QuorumBase.startServers(QuorumBase.java:183)
	at org.apache.zookeeper.test.QuorumBase.setUp(QuorumBase.java:101)
	at org.apache.zookeeper.test.QuorumBase.setUp(QuorumBase.java:65)
	at org.apache.zookeeper.test.RepeatStartupTest.testFail(RepeatStartupTest.java:40)
	at org.apache.zookeeper.JUnit4ZKTestRunner$LoggedInvokeMethod.evaluate(JUnit4ZKTestRunner.java:55)


FAILED:  org.apache.zookeeper.test.SaslAuthDesignatedClientTest.testAuth

Error Message:
null

Stack Trace:
java.lang.NullPointerException
	at org.apache.zookeeper.proto.CreateRequest.setData(CreateRequest.java:50)
	at org.apache.zookeeper.ZooKeeper.create(ZooKeeper.java:774)
	at org.apache.zookeeper.test.SaslAuthDesignatedClientTest.testAuth(SaslAuthDesignatedClientTest.java:72)
	at org.apache.zookeeper.JUnit4ZKTestRunner$LoggedInvokeMethod.evaluate(JUnit4ZKTestRunner.java:55)


FAILED:  org.apache.zookeeper.test.SaslAuthDesignatedServerTest.testAuth

Error Message:
null

Stack Trace:
java.lang.NullPointerException
	at org.apache.zookeeper.proto.CreateRequest.setData(CreateRequest.java:50)
	at org.apache.zookeeper.ZooKeeper.create(ZooKeeper.java:774)
	at org.apache.zookeeper.test.SaslAuthDesignatedServerTest.testAuth(SaslAuthDesignatedServerTest.java:96)
	at org.apache.zookeeper.JUnit4ZKTestRunner$LoggedInvokeMethod.evaluate(JUnit4ZKTestRunner.java:55)


FAILED:  org.apache.zookeeper.test.SaslAuthFailDesignatedClientTest.testAuth

Error Message:
null

Stack Trace:
java.lang.NullPointerException
	at org.apache.zookeeper.proto.CreateRequest.setData(CreateRequest.java:50)
	at org.apache.zookeeper.ZooKeeper.create(ZooKeeper.java:774)
	at org.apache.zookeeper.test.SaslAuthFailDesignatedClientTest.testAuth(SaslAuthFailDesignatedClientTest.java:98)
	at org.apache.zookeeper.JUnit4ZKTestRunner$LoggedInvokeMethod.evaluate(JUnit4ZKTestRunner.java:55)


FAILED:  org.apache.zookeeper.test.SaslAuthFailNotifyTest.testBadSaslAuthNotifiesWatch

Error Message:
Timeout occurred. Please note the time in the report does not reflect the time until the timeout.

Stack Trace:
junit.framework.AssertionFailedError: Timeout occurred. Please note the time in the report does not reflect the time until the timeout.


FAILED:  org.apache.zookeeper.test.SaslAuthMissingClientConfigTest.testAuth

Error Message:
null

Stack Trace:
java.lang.NullPointerException
	at org.apache.zookeeper.proto.CreateRequest.setData(CreateRequest.java:50)
	at org.apache.zookeeper.ZooKeeper.create(ZooKeeper.java:774)
	at org.apache.zookeeper.test.SaslAuthMissingClientConfigTest.testAuth(SaslAuthMissingClientConfigTest.java:87)
	at org.apache.zookeeper.JUnit4ZKTestRunner$LoggedInvokeMethod.evaluate(JUnit4ZKTestRunner.java:55)


FAILED:  org.apache.zookeeper.test.SaslAuthTest.testValidSaslIds

Error Message:
null

Stack Trace:
java.lang.NullPointerException
	at org.apache.zookeeper.proto.CreateRequest.setData(CreateRequest.java:50)
	at org.apache.zookeeper.ZooKeeper.create(ZooKeeper.java:774)
	at org.apache.zookeeper.test.SaslAuthTest.testValidSaslIds(SaslAuthTest.java:115)
	at org.apache.zookeeper.JUnit4ZKTestRunner$LoggedInvokeMethod.evaluate(JUnit4ZKTestRunner.java:55)


FAILED:  org.apache.zookeeper.test.SaslAuthTest.testInvalidSaslIds

Error Message:
null

Stack Trace:
java.lang.NullPointerException
	at org.apache.zookeeper.proto.CreateRequest.setData(CreateRequest.java:50)
	at org.apache.zookeeper.ZooKeeper.create(ZooKeeper.java:774)
	at org.apache.zookeeper.test.SaslAuthTest.testInvalidSaslIds(SaslAuthTest.java:134)
	at org.apache.zookeeper.JUnit4ZKTestRunner$LoggedInvokeMethod.evaluate(JUnit4ZKTestRunner.java:55)


FAILED:  org.apache.zookeeper.test.SaslAuthTest.testAuth

Error Message:
null

Stack Trace:
java.lang.NullPointerException
	at org.apache.zookeeper.proto.CreateRequest.setData(CreateRequest.java:50)
	at org.apache.zookeeper.ZooKeeper.create(ZooKeeper.java:774)
	at org.apache.zookeeper.test.SaslAuthTest.testAuth(SaslAuthTest.java:93)
	at org.apache.zookeeper.JUnit4ZKTestRunner$LoggedInvokeMethod.evaluate(JUnit4ZKTestRunner.java:55)


FAILED:  org.apache.zookeeper.test.TruncateTest.testTruncate

Error Message:
Timeout occurred. Please note the time in the report does not reflect the time until the timeout.

Stack Trace:
junit.framework.AssertionFailedError: Timeout occurred. Please note the time in the report does not reflect the time until the timeout.


FAILED:  org.apache.zookeeper.test.ZkDatabaseCorruptionTest.testCorruption

Error Message:
waiting for server up

Stack Trace:
junit.framework.AssertionFailedError: waiting for server up
	at org.apache.zookeeper.test.QuorumBase.startServers(QuorumBase.java:183)
	at org.apache.zookeeper.test.QuorumBase.setUp(QuorumBase.java:101)
	at org.apache.zookeeper.test.QuorumBase.setUp(QuorumBase.java:65)
	at org.apache.zookeeper.test.ZkDatabaseCorruptionTest.setUp(ZkDatabaseCorruptionTest.java:53)


FAILED:  org.apache.zookeeper.test.ZooKeeperQuotaTest.testQuota

Error Message:
null

Stack Trace:
java.lang.NullPointerException
	at org.apache.zookeeper.proto.CreateRequest.setData(CreateRequest.java:50)
	at org.apache.zookeeper.ZooKeeper.create(ZooKeeper.java:774)
	at org.apache.zookeeper.ZooKeeperMain.createQuota(ZooKeeperMain.java:562)
	at org.apache.zookeeper.test.ZooKeeperQuotaTest.testQuota(ZooKeeperQuotaTest.java:61)
	at org.apache.zookeeper.JUnit4ZKTestRunner$LoggedInvokeMethod.evaluate(JUnit4ZKTestRunner.java:55)
Mime
  • Unnamed multipart/mixed (inline, None, 0 bytes)
View raw message