zookeeper-dev mailing list archives

Site index · List index
Message view « Date » · « Thread »
Top « Date » · « Thread »
From Apache Jenkins Server <jenk...@builds.apache.org>
Subject ZooKeeper_branch34_jdk7 - Build # 1481 - Failure
Date Sun, 16 Apr 2017 02:41:59 GMT
See https://builds.apache.org/job/ZooKeeper_branch34_jdk7/1481/

###################################################################################
########################## LAST 60 LINES OF THE CONSOLE ###########################
[...truncated 30.70 MB...]
    [junit] 2017-04-16 02:41:56,086 [myid:] - INFO  [main:PrepRequestProcessor@764] - Shutting
down
    [junit] 2017-04-16 02:41:56,086 [myid:] - INFO  [main:SyncRequestProcessor@208] - Shutting
down
    [junit] 2017-04-16 02:41:56,087 [myid:] - INFO  [ProcessThread(sid:0 cport:11221)::PrepRequestProcessor@143]
- PrepRequestProcessor exited loop!
    [junit] 2017-04-16 02:41:56,087 [myid:] - INFO  [SyncThread:0:SyncRequestProcessor@186]
- SyncRequestProcessor exited!
    [junit] 2017-04-16 02:41:56,088 [myid:] - INFO  [main:FinalRequestProcessor@402] - shutdown
of request processor complete
    [junit] 2017-04-16 02:41:56,088 [myid:] - INFO  [main:FourLetterWordMain@62] - connecting
to 127.0.0.1 11221
    [junit] 2017-04-16 02:41:56,089 [myid:] - INFO  [main:JMXEnv@147] - ensureOnly:[]
    [junit] 2017-04-16 02:41:56,091 [myid:] - INFO  [main:ClientBase@445] - STARTING server
    [junit] 2017-04-16 02:41:56,091 [myid:] - INFO  [main:ClientBase@366] - CREATING server
instance 127.0.0.1:11221
    [junit] 2017-04-16 02:41:56,092 [myid:] - INFO  [main:ServerCnxnFactory@111] - Using org.apache.zookeeper.server.NIOServerCnxnFactory
as server connection factory
    [junit] 2017-04-16 02:41:56,092 [myid:] - INFO  [main:NIOServerCnxnFactory@89] - binding
to port 0.0.0.0/0.0.0.0:11221
    [junit] 2017-04-16 02:41:56,092 [myid:] - INFO  [main:ClientBase@341] - STARTING server
instance 127.0.0.1:11221
    [junit] 2017-04-16 02:41:56,093 [myid:] - INFO  [main:ZooKeeperServer@173] - Created server
with tickTime 3000 minSessionTimeout 6000 maxSessionTimeout 60000 datadir /home/jenkins/jenkins-slave/workspace/ZooKeeper_branch34_jdk7/build/test/tmp/test323512773792203062.junit.dir/version-2
snapdir /home/jenkins/jenkins-slave/workspace/ZooKeeper_branch34_jdk7/build/test/tmp/test323512773792203062.junit.dir/version-2
    [junit] 2017-04-16 02:41:56,098 [myid:] - ERROR [main:ZooKeeperServer@472] - ZKShutdownHandler
is not registered, so ZooKeeper server won't take any action on ERROR or SHUTDOWN server state
changes
    [junit] 2017-04-16 02:41:56,098 [myid:] - INFO  [main:FourLetterWordMain@62] - connecting
to 127.0.0.1 11221
    [junit] 2017-04-16 02:41:56,099 [myid:] - INFO  [NIOServerCxn.Factory:0.0.0.0/0.0.0.0:11221:NIOServerCnxnFactory@192]
- Accepted socket connection from /127.0.0.1:41102
    [junit] 2017-04-16 02:41:56,100 [myid:] - INFO  [NIOServerCxn.Factory:0.0.0.0/0.0.0.0:11221:NIOServerCnxn@883]
- Processing stat command from /127.0.0.1:41102
    [junit] 2017-04-16 02:41:56,100 [myid:] - INFO  [Thread-4:NIOServerCnxn$StatCommand@674]
- Stat command output
    [junit] 2017-04-16 02:41:56,101 [myid:] - INFO  [Thread-4:NIOServerCnxn@1044] - Closed
socket connection for client /127.0.0.1:41102 (no session established for client)
    [junit] 2017-04-16 02:41:56,101 [myid:] - INFO  [main:JMXEnv@230] - ensureParent:[InMemoryDataTree,
StandaloneServer_port]
    [junit] 2017-04-16 02:41:56,104 [myid:] - INFO  [main:JMXEnv@247] - expect:InMemoryDataTree
    [junit] 2017-04-16 02:41:56,105 [myid:] - INFO  [main:JMXEnv@251] - found:InMemoryDataTree
org.apache.ZooKeeperService:name0=StandaloneServer_port11221,name1=InMemoryDataTree
    [junit] 2017-04-16 02:41:56,105 [myid:] - INFO  [main:JMXEnv@247] - expect:StandaloneServer_port
    [junit] 2017-04-16 02:41:56,105 [myid:] - INFO  [main:JMXEnv@251] - found:StandaloneServer_port
org.apache.ZooKeeperService:name0=StandaloneServer_port11221
    [junit] 2017-04-16 02:41:56,106 [myid:] - INFO  [main:JUnit4ZKTestRunner$LoggedInvokeMethod@58]
- Memory used 35693
    [junit] 2017-04-16 02:41:56,106 [myid:] - INFO  [main:JUnit4ZKTestRunner$LoggedInvokeMethod@63]
- Number of threads 20
    [junit] 2017-04-16 02:41:56,107 [myid:] - INFO  [main:JUnit4ZKTestRunner$LoggedInvokeMethod@78]
- FINISHED TEST METHOD testQuota
    [junit] 2017-04-16 02:41:56,107 [myid:] - INFO  [main:ClientBase@522] - tearDown starting
    [junit] 2017-04-16 02:41:56,164 [myid:] - INFO  [main:ZooKeeper@684] - Session: 0x15b74a360b40000
closed
    [junit] 2017-04-16 02:41:56,164 [myid:] - INFO  [main:ClientBase@492] - STOPPING server
    [junit] 2017-04-16 02:41:56,165 [myid:] - INFO  [NIOServerCxn.Factory:0.0.0.0/0.0.0.0:11221:NIOServerCnxnFactory@219]
- NIOServerCnxn factory exited run method
    [junit] 2017-04-16 02:41:56,165 [myid:] - INFO  [main-EventThread:ClientCnxn$EventThread@519]
- EventThread shut down for session: 0x15b74a360b40000
    [junit] 2017-04-16 02:41:56,165 [myid:] - INFO  [main:ZooKeeperServer@505] - shutting
down
    [junit] 2017-04-16 02:41:56,165 [myid:] - ERROR [main:ZooKeeperServer@472] - ZKShutdownHandler
is not registered, so ZooKeeper server won't take any action on ERROR or SHUTDOWN server state
changes
    [junit] 2017-04-16 02:41:56,166 [myid:] - INFO  [main:SessionTrackerImpl@225] - Shutting
down
    [junit] 2017-04-16 02:41:56,166 [myid:] - INFO  [main:PrepRequestProcessor@764] - Shutting
down
    [junit] 2017-04-16 02:41:56,166 [myid:] - INFO  [main:SyncRequestProcessor@208] - Shutting
down
    [junit] 2017-04-16 02:41:56,167 [myid:] - INFO  [ProcessThread(sid:0 cport:11221)::PrepRequestProcessor@143]
- PrepRequestProcessor exited loop!
    [junit] 2017-04-16 02:41:56,167 [myid:] - INFO  [SyncThread:0:SyncRequestProcessor@186]
- SyncRequestProcessor exited!
    [junit] 2017-04-16 02:41:56,168 [myid:] - INFO  [main:FinalRequestProcessor@402] - shutdown
of request processor complete
    [junit] 2017-04-16 02:41:56,169 [myid:] - INFO  [main:FourLetterWordMain@62] - connecting
to 127.0.0.1 11221
    [junit] 2017-04-16 02:41:56,169 [myid:] - INFO  [main:JMXEnv@147] - ensureOnly:[]
    [junit] 2017-04-16 02:41:56,176 [myid:] - INFO  [main:ClientBase@547] - fdcount after
test is: 93 at start it was 81
    [junit] 2017-04-16 02:41:56,176 [myid:] - INFO  [main:ClientBase@549] - sleeping for 20
secs
    [junit] 2017-04-16 02:41:56,177 [myid:] - INFO  [main:ZKTestCase$1@69] - SUCCEEDED testQuota
    [junit] 2017-04-16 02:41:56,178 [myid:] - INFO  [main:ZKTestCase$1@64] - FINISHED testQuota
    [junit] Tests run: 1, Failures: 0, Errors: 0, Skipped: 0, Time elapsed: 0.663 sec

fail.build.on.test.failure:

BUILD FAILED
/home/jenkins/jenkins-slave/workspace/ZooKeeper_branch34_jdk7/build.xml:1330: The following
error occurred while executing this line:
/home/jenkins/jenkins-slave/workspace/ZooKeeper_branch34_jdk7/build.xml:1333: Tests failed!

Total time: 29 minutes 13 seconds
Build step 'Invoke Ant' marked build as failure
Recording test results
Email was triggered for: Failure - Any
Sending email for trigger: Failure - Any



###################################################################################
############################## FAILED TESTS (if any) ##############################
1 tests failed.
FAILED:  org.apache.zookeeper.test.FollowerResyncConcurrencyTest.testResyncBySnapThenDiffAfterFollowerCrashes

Error Message:
Forked Java VM exited abnormally. Please note the time in the report does not reflect the
time until the VM exit.

Stack Trace:
junit.framework.AssertionFailedError: Forked Java VM exited abnormally. Please note the time
in the report does not reflect the time until the VM exit.



Mime
  • Unnamed multipart/mixed (inline, None, 0 bytes)
View raw message