zookeeper-dev mailing list archives

Site index · List index
Message view « Date » · « Thread »
Top « Date » · « Thread »
From Apache Jenkins Server <jenk...@builds.apache.org>
Subject ZooKeeper_branch35_openjdk7 - Build # 496 - Still Failing
Date Tue, 18 Apr 2017 00:51:26 GMT
See https://builds.apache.org/job/ZooKeeper_branch35_openjdk7/496/

###################################################################################
########################## LAST 60 LINES OF THE CONSOLE ###########################
[...truncated 68.90 KB...]
    [junit] 2017-04-18 00:50:14,662 [myid:] - INFO  [main:ClientBase@486] - Client test setup
finished
    [junit] Running org.apache.zookeeper.server.CRCTest in thread 3
    [junit] Tests run: 1, Failures: 0, Errors: 1, Skipped: 0, Time elapsed: 0 sec, Thread:
3, Class: org.apache.zookeeper.server.CRCTest
    [junit] Test org.apache.zookeeper.server.CRCTest FAILED (crashed)
    [junit] 2017-04-18 00:50:14,758 [myid:] - INFO  [main:Environment@109] - Client environment:zookeeper.version=3.5.4-beta-SNAPSHOT-0665cb75b9a5257e92aaef0f866da13161cc7591,
built on 04/18/2017 00:49 GMT
    [junit] 2017-04-18 00:50:14,758 [myid:] - INFO  [main:Environment@109] - Client environment:host.name=jenkins-ubuntu1.apache.org
    [junit] 2017-04-18 00:50:14,758 [myid:] - INFO  [main:Environment@109] - Client environment:java.version=1.7.0_79
    [junit] 2017-04-18 00:50:14,758 [myid:] - INFO  [main:Environment@109] - Client environment:java.vendor=Oracle
Corporation
    [junit] 2017-04-18 00:50:14,758 [myid:] - INFO  [main:Environment@109] - Client environment:java.home=/usr/local/asfpackages/java/jdk1.7.0_79-unlimited-security/jre
    [junit] 2017-04-18 00:50:14,759 [myid:] - INFO  [main:Environment@109] - Client environment:java.class.path=/home/jenkins/jenkins-slave/workspace/ZooKeeper_branch35_openjdk7/build/test/classes:/home/jenkins/jenkins-slave/workspace/ZooKeeper_branch35_openjdk7/build/test/lib/antlr-2.7.7.jar:/home/jenkins/jenkins-slave/workspace/ZooKeeper_branch35_openjdk7/build/test/lib/antlr4-runtime-4.5.1-1.jar:/home/jenkins/jenkins-slave/workspace/ZooKeeper_branch35_openjdk7/build/test/lib/checkstyle-6.13.jar:/home/jenkins/jenkins-slave/workspace/ZooKeeper_branch35_openjdk7/build/test/lib/commons-beanutils-1.9.2.jar:/home/jenkins/jenkins-slave/workspace/ZooKeeper_branch35_openjdk7/build/test/lib/commons-cli-1.3.1.jar:/home/jenkins/jenkins-slave/workspace/ZooKeeper_branch35_openjdk7/build/test/lib/commons-collections-3.2.2.jar:/home/jenkins/jenkins-slave/workspace/ZooKeeper_branch35_openjdk7/build/test/lib/commons-lang3-3.4.jar:/home/jenkins/jenkins-slave/workspace/ZooKeeper_branch35_openjdk7/build/test/lib/commons-logging-1.1.1.jar:/home/jenkins/jenkins-slave/workspace/ZooKeeper_branch35_openjdk7/build/test/lib/guava-18.0.jar:/home/jenkins/jenkins-slave/workspace/ZooKeeper_branch35_openjdk7/build/test/lib/hamcrest-core-1.3.jar:/home/jenkins/jenkins-slave/workspace/ZooKeeper_branch35_openjdk7/build/test/lib/junit-4.12.jar:/home/jenkins/jenkins-slave/workspace/ZooKeeper_branch35_openjdk7/build/test/lib/mockito-all-1.8.2.jar:/home/jenkins/jenkins-slave/workspace/ZooKeeper_branch35_openjdk7/build/classes:/home/jenkins/jenkins-slave/workspace/ZooKeeper_branch35_openjdk7/src/java/lib/ivy-2.4.0.jar:/home/jenkins/tools/ant/apache-ant-1.9.9/lib/ant.jar:/home/jenkins/jenkins-slave/workspace/ZooKeeper_branch35_openjdk7/build/lib/commons-cli-1.2.jar:/home/jenkins/jenkins-slave/workspace/ZooKeeper_branch35_openjdk7/build/lib/jackson-core-asl-1.9.11.jar:/home/jenkins/jenkins-slave/workspace/ZooKeeper_branch35_openjdk7/build/lib/jackson-mapper-asl-1.9.11.jar:/home/jenkins/jenkins-slave/workspace/ZooKeeper_branch35_openjdk7/build/lib/javax.servlet-api-3.1.0.jar:/home/jenkins/jenkins-slave/workspace/ZooKeeper_branch35_openjdk7/build/lib/jetty-http-9.2.18.v20160721.jar:/home/jenkins/jenkins-slave/workspace/ZooKeeper_branch35_openjdk7/build/lib/jetty-io-9.2.18.v20160721.jar:/home/jenkins/jenkins-slave/workspace/ZooKeeper_branch35_openjdk7/build/lib/jetty-security-9.2.18.v20160721.jar:/home/jenkins/jenkins-slave/workspace/ZooKeeper_branch35_openjdk7/build/lib/jetty-server-9.2.18.v20160721.jar:/home/jenkins/jenkins-slave/workspace/ZooKeeper_branch35_openjdk7/build/lib/jetty-servlet-9.2.18.v20160721.jar:/home/jenkins/jenkins-slave/workspace/ZooKeeper_branch35_openjdk7/build/lib/jetty-util-9.2.18.v20160721.jar:/home/jenkins/jenkins-slave/workspace/ZooKeeper_branch35_openjdk7/build/lib/jline-2.11.jar:/home/jenkins/jenkins-slave/workspace/ZooKeeper_branch35_openjdk7/build/lib/log4j-1.2.17.jar:/home/jenkins/jenkins-slave/workspace/ZooKeeper_branch35_openjdk7/build/lib/netty-3.10.5.Final.jar:/home/jenkins/jenkins-slave/workspace/ZooKeeper_branch35_openjdk7/build/lib/slf4j-api-1.7.5.jar:/home/jenkins/jenkins-slave/workspace/ZooKeeper_branch35_openjdk7/build/lib/slf4j-log4j12-1.7.5.jar:/usr/local/asfpackages/ant/apache-ant-1.9.9/lib/ant-launcher.jar:/home/jenkins/tools/ant/apache-ant-1.9.9/lib/ant-junit.jar:/home/jenkins/tools/ant/apache-ant-1.9.9/lib/ant-junit4.jar
    [junit] 2017-04-18 00:50:14,759 [myid:] - INFO  [main:Environment@109] - Client environment:java.library.path=/usr/java/packages/lib/amd64:/usr/lib64:/lib64:/lib:/usr/lib
    [junit] 2017-04-18 00:50:14,759 [myid:] - INFO  [main:Environment@109] - Client environment:java.io.tmpdir=/tmp
    [junit] 2017-04-18 00:50:14,759 [myid:] - INFO  [main:Environment@109] - Client environment:java.compiler=<NA>
    [junit] 2017-04-18 00:50:14,764 [myid:] - INFO  [main:Environment@109] - Client environment:os.name=Linux
    [junit] 2017-04-18 00:50:14,765 [myid:] - INFO  [main:Environment@109] - Client environment:os.arch=amd64
    [junit] 2017-04-18 00:50:14,765 [myid:] - INFO  [main:Environment@109] - Client environment:os.version=3.19.0-25-generic
    [junit] 2017-04-18 00:50:14,765 [myid:] - INFO  [main:Environment@109] - Client environment:user.name=jenkins
    [junit] 2017-04-18 00:50:14,766 [myid:] - INFO  [main:Environment@109] - Client environment:user.home=/home/jenkins
    [junit] 2017-04-18 00:50:14,766 [myid:] - INFO  [main:Environment@109] - Client environment:user.dir=/home/jenkins/jenkins-slave/workspace/ZooKeeper_branch35_openjdk7/build/test
    [junit] 2017-04-18 00:50:14,766 [myid:] - INFO  [main:Environment@109] - Client environment:os.memory.free=227MB
    [junit] 2017-04-18 00:50:14,766 [myid:] - INFO  [main:Environment@109] - Client environment:os.memory.max=455MB
    [junit] 2017-04-18 00:50:14,766 [myid:] - INFO  [main:Environment@109] - Client environment:os.memory.total=240MB
    [junit] 2017-04-18 00:50:14,792 [myid:] - INFO  [main:ZooKeeper@865] - Initiating client
connection, connectString=127.0.0.1:30073 sessionTimeout=30000 watcher=org.apache.zookeeper.test.ClientBase$CountdownWatcher@66894750
    [junit] 2017-04-18 00:50:14,814 [myid:] - INFO  [main:ClientCnxnSocket@236] - jute.maxbuffer
value is 4194304 Bytes
    [junit] Tests run: 3, Failures: 0, Errors: 0, Skipped: 0, Time elapsed: 0.658 sec, Thread:
4, Class: org.apache.zookeeper.ServerConfigTest
    [junit] 2017-04-18 00:50:29,359 [myid:127.0.0.1:30073] - INFO  [main-SendThread(127.0.0.1:30073):ClientCnxn$SendThread@1113]
- Opening socket connection to server 127.0.0.1/127.0.0.1:30073. Will not attempt to authenticate
using SASL (unknown error)
    [junit] 2017-04-18 00:50:42,238 [myid:] - INFO  [NIOServerCxnFactory.AcceptThread:0.0.0.0/0.0.0.0:30073:NIOServerCnxnFactory$AcceptThread@296]
- Accepted socket connection from /127.0.0.1:56158
    [junit] 2017-04-18 00:50:14,996 [myid:] - INFO  [main:JUnit4ZKTestRunner@47] - No test.method
specified. using default methods.
    [junit] Running org.apache.zookeeper.common.PathUtilsTest in thread 2
    [junit] 2017-04-18 00:50:15,296 [myid:] - INFO  [main:JUnit4ZKTestRunner@47] - No test.method
specified. using default methods.
    [junit] Running org.apache.zookeeper.ZooKeeperTest in thread 6
    [junit] 2017-04-18 00:50:59,397 [myid:127.0.0.1:30073] - INFO  [main-SendThread(127.0.0.1:30073):ClientCnxn$SendThread@948]
- Socket connection established, initiating session, client: /127.0.0.1:56158, server: 127.0.0.1/127.0.0.1:30073
    [junit] 2017-04-18 00:50:59,427 [myid:] - INFO  [main:ClientBase@567] - tearDown starting
    [junit] 2017-04-18 00:50:59,428 [myid:] - INFO  [main:ClientBase@537] - STOPPING server
    [junit] 2017-04-18 00:51:00,297 [myid:] - INFO  [NIOServerCxnFactory.SelectorThread-0:NIOServerCnxn@627]
- Closed socket connection for client /127.0.0.1:56158 (no session established for client)
    [junit] 2017-04-18 00:51:00,298 [myid:] - INFO  [NIOServerCxnFactory.SelectorThread-0:NIOServerCnxnFactory$SelectorThread@420]
- selector thread exitted run method
    [junit] 2017-04-18 00:51:00,315 [myid:] - INFO  [ConnnectionExpirer:NIOServerCnxnFactory$ConnectionExpirerThread@583]
- ConnnectionExpirerThread interrupted
    [junit] 2017-04-18 00:51:00,326 [myid:] - INFO  [NIOServerCxnFactory.AcceptThread:0.0.0.0/0.0.0.0:30073:NIOServerCnxnFactory$AcceptThread@219]
- accept thread exitted run method
    [junit] 2017-04-18 00:51:00,456 [myid:] - INFO  [main:ZooKeeperServer@541] - shutting
down
    [junit] 2017-04-18 00:51:00,615 [myid:] - ERROR [main:ZooKeeperServer@505] - ZKShutdownHandler
is not registered, so ZooKeeper server won't take any action on ERROR or SHUTDOWN server state
changes
    [junit] 2017-04-18 00:51:00,615 [myid:] - INFO  [main:SessionTrackerImpl@232] - Shutting
down
    [junit] 2017-04-18 00:51:00,616 [myid:] - INFO  [main:PrepRequestProcessor@1004] - Shutting
down
    [junit] 2017-04-18 00:51:00,682 [myid:] - INFO  [main:SyncRequestProcessor@191] - Shutting
down
    [junit] 2017-04-18 00:51:00,727 [myid:] - INFO  [SyncThread:0:SyncRequestProcessor@169]
- SyncRequestProcessor exited!
    [junit] 2017-04-18 00:51:00,728 [myid:] - INFO  [ProcessThread(sid:0 cport:30073)::PrepRequestProcessor@156]
- PrepRequestProcessor exited loop!
    [junit] 2017-04-18 00:51:00,747 [myid:] - INFO  [main:FinalRequestProcessor@481] - shutdown
of request processor complete
    [junit] 2017-04-18 00:51:00,749 [myid:] - INFO  [main:MBeanRegistry@128] - Unregister
MBean [org.apache.ZooKeeperService:name0=StandaloneServer_port30073,name1=InMemoryDataTree]
    [junit] 2017-04-18 00:51:00,751 [myid:] - INFO  [main:MBeanRegistry@128] - Unregister
MBean [org.apache.ZooKeeperService:name0=StandaloneServer_port30073]
    [junit] 2017-04-18 00:51:00,997 [myid:] - INFO  [main:FourLetterWordMain@85] - connecting
to 127.0.0.1 30073
Java HotSpot(TM) 64-Bit Server VM warning: INFO: os::commit_memory(0x00000007c0100000, 253755392,
0) failed; error='Cannot allocate memory' (errno=12)
#
# There is insufficient memory for the Java Runtime Environment to continue.
# Native memory allocation (malloc) failed to allocate 253755392 bytes for committing reserved
memory.
# An error report file with more information is saved as:
# /home/jenkins/jenkins-slave/workspace/ZooKeeper_branch35_openjdk7/hs_err_pid21237.log
Build step 'Invoke Ant' marked build as failure
Recording test results
Email was triggered for: Failure - Any
Sending email for trigger: Failure - Any



###################################################################################
############################## FAILED TESTS (if any) ##############################
6 tests failed.
FAILED:  org.apache.zookeeper.RemoveWatchesTest.unknown

Error Message:
Forked Java VM exited abnormally. Please note the time in the report does not reflect the
time until the VM exit.

Stack Trace:
junit.framework.AssertionFailedError: Forked Java VM exited abnormally. Please note the time
in the report does not reflect the time until the VM exit.
	at java.lang.Thread.run(Thread.java:745)


FAILED:  org.apache.zookeeper.ZooKeeperTestableTest.unknown

Error Message:
Forked Java VM exited abnormally. Please note the time in the report does not reflect the
time until the VM exit.

Stack Trace:
junit.framework.AssertionFailedError: Forked Java VM exited abnormally. Please note the time
in the report does not reflect the time until the VM exit.
	at java.lang.Thread.run(Thread.java:745)


FAILED:  org.apache.zookeeper.client.ZKClientConfigTest.testSetConfiguration

Error Message:
test timed out after 10 seconds

Stack Trace:
org.junit.runners.model.TestTimedOutException: test timed out after 10 seconds
	at java.util.zip.ZipFile.getEntry(Native Method)
	at java.util.zip.ZipFile.getEntry(ZipFile.java:306)
	at java.util.jar.JarFile.getEntry(JarFile.java:227)
	at java.util.jar.JarFile.getJarEntry(JarFile.java:210)
	at sun.misc.URLClassPath$JarLoader.getResource(URLClassPath.java:840)
	at sun.misc.URLClassPath.getResource(URLClassPath.java:199)
	at java.net.URLClassLoader$1.run(URLClassLoader.java:358)
	at java.net.URLClassLoader$1.run(URLClassLoader.java:355)
	at java.security.AccessController.doPrivileged(Native Method)
	at java.net.URLClassLoader.findClass(URLClassLoader.java:354)
	at java.lang.ClassLoader.loadClass(ClassLoader.java:425)
	at sun.misc.Launcher$AppClassLoader.loadClass(Launcher.java:308)
	at java.lang.ClassLoader.loadClass(ClassLoader.java:358)
	at org.slf4j.impl.Log4jLoggerFactory.getLogger(Log4jLoggerFactory.java:66)
	at org.slf4j.LoggerFactory.getLogger(LoggerFactory.java:270)
	at org.slf4j.LoggerFactory.getLogger(LoggerFactory.java:281)
	at org.apache.zookeeper.common.ZKConfig.<clinit>(ZKConfig.java:44)
	at org.apache.zookeeper.client.ZKClientConfigTest.testSetConfiguration(ZKClientConfigTest.java:146)
	at java.util.concurrent.FutureTask.run(FutureTask.java:262)
	at java.lang.Thread.run(Thread.java:745)


FAILED:  org.apache.zookeeper.common.AtomicFileWritingIdiomTest.unknown

Error Message:
Forked Java VM exited abnormally. Please note the time in the report does not reflect the
time until the VM exit.

Stack Trace:
junit.framework.AssertionFailedError: Forked Java VM exited abnormally. Please note the time
in the report does not reflect the time until the VM exit.
	at java.lang.Thread.run(Thread.java:745)


FAILED:  org.apache.zookeeper.server.ByteBufferInputStreamTest.unknown

Error Message:
Forked Java VM exited abnormally. Please note the time in the report does not reflect the
time until the VM exit.

Stack Trace:
junit.framework.AssertionFailedError: Forked Java VM exited abnormally. Please note the time
in the report does not reflect the time until the VM exit.
	at java.lang.Thread.run(Thread.java:745)


FAILED:  org.apache.zookeeper.server.CRCTest.unknown

Error Message:
Forked Java VM exited abnormally. Please note the time in the report does not reflect the
time until the VM exit.

Stack Trace:
junit.framework.AssertionFailedError: Forked Java VM exited abnormally. Please note the time
in the report does not reflect the time until the VM exit.
	at java.lang.Thread.run(Thread.java:745)
Mime
  • Unnamed multipart/mixed (inline, None, 0 bytes)
View raw message