zookeeper-dev mailing list archives

Site index · List index
Message view « Date » · « Thread »
Top « Date » · « Thread »
From Apache Jenkins Server <jenk...@builds.apache.org>
Subject ZooKeeper_branch35_jdk7 - Build # 920 - Failure
Date Mon, 10 Apr 2017 08:51:21 GMT
See https://builds.apache.org/job/ZooKeeper_branch35_jdk7/920/

###################################################################################
########################## LAST 60 LINES OF THE CONSOLE ###########################
[...truncated 62.14 MB...]
    [junit] 2017-04-10 08:50:46,385 [myid:127.0.0.1:16737] - INFO  [main-SendThread(127.0.0.1:16737):ClientCnxn$SendThread@1113]
- Opening socket connection to server 127.0.0.1/127.0.0.1:16737. Will not attempt to authenticate
using SASL (unknown error)
    [junit] 2017-04-10 08:50:46,385 [myid:127.0.0.1:16737] - WARN  [main-SendThread(127.0.0.1:16737):ClientCnxn$SendThread@1235]
- Session 0x3001432cd6e0000 for server 127.0.0.1/127.0.0.1:16737, unexpected error, closing
socket connection and attempting reconnect
    [junit] java.net.ConnectException: Connection refused
    [junit] 	at sun.nio.ch.SocketChannelImpl.checkConnect(Native Method)
    [junit] 	at sun.nio.ch.SocketChannelImpl.finishConnect(SocketChannelImpl.java:744)
    [junit] 	at org.apache.zookeeper.ClientCnxnSocketNIO.doTransport(ClientCnxnSocketNIO.java:357)
    [junit] 	at org.apache.zookeeper.ClientCnxn$SendThread.run(ClientCnxn.java:1214)
    [junit] 2017-04-10 08:50:46,395 [myid:127.0.0.1:16608] - INFO  [main-SendThread(127.0.0.1:16608):ClientCnxn$SendThread@1113]
- Opening socket connection to server 127.0.0.1/127.0.0.1:16608. Will not attempt to authenticate
using SASL (unknown error)
    [junit] 2017-04-10 08:50:46,396 [myid:127.0.0.1:16608] - WARN  [main-SendThread(127.0.0.1:16608):ClientCnxn$SendThread@1235]
- Session 0x100142e8ee50000 for server 127.0.0.1/127.0.0.1:16608, unexpected error, closing
socket connection and attempting reconnect
    [junit] java.net.ConnectException: Connection refused
    [junit] 	at sun.nio.ch.SocketChannelImpl.checkConnect(Native Method)
    [junit] 	at sun.nio.ch.SocketChannelImpl.finishConnect(SocketChannelImpl.java:744)
    [junit] 	at org.apache.zookeeper.ClientCnxnSocketNIO.doTransport(ClientCnxnSocketNIO.java:357)
    [junit] 	at org.apache.zookeeper.ClientCnxn$SendThread.run(ClientCnxn.java:1214)
    [junit] 2017-04-10 08:50:46,479 [myid:127.0.0.1:16731] - INFO  [main-SendThread(127.0.0.1:16731):ClientCnxn$SendThread@1113]
- Opening socket connection to server 127.0.0.1/127.0.0.1:16731. Will not attempt to authenticate
using SASL (unknown error)
    [junit] 2017-04-10 08:50:46,479 [myid:127.0.0.1:16731] - WARN  [main-SendThread(127.0.0.1:16731):ClientCnxn$SendThread@1235]
- Session 0x1001432cd620000 for server 127.0.0.1/127.0.0.1:16731, unexpected error, closing
socket connection and attempting reconnect
    [junit] java.net.ConnectException: Connection refused
    [junit] 	at sun.nio.ch.SocketChannelImpl.checkConnect(Native Method)
    [junit] 	at sun.nio.ch.SocketChannelImpl.finishConnect(SocketChannelImpl.java:744)
    [junit] 	at org.apache.zookeeper.ClientCnxnSocketNIO.doTransport(ClientCnxnSocketNIO.java:357)
    [junit] 	at org.apache.zookeeper.ClientCnxn$SendThread.run(ClientCnxn.java:1214)
    [junit] 2017-04-10 08:50:46,706 [myid:] - INFO  [ProcessThread(sid:0 cport:16854)::PrepRequestProcessor@613]
- Processed session termination for sessionid: 0x1001435fb850000
    [junit] 2017-04-10 08:50:46,709 [myid:] - INFO  [main:ZooKeeper@1326] - Session: 0x1001435fb850000
closed
    [junit] 2017-04-10 08:50:46,709 [myid:] - INFO  [main-EventThread:ClientCnxn$EventThread@513]
- EventThread shut down for session: 0x1001435fb850000
    [junit] 2017-04-10 08:50:46,709 [myid:] - INFO  [SyncThread:0:MBeanRegistry@128] - Unregister
MBean [org.apache.ZooKeeperService:name0=StandaloneServer_port16854,name1=Connections,name2=127.0.0.1,name3=0x1001435fb850000]
    [junit] 2017-04-10 08:50:46,709 [myid:] - INFO  [main:JUnit4ZKTestRunner$LoggedInvokeMethod@82]
- Memory used 79980
    [junit] 2017-04-10 08:50:46,710 [myid:] - INFO  [main:JUnit4ZKTestRunner$LoggedInvokeMethod@87]
- Number of threads 859
    [junit] 2017-04-10 08:50:46,710 [myid:] - INFO  [main:JUnit4ZKTestRunner$LoggedInvokeMethod@102]
- FINISHED TEST METHOD testWatcherAutoResetWithLocal
    [junit] 2017-04-10 08:50:46,710 [myid:] - INFO  [main:ClientBase@543] - tearDown starting
    [junit] 2017-04-10 08:50:46,710 [myid:] - INFO  [main:ClientBase@513] - STOPPING server
    [junit] 2017-04-10 08:50:46,710 [myid:] - INFO  [main:NettyServerCnxnFactory@464] - shutdown
called 0.0.0.0/0.0.0.0:16854
    [junit] 2017-04-10 08:50:46,713 [myid:] - INFO  [main:ZooKeeperServer@541] - shutting
down
    [junit] 2017-04-10 08:50:46,713 [myid:] - ERROR [main:ZooKeeperServer@505] - ZKShutdownHandler
is not registered, so ZooKeeper server won't take any action on ERROR or SHUTDOWN server state
changes
    [junit] 2017-04-10 08:50:46,714 [myid:] - INFO  [main:SessionTrackerImpl@232] - Shutting
down
    [junit] 2017-04-10 08:50:46,714 [myid:] - INFO  [main:PrepRequestProcessor@1004] - Shutting
down
    [junit] 2017-04-10 08:50:46,714 [myid:] - INFO  [main:SyncRequestProcessor@191] - Shutting
down
    [junit] 2017-04-10 08:50:46,714 [myid:] - INFO  [ProcessThread(sid:0 cport:16854)::PrepRequestProcessor@156]
- PrepRequestProcessor exited loop!
    [junit] 2017-04-10 08:50:46,714 [myid:] - INFO  [SyncThread:0:SyncRequestProcessor@169]
- SyncRequestProcessor exited!
    [junit] 2017-04-10 08:50:46,714 [myid:] - INFO  [main:FinalRequestProcessor@481] - shutdown
of request processor complete
    [junit] 2017-04-10 08:50:46,715 [myid:] - INFO  [main:MBeanRegistry@128] - Unregister
MBean [org.apache.ZooKeeperService:name0=StandaloneServer_port16854,name1=InMemoryDataTree]
    [junit] 2017-04-10 08:50:46,715 [myid:] - INFO  [main:MBeanRegistry@128] - Unregister
MBean [org.apache.ZooKeeperService:name0=StandaloneServer_port16854]
    [junit] 2017-04-10 08:50:46,715 [myid:] - INFO  [main:FourLetterWordMain@85] - connecting
to 127.0.0.1 16854
    [junit] 2017-04-10 08:50:46,716 [myid:] - INFO  [main:JMXEnv@146] - ensureOnly:[]
    [junit] 2017-04-10 08:50:46,723 [myid:] - INFO  [main:ClientBase@568] - fdcount after
test is: 2537 at start it was 2541
    [junit] 2017-04-10 08:50:46,723 [myid:] - INFO  [main:ZKTestCase$1@68] - SUCCEEDED testWatcherAutoResetWithLocal
    [junit] 2017-04-10 08:50:46,723 [myid:] - INFO  [main:ZKTestCase$1@63] - FINISHED testWatcherAutoResetWithLocal
    [junit] Tests run: 103, Failures: 0, Errors: 0, Skipped: 0, Time elapsed: 493.743 sec,
Thread: 3, Class: org.apache.zookeeper.test.NioNettySuiteTest

fail.build.on.test.failure:

BUILD FAILED
/home/jenkins/jenkins-slave/workspace/ZooKeeper_branch35_jdk7/build.xml:1219: The following
error occurred while executing this line:
/home/jenkins/jenkins-slave/workspace/ZooKeeper_branch35_jdk7/build.xml:1223: Tests failed!

Total time: 12 minutes 29 seconds
Build step 'Invoke Ant' marked build as failure
Recording test results
Email was triggered for: Failure - Any
Sending email for trigger: Failure - Any



###################################################################################
############################## FAILED TESTS (if any) ##############################
1 tests failed.
FAILED:  org.apache.zookeeper.server.quorum.ReconfigDuringLeaderSyncTest.testDuringLeaderSync

Error Message:
zoo.cfg.dynamic.next is not deleted.

Stack Trace:
junit.framework.AssertionFailedError: zoo.cfg.dynamic.next is not deleted.
	at org.apache.zookeeper.server.quorum.ReconfigDuringLeaderSyncTest.testDuringLeaderSync(ReconfigDuringLeaderSyncTest.java:165)
	at org.apache.zookeeper.JUnit4ZKTestRunner$LoggedInvokeMethod.evaluate(JUnit4ZKTestRunner.java:79)



Mime
  • Unnamed multipart/mixed (inline, None, 0 bytes)
View raw message