zookeeper-dev mailing list archives

Site index · List index
Message view « Date » · « Thread »
Top « Date » · « Thread »
From Apache Jenkins Server <jenk...@builds.apache.org>
Subject ZooKeeper_branch35_openjdk7 - Build # 486 - Still Failing
Date Sun, 09 Apr 2017 10:08:51 GMT
See https://builds.apache.org/job/ZooKeeper_branch35_openjdk7/486/

###################################################################################
########################## LAST 60 LINES OF THE CONSOLE ###########################
[...truncated 62.30 MB...]
    [junit] 	at sun.nio.ch.SocketChannelImpl.checkConnect(Native Method)
    [junit] 	at sun.nio.ch.SocketChannelImpl.finishConnect(SocketChannelImpl.java:739)
    [junit] 	at org.jboss.netty.channel.socket.nio.NioClientBoss.connect(NioClientBoss.java:152)
    [junit] 	at org.jboss.netty.channel.socket.nio.NioClientBoss.processSelectedKeys(NioClientBoss.java:105)
    [junit] 	at org.jboss.netty.channel.socket.nio.NioClientBoss.process(NioClientBoss.java:79)
    [junit] 	at org.jboss.netty.channel.socket.nio.AbstractNioSelector.run(AbstractNioSelector.java:337)
    [junit] 	at org.jboss.netty.channel.socket.nio.NioClientBoss.run(NioClientBoss.java:42)
    [junit] 	at org.jboss.netty.util.ThreadRenamingRunnable.run(ThreadRenamingRunnable.java:108)
    [junit] 	at org.jboss.netty.util.internal.DeadLockProofWorker$1.run(DeadLockProofWorker.java:42)
    [junit] 	at java.util.concurrent.ThreadPoolExecutor.runWorker(ThreadPoolExecutor.java:1145)
    [junit] 	at java.util.concurrent.ThreadPoolExecutor$Worker.run(ThreadPoolExecutor.java:615)
    [junit] 	at java.lang.Thread.run(Thread.java:745)
    [junit] 2017-04-09 10:08:31,063 [myid:] - INFO  [New I/O boss #2763:ClientCnxnSocketNetty@208]
- channel is told closing
    [junit] 2017-04-09 10:08:31,063 [myid:127.0.0.1:30196] - INFO  [main-SendThread(127.0.0.1:30196):ClientCnxn$SendThread@1231]
- channel for sessionid 0x1004128e4690000 is lost, closing socket connection and attempting
reconnect
    [junit] 2017-04-09 10:08:31,092 [myid:] - INFO  [SessionTracker:SessionTrackerImpl@158]
- SessionTrackerImpl exited loop!
    [junit] 2017-04-09 10:08:31,092 [myid:] - INFO  [SessionTracker:SessionTrackerImpl@158]
- SessionTrackerImpl exited loop!
    [junit] 2017-04-09 10:08:31,205 [myid:127.0.0.1:30073] - INFO  [main-SendThread(127.0.0.1:30073):ClientCnxn$SendThread@1113]
- Opening socket connection to server 127.0.0.1/127.0.0.1:30073. Will not attempt to authenticate
using SASL (unknown error)
    [junit] 2017-04-09 10:08:31,207 [myid:] - INFO  [New I/O boss #18:ClientCnxnSocketNetty$1@127]
- future isn't success, cause: {}
    [junit] java.net.ConnectException: Connection refused: 127.0.0.1/127.0.0.1:30073
    [junit] 	at sun.nio.ch.SocketChannelImpl.checkConnect(Native Method)
    [junit] 	at sun.nio.ch.SocketChannelImpl.finishConnect(SocketChannelImpl.java:739)
    [junit] 	at org.jboss.netty.channel.socket.nio.NioClientBoss.connect(NioClientBoss.java:152)
    [junit] 	at org.jboss.netty.channel.socket.nio.NioClientBoss.processSelectedKeys(NioClientBoss.java:105)
    [junit] 	at org.jboss.netty.channel.socket.nio.NioClientBoss.process(NioClientBoss.java:79)
    [junit] 	at org.jboss.netty.channel.socket.nio.AbstractNioSelector.run(AbstractNioSelector.java:337)
    [junit] 	at org.jboss.netty.channel.socket.nio.NioClientBoss.run(NioClientBoss.java:42)
    [junit] 	at org.jboss.netty.util.ThreadRenamingRunnable.run(ThreadRenamingRunnable.java:108)
    [junit] 	at org.jboss.netty.util.internal.DeadLockProofWorker$1.run(DeadLockProofWorker.java:42)
    [junit] 	at java.util.concurrent.ThreadPoolExecutor.runWorker(ThreadPoolExecutor.java:1145)
    [junit] 	at java.util.concurrent.ThreadPoolExecutor$Worker.run(ThreadPoolExecutor.java:615)
    [junit] 	at java.lang.Thread.run(Thread.java:745)
    [junit] 2017-04-09 10:08:31,207 [myid:] - WARN  [New I/O boss #18:ClientCnxnSocketNetty$ZKClientHandler@439]
- Exception caught: [id: 0x2daabab9] EXCEPTION: java.net.ConnectException: Connection refused:
127.0.0.1/127.0.0.1:30073
    [junit] java.net.ConnectException: Connection refused: 127.0.0.1/127.0.0.1:30073
    [junit] 	at sun.nio.ch.SocketChannelImpl.checkConnect(Native Method)
    [junit] 	at sun.nio.ch.SocketChannelImpl.finishConnect(SocketChannelImpl.java:739)
    [junit] 	at org.jboss.netty.channel.socket.nio.NioClientBoss.connect(NioClientBoss.java:152)
    [junit] 	at org.jboss.netty.channel.socket.nio.NioClientBoss.processSelectedKeys(NioClientBoss.java:105)
    [junit] 	at org.jboss.netty.channel.socket.nio.NioClientBoss.process(NioClientBoss.java:79)
    [junit] 	at org.jboss.netty.channel.socket.nio.AbstractNioSelector.run(AbstractNioSelector.java:337)
    [junit] 	at org.jboss.netty.channel.socket.nio.NioClientBoss.run(NioClientBoss.java:42)
    [junit] 	at org.jboss.netty.util.ThreadRenamingRunnable.run(ThreadRenamingRunnable.java:108)
    [junit] 	at org.jboss.netty.util.internal.DeadLockProofWorker$1.run(DeadLockProofWorker.java:42)
    [junit] 	at java.util.concurrent.ThreadPoolExecutor.runWorker(ThreadPoolExecutor.java:1145)
    [junit] 	at java.util.concurrent.ThreadPoolExecutor$Worker.run(ThreadPoolExecutor.java:615)
    [junit] 	at java.lang.Thread.run(Thread.java:745)
    [junit] 2017-04-09 10:08:31,207 [myid:] - INFO  [New I/O boss #18:ClientCnxnSocketNetty@208]
- channel is told closing
    [junit] 2017-04-09 10:08:31,207 [myid:127.0.0.1:30073] - INFO  [main-SendThread(127.0.0.1:30073):ClientCnxn$SendThread@1231]
- channel for sessionid 0x10041250cdc0000 is lost, closing socket connection and attempting
reconnect

fail.build.on.test.failure:

BUILD FAILED
/home/jenkins/jenkins-slave/workspace/ZooKeeper_branch35_openjdk7/build.xml:1219: The following
error occurred while executing this line:
/home/jenkins/jenkins-slave/workspace/ZooKeeper_branch35_openjdk7/build.xml:1223: Tests failed!

Total time: 11 minutes 39 seconds
Build step 'Invoke Ant' marked build as failure
Recording test results
Email was triggered for: Failure - Any
Sending email for trigger: Failure - Any



###################################################################################
############################## FAILED TESTS (if any) ##############################
1 tests failed.
FAILED:  org.apache.zookeeper.test.ReconfigTest.testPortChange

Error Message:
null

Stack Trace:
junit.framework.AssertionFailedError
	at org.apache.zookeeper.test.ReconfigTest.testPortChange(ReconfigTest.java:681)
	at org.apache.zookeeper.JUnit4ZKTestRunner$LoggedInvokeMethod.evaluate(JUnit4ZKTestRunner.java:79)



Mime
  • Unnamed multipart/mixed (inline, None, 0 bytes)
View raw message