zookeeper-dev mailing list archives

Site index · List index
Message view « Date » · « Thread »
Top « Date » · « Thread »
From Apache Jenkins Server <jenk...@builds.apache.org>
Subject ZooKeeper_branch35_jdk7 - Build # 942 - Failure
Date Fri, 28 Apr 2017 08:51:04 GMT
See https://builds.apache.org/job/ZooKeeper_branch35_jdk7/942/

###################################################################################
########################## LAST 60 LINES OF THE CONSOLE ###########################
[...truncated 64.89 MB...]
    [junit] 	at sun.nio.ch.SocketChannelImpl.checkConnect(Native Method)
    [junit] 	at sun.nio.ch.SocketChannelImpl.finishConnect(SocketChannelImpl.java:744)
    [junit] 	at org.apache.zookeeper.ClientCnxnSocketNIO.doTransport(ClientCnxnSocketNIO.java:357)
    [junit] 	at org.apache.zookeeper.ClientCnxn$SendThread.run(ClientCnxn.java:1214)
    [junit] 2017-04-28 08:50:31,087 [myid:127.0.0.1:22117] - INFO  [main-SendThread(127.0.0.1:22117):ClientCnxn$SendThread@1113]
- Opening socket connection to server 127.0.0.1/127.0.0.1:22117. Will not attempt to authenticate
using SASL (unknown error)
    [junit] 2017-04-28 08:50:31,087 [myid:127.0.0.1:22117] - WARN  [main-SendThread(127.0.0.1:22117):ClientCnxn$SendThread@1235]
- Session 0x1032d2f523d0000 for server 127.0.0.1/127.0.0.1:22117, unexpected error, closing
socket connection and attempting reconnect
    [junit] java.net.ConnectException: Connection refused
    [junit] 	at sun.nio.ch.SocketChannelImpl.checkConnect(Native Method)
    [junit] 	at sun.nio.ch.SocketChannelImpl.finishConnect(SocketChannelImpl.java:744)
    [junit] 	at org.apache.zookeeper.ClientCnxnSocketNIO.doTransport(ClientCnxnSocketNIO.java:357)
    [junit] 	at org.apache.zookeeper.ClientCnxn$SendThread.run(ClientCnxn.java:1214)
    [junit] 2017-04-28 08:50:31,308 [myid:127.0.0.1:21994] - INFO  [main-SendThread(127.0.0.1:21994):ClientCnxn$SendThread@1113]
- Opening socket connection to server 127.0.0.1/127.0.0.1:21994. Will not attempt to authenticate
using SASL (unknown error)
    [junit] 2017-04-28 08:50:31,309 [myid:127.0.0.1:21994] - WARN  [main-SendThread(127.0.0.1:21994):ClientCnxn$SendThread@1235]
- Session 0x1032d2b45d40000 for server 127.0.0.1/127.0.0.1:21994, unexpected error, closing
socket connection and attempting reconnect
    [junit] java.net.ConnectException: Connection refused
    [junit] 	at sun.nio.ch.SocketChannelImpl.checkConnect(Native Method)
    [junit] 	at sun.nio.ch.SocketChannelImpl.finishConnect(SocketChannelImpl.java:744)
    [junit] 	at org.apache.zookeeper.ClientCnxnSocketNIO.doTransport(ClientCnxnSocketNIO.java:357)
    [junit] 	at org.apache.zookeeper.ClientCnxn$SendThread.run(ClientCnxn.java:1214)
    [junit] 2017-04-28 08:50:31,769 [myid:] - INFO  [ProcessThread(sid:0 cport:22240)::PrepRequestProcessor@613]
- Processed session termination for sessionid: 0x1032d3299430000
    [junit] 2017-04-28 08:50:31,772 [myid:] - INFO  [SyncThread:0:MBeanRegistry@128] - Unregister
MBean [org.apache.ZooKeeperService:name0=StandaloneServer_port22240,name1=Connections,name2=127.0.0.1,name3=0x1032d3299430000]
    [junit] 2017-04-28 08:50:31,772 [myid:] - INFO  [main:ZooKeeper@1326] - Session: 0x1032d3299430000
closed
    [junit] 2017-04-28 08:50:31,773 [myid:] - INFO  [main:JUnit4ZKTestRunner$LoggedInvokeMethod@82]
- Memory used 148347
    [junit] 2017-04-28 08:50:31,773 [myid:] - INFO  [main:JUnit4ZKTestRunner$LoggedInvokeMethod@87]
- Number of threads 861
    [junit] 2017-04-28 08:50:31,773 [myid:] - INFO  [main:JUnit4ZKTestRunner$LoggedInvokeMethod@102]
- FINISHED TEST METHOD testWatcherAutoResetWithLocal
    [junit] 2017-04-28 08:50:31,773 [myid:] - INFO  [main:ClientBase@567] - tearDown starting
    [junit] 2017-04-28 08:50:31,773 [myid:] - INFO  [main:ClientBase@537] - STOPPING server
    [junit] 2017-04-28 08:50:31,773 [myid:] - INFO  [main:NettyServerCnxnFactory@464] - shutdown
called 0.0.0.0/0.0.0.0:22240
    [junit] 2017-04-28 08:50:31,772 [myid:] - INFO  [main-EventThread:ClientCnxn$EventThread@513]
- EventThread shut down for session: 0x1032d3299430000
    [junit] 2017-04-28 08:50:31,776 [myid:] - INFO  [main:ZooKeeperServer@541] - shutting
down
    [junit] 2017-04-28 08:50:31,777 [myid:] - ERROR [main:ZooKeeperServer@505] - ZKShutdownHandler
is not registered, so ZooKeeper server won't take any action on ERROR or SHUTDOWN server state
changes
    [junit] 2017-04-28 08:50:31,777 [myid:] - INFO  [main:SessionTrackerImpl@232] - Shutting
down
    [junit] 2017-04-28 08:50:31,777 [myid:] - INFO  [main:PrepRequestProcessor@1004] - Shutting
down
    [junit] 2017-04-28 08:50:31,777 [myid:] - INFO  [main:SyncRequestProcessor@191] - Shutting
down
    [junit] 2017-04-28 08:50:31,777 [myid:] - INFO  [ProcessThread(sid:0 cport:22240)::PrepRequestProcessor@156]
- PrepRequestProcessor exited loop!
    [junit] 2017-04-28 08:50:31,777 [myid:] - INFO  [SyncThread:0:SyncRequestProcessor@169]
- SyncRequestProcessor exited!
    [junit] 2017-04-28 08:50:31,778 [myid:] - INFO  [main:FinalRequestProcessor@481] - shutdown
of request processor complete
    [junit] 2017-04-28 08:50:31,778 [myid:] - INFO  [main:MBeanRegistry@128] - Unregister
MBean [org.apache.ZooKeeperService:name0=StandaloneServer_port22240,name1=InMemoryDataTree]
    [junit] 2017-04-28 08:50:31,778 [myid:] - INFO  [main:MBeanRegistry@128] - Unregister
MBean [org.apache.ZooKeeperService:name0=StandaloneServer_port22240]
    [junit] 2017-04-28 08:50:31,778 [myid:] - INFO  [main:FourLetterWordMain@85] - connecting
to 127.0.0.1 22240
    [junit] 2017-04-28 08:50:31,779 [myid:] - INFO  [main:JMXEnv@146] - ensureOnly:[]
    [junit] 2017-04-28 08:50:31,784 [myid:] - INFO  [main:ClientBase@592] - fdcount after
test is: 2535 at start it was 2531
    [junit] 2017-04-28 08:50:31,785 [myid:] - INFO  [main:ClientBase@594] - sleeping for 20
secs
    [junit] 2017-04-28 08:50:31,785 [myid:] - INFO  [main:ZKTestCase$1@68] - SUCCEEDED testWatcherAutoResetWithLocal
    [junit] 2017-04-28 08:50:31,785 [myid:] - INFO  [main:ZKTestCase$1@63] - FINISHED testWatcherAutoResetWithLocal
    [junit] Tests run: 103, Failures: 0, Errors: 0, Skipped: 0, Time elapsed: 487.683 sec,
Thread: 5, Class: org.apache.zookeeper.test.NioNettySuiteTest
    [junit] 2017-04-28 08:50:31,914 [myid:] - INFO  [SessionTracker:SessionTrackerImpl@158]
- SessionTrackerImpl exited loop!
    [junit] 2017-04-28 08:50:31,914 [myid:] - INFO  [SessionTracker:SessionTrackerImpl@158]
- SessionTrackerImpl exited loop!

fail.build.on.test.failure:

BUILD FAILED
/home/jenkins/jenkins-slave/workspace/ZooKeeper_branch35_jdk7/build.xml:1219: The following
error occurred while executing this line:
/home/jenkins/jenkins-slave/workspace/ZooKeeper_branch35_jdk7/build.xml:1223: Tests failed!

Total time: 12 minutes 22 seconds
Build step 'Invoke Ant' marked build as failure
Recording test results
Email was triggered for: Failure - Any
Sending email for trigger: Failure - Any



###################################################################################
############################## FAILED TESTS (if any) ##############################
1 tests failed.
FAILED:  org.apache.zookeeper.test.LETest.testLE

Error Message:
Threads didn't join

Stack Trace:
junit.framework.AssertionFailedError: Threads didn't join
	at org.apache.zookeeper.test.LETest.testLE(LETest.java:123)
	at org.apache.zookeeper.JUnit4ZKTestRunner$LoggedInvokeMethod.evaluate(JUnit4ZKTestRunner.java:79)
Mime
  • Unnamed multipart/mixed (inline, None, 0 bytes)
View raw message