zookeeper-dev mailing list archives

Site index · List index
Message view « Date » · « Thread »
Top « Date » · « Thread »
From Apache Jenkins Server <jenk...@builds.apache.org>
Subject ZooKeeper-trunk-jdk8 - Build # 1024 - Still Failing
Date Fri, 21 Apr 2017 12:00:46 GMT
See https://builds.apache.org/job/ZooKeeper-trunk-jdk8/1024/

###################################################################################
########################## LAST 60 LINES OF THE CONSOLE ###########################
[...truncated 61.90 MB...]
    [junit] 	at org.apache.zookeeper.ClientCnxnSocketNIO.doTransport(ClientCnxnSocketNIO.java:357)
    [junit] 	at org.apache.zookeeper.ClientCnxn$SendThread.run(ClientCnxn.java:1214)
    [junit] 2017-04-21 11:56:01,232 [myid:127.0.0.1:24813] - INFO  [main-SendThread(127.0.0.1:24813):ClientCnxn$SendThread@1113]
- Opening socket connection to server 127.0.0.1/127.0.0.1:24813. Will not attempt to authenticate
using SASL (unknown error)
    [junit] 2017-04-21 11:56:01,232 [myid:127.0.0.1:24813] - WARN  [main-SendThread(127.0.0.1:24813):ClientCnxn$SendThread@1235]
- Session 0x202af0e31bd0000 for server 127.0.0.1/127.0.0.1:24813, unexpected error, closing
socket connection and attempting reconnect
    [junit] java.net.ConnectException: Connection refused
    [junit] 	at sun.nio.ch.SocketChannelImpl.checkConnect(Native Method)
    [junit] 	at sun.nio.ch.SocketChannelImpl.finishConnect(SocketChannelImpl.java:717)
    [junit] 	at org.apache.zookeeper.ClientCnxnSocketNIO.doTransport(ClientCnxnSocketNIO.java:357)
    [junit] 	at org.apache.zookeeper.ClientCnxn$SendThread.run(ClientCnxn.java:1214)
    [junit] 2017-04-21 11:56:01,570 [myid:] - INFO  [ProcessThread(sid:0 cport:24933)::PrepRequestProcessor@617]
- Processed session termination for sessionid: 0x102af11a35a0000
    [junit] 2017-04-21 11:56:01,571 [myid:] - INFO  [SyncThread:0:MBeanRegistry@128] - Unregister
MBean [org.apache.ZooKeeperService:name0=StandaloneServer_port24933,name1=Connections,name2=127.0.0.1,name3=0x102af11a35a0000]
    [junit] 2017-04-21 11:56:01,571 [myid:] - INFO  [main:ZooKeeper@1324] - Session: 0x102af11a35a0000
closed
    [junit] 2017-04-21 11:56:01,571 [myid:] - INFO  [main-EventThread:ClientCnxn$EventThread@513]
- EventThread shut down for session: 0x102af11a35a0000
    [junit] 2017-04-21 11:56:01,571 [myid:] - INFO  [main:JUnit4ZKTestRunner$LoggedInvokeMethod@82]
- Memory used 190179
    [junit] 2017-04-21 11:56:01,571 [myid:] - INFO  [main:JUnit4ZKTestRunner$LoggedInvokeMethod@87]
- Number of threads 1643
    [junit] 2017-04-21 11:56:01,572 [myid:] - INFO  [main:JUnit4ZKTestRunner$LoggedInvokeMethod@102]
- FINISHED TEST METHOD testWatcherAutoResetWithLocal
    [junit] 2017-04-21 11:56:01,572 [myid:] - INFO  [main:ClientBase@582] - tearDown starting
    [junit] 2017-04-21 11:56:01,572 [myid:] - INFO  [main:ClientBase@552] - STOPPING server
    [junit] 2017-04-21 11:56:01,572 [myid:] - INFO  [main:NettyServerCnxnFactory@464] - shutdown
called 0.0.0.0/0.0.0.0:24933
    [junit] 2017-04-21 11:56:01,575 [myid:] - INFO  [main:ZooKeeperServer@542] - shutting
down
    [junit] 2017-04-21 11:56:01,575 [myid:] - ERROR [main:ZooKeeperServer@506] - ZKShutdownHandler
is not registered, so ZooKeeper server won't take any action on ERROR or SHUTDOWN server state
changes
    [junit] 2017-04-21 11:56:01,575 [myid:] - INFO  [main:SessionTrackerImpl@232] - Shutting
down
    [junit] 2017-04-21 11:56:01,575 [myid:] - INFO  [main:PrepRequestProcessor@1008] - Shutting
down
    [junit] 2017-04-21 11:56:01,576 [myid:] - INFO  [main:SyncRequestProcessor@191] - Shutting
down
    [junit] 2017-04-21 11:56:01,576 [myid:] - INFO  [ProcessThread(sid:0 cport:24933)::PrepRequestProcessor@157]
- PrepRequestProcessor exited loop!
    [junit] 2017-04-21 11:56:01,576 [myid:] - INFO  [SyncThread:0:SyncRequestProcessor@169]
- SyncRequestProcessor exited!
    [junit] 2017-04-21 11:56:01,576 [myid:] - INFO  [main:FinalRequestProcessor@481] - shutdown
of request processor complete
    [junit] 2017-04-21 11:56:01,576 [myid:] - INFO  [main:MBeanRegistry@128] - Unregister
MBean [org.apache.ZooKeeperService:name0=StandaloneServer_port24933,name1=InMemoryDataTree]
    [junit] 2017-04-21 11:56:01,576 [myid:] - INFO  [main:MBeanRegistry@128] - Unregister
MBean [org.apache.ZooKeeperService:name0=StandaloneServer_port24933]
    [junit] 2017-04-21 11:56:01,576 [myid:] - INFO  [main:FourLetterWordMain@85] - connecting
to 127.0.0.1 24933
    [junit] 2017-04-21 11:56:01,577 [myid:] - INFO  [main:JMXEnv@146] - ensureOnly:[]
    [junit] 2017-04-21 11:56:01,580 [myid:] - INFO  [main:ClientBase@607] - fdcount after
test is: 4844 at start it was 4844
    [junit] 2017-04-21 11:56:01,581 [myid:] - INFO  [main:ZKTestCase$1@68] - SUCCEEDED testWatcherAutoResetWithLocal
    [junit] 2017-04-21 11:56:01,581 [myid:] - INFO  [main:ZKTestCase$1@63] - FINISHED testWatcherAutoResetWithLocal
    [junit] Tests run: 103, Failures: 0, Errors: 0, Skipped: 0, Time elapsed: 484.287 sec,
Thread: 6, Class: org.apache.zookeeper.test.NioNettySuiteTest
    [junit] 2017-04-21 11:56:01,894 [myid:127.0.0.1:24810] - INFO  [main-SendThread(127.0.0.1:24810):ClientCnxn$SendThread@1113]
- Opening socket connection to server 127.0.0.1/127.0.0.1:24810. Will not attempt to authenticate
using SASL (unknown error)
    [junit] 2017-04-21 11:56:01,894 [myid:127.0.0.1:24810] - WARN  [main-SendThread(127.0.0.1:24810):ClientCnxn$SendThread@1235]
- Session 0x102af0e31c10000 for server 127.0.0.1/127.0.0.1:24810, unexpected error, closing
socket connection and attempting reconnect
    [junit] java.net.ConnectException: Connection refused
    [junit] 	at sun.nio.ch.SocketChannelImpl.checkConnect(Native Method)
    [junit] 	at sun.nio.ch.SocketChannelImpl.finishConnect(SocketChannelImpl.java:717)
    [junit] 	at org.apache.zookeeper.ClientCnxnSocketNIO.doTransport(ClientCnxnSocketNIO.java:357)
    [junit] 	at org.apache.zookeeper.ClientCnxn$SendThread.run(ClientCnxn.java:1214)
    [junit] 2017-04-21 11:56:01,928 [myid:] - INFO  [SessionTracker:SessionTrackerImpl@158]
- SessionTrackerImpl exited loop!
    [junit] Running org.apache.zookeeper.server.quorum.Zab1_0Test in thread 5
    [junit] Tests run: 1, Failures: 0, Errors: 1, Skipped: 0, Time elapsed: 0 sec, Thread:
5, Class: org.apache.zookeeper.server.quorum.Zab1_0Test
    [junit] Test org.apache.zookeeper.server.quorum.Zab1_0Test FAILED (timeout)

fail.build.on.test.failure:

BUILD FAILED
/home/jenkins/jenkins-slave/workspace/ZooKeeper-trunk-jdk8/build.xml:1219: The following error
occurred while executing this line:
/home/jenkins/jenkins-slave/workspace/ZooKeeper-trunk-jdk8/build.xml:1223: Tests failed!

Total time: 16 minutes 20 seconds
Build step 'Invoke Ant' marked build as failure
[WARNINGS] Skipping publisher since build result is FAILURE
Recording test results
Email was triggered for: Failure - Any
Sending email for trigger: Failure - Any



###################################################################################
############################## FAILED TESTS (if any) ##############################
2 tests failed.
FAILED:  org.apache.zookeeper.server.quorum.Zab1_0Test.testNormalObserverRun

Error Message:
Timeout occurred. Please note the time in the report does not reflect the time until the timeout.

Stack Trace:
junit.framework.AssertionFailedError: Timeout occurred. Please note the time in the report
does not reflect the time until the timeout.
	at java.lang.Thread.run(Thread.java:745)


FAILED:  org.apache.zookeeper.test.WatchEventWhenAutoResetTest.testNodeDataChanged

Error Message:
expected:<NodeDataChanged> but was:<NodeDeleted>

Stack Trace:
junit.framework.AssertionFailedError: expected:<NodeDataChanged> but was:<NodeDeleted>
	at org.apache.zookeeper.test.WatchEventWhenAutoResetTest$EventsWatcher.assertEvent(WatchEventWhenAutoResetTest.java:67)
	at org.apache.zookeeper.test.WatchEventWhenAutoResetTest.testNodeDataChanged(WatchEventWhenAutoResetTest.java:126)
	at org.apache.zookeeper.JUnit4ZKTestRunner$LoggedInvokeMethod.evaluate(JUnit4ZKTestRunner.java:79)
Mime
  • Unnamed multipart/mixed (inline, None, 0 bytes)
View raw message