zookeeper-dev mailing list archives

Site index · List index
Message view « Date » · « Thread »
Top « Date » · « Thread »
From Apache Jenkins Server <jenk...@builds.apache.org>
Subject ZooKeeper_branch34 - Build # 1887 - Failure
Date Thu, 23 Mar 2017 00:20:09 GMT
See https://builds.apache.org/job/ZooKeeper_branch34/1887/

###################################################################################
########################## LAST 60 LINES OF THE CONSOLE ###########################
[...truncated 31.55 MB...]
    [junit] 2017-03-23 00:20:04,012 [myid:] - INFO  [main:PrepRequestProcessor@764] - Shutting
down
    [junit] 2017-03-23 00:20:04,012 [myid:] - INFO  [main:SyncRequestProcessor@208] - Shutting
down
    [junit] 2017-03-23 00:20:04,013 [myid:] - INFO  [ProcessThread(sid:0 cport:11221)::PrepRequestProcessor@143]
- PrepRequestProcessor exited loop!
    [junit] 2017-03-23 00:20:04,013 [myid:] - INFO  [SyncThread:0:SyncRequestProcessor@186]
- SyncRequestProcessor exited!
    [junit] 2017-03-23 00:20:04,014 [myid:] - INFO  [main:FinalRequestProcessor@402] - shutdown
of request processor complete
    [junit] 2017-03-23 00:20:04,014 [myid:] - INFO  [main:FourLetterWordMain@62] - connecting
to 127.0.0.1 11221
    [junit] 2017-03-23 00:20:04,015 [myid:] - INFO  [main:JMXEnv@147] - ensureOnly:[]
    [junit] 2017-03-23 00:20:04,017 [myid:] - INFO  [main:ClientBase@445] - STARTING server
    [junit] 2017-03-23 00:20:04,017 [myid:] - INFO  [main:ClientBase@366] - CREATING server
instance 127.0.0.1:11221
    [junit] 2017-03-23 00:20:04,018 [myid:] - INFO  [main:NIOServerCnxnFactory@89] - binding
to port 0.0.0.0/0.0.0.0:11221
    [junit] 2017-03-23 00:20:04,018 [myid:] - INFO  [main:ClientBase@341] - STARTING server
instance 127.0.0.1:11221
    [junit] 2017-03-23 00:20:04,018 [myid:] - INFO  [main:ZooKeeperServer@173] - Created server
with tickTime 3000 minSessionTimeout 6000 maxSessionTimeout 60000 datadir /home/jenkins/jenkins-slave/workspace/ZooKeeper_branch34/build/test/tmp/test6680795016649859133.junit.dir/version-2
snapdir /home/jenkins/jenkins-slave/workspace/ZooKeeper_branch34/build/test/tmp/test6680795016649859133.junit.dir/version-2
    [junit] 2017-03-23 00:20:04,022 [myid:] - ERROR [main:ZooKeeperServer@472] - ZKShutdownHandler
is not registered, so ZooKeeper server won't take any action on ERROR or SHUTDOWN server state
changes
    [junit] 2017-03-23 00:20:04,023 [myid:] - INFO  [main:FourLetterWordMain@62] - connecting
to 127.0.0.1 11221
    [junit] 2017-03-23 00:20:04,023 [myid:] - INFO  [NIOServerCxn.Factory:0.0.0.0/0.0.0.0:11221:NIOServerCnxnFactory@192]
- Accepted socket connection from /127.0.0.1:46992
    [junit] 2017-03-23 00:20:04,024 [myid:] - INFO  [NIOServerCxn.Factory:0.0.0.0/0.0.0.0:11221:NIOServerCnxn@883]
- Processing stat command from /127.0.0.1:46992
    [junit] 2017-03-23 00:20:04,024 [myid:] - INFO  [Thread-4:NIOServerCnxn$StatCommand@674]
- Stat command output
    [junit] 2017-03-23 00:20:04,024 [myid:] - INFO  [Thread-4:NIOServerCnxn@1044] - Closed
socket connection for client /127.0.0.1:46992 (no session established for client)
    [junit] 2017-03-23 00:20:04,025 [myid:] - INFO  [main:JMXEnv@230] - ensureParent:[InMemoryDataTree,
StandaloneServer_port]
    [junit] 2017-03-23 00:20:04,027 [myid:] - INFO  [main:JMXEnv@247] - expect:InMemoryDataTree
    [junit] 2017-03-23 00:20:04,027 [myid:] - INFO  [main:JMXEnv@251] - found:InMemoryDataTree
org.apache.ZooKeeperService:name0=StandaloneServer_port11221,name1=InMemoryDataTree
    [junit] 2017-03-23 00:20:04,027 [myid:] - INFO  [main:JMXEnv@247] - expect:StandaloneServer_port
    [junit] 2017-03-23 00:20:04,027 [myid:] - INFO  [main:JMXEnv@251] - found:StandaloneServer_port
org.apache.ZooKeeperService:name0=StandaloneServer_port11221
    [junit] 2017-03-23 00:20:04,027 [myid:] - INFO  [main:JUnit4ZKTestRunner$LoggedInvokeMethod@58]
- Memory used 35681
    [junit] 2017-03-23 00:20:04,028 [myid:] - INFO  [main:JUnit4ZKTestRunner$LoggedInvokeMethod@63]
- Number of threads 20
    [junit] 2017-03-23 00:20:04,028 [myid:] - INFO  [main:JUnit4ZKTestRunner$LoggedInvokeMethod@78]
- FINISHED TEST METHOD testQuota
    [junit] 2017-03-23 00:20:04,028 [myid:] - INFO  [main:ClientBase@522] - tearDown starting
    [junit] 2017-03-23 00:20:04,096 [myid:] - INFO  [main:ZooKeeper@684] - Session: 0x15af888de790000
closed
    [junit] 2017-03-23 00:20:04,096 [myid:] - INFO  [main:ClientBase@492] - STOPPING server
    [junit] 2017-03-23 00:20:04,097 [myid:] - INFO  [main-EventThread:ClientCnxn$EventThread@519]
- EventThread shut down for session: 0x15af888de790000
    [junit] 2017-03-23 00:20:04,097 [myid:] - INFO  [NIOServerCxn.Factory:0.0.0.0/0.0.0.0:11221:NIOServerCnxnFactory@219]
- NIOServerCnxn factory exited run method
    [junit] 2017-03-23 00:20:04,097 [myid:] - INFO  [main:ZooKeeperServer@505] - shutting
down
    [junit] 2017-03-23 00:20:04,097 [myid:] - ERROR [main:ZooKeeperServer@472] - ZKShutdownHandler
is not registered, so ZooKeeper server won't take any action on ERROR or SHUTDOWN server state
changes
    [junit] 2017-03-23 00:20:04,097 [myid:] - INFO  [main:SessionTrackerImpl@225] - Shutting
down
    [junit] 2017-03-23 00:20:04,098 [myid:] - INFO  [main:PrepRequestProcessor@764] - Shutting
down
    [junit] 2017-03-23 00:20:04,098 [myid:] - INFO  [main:SyncRequestProcessor@208] - Shutting
down
    [junit] 2017-03-23 00:20:04,099 [myid:] - INFO  [SyncThread:0:SyncRequestProcessor@186]
- SyncRequestProcessor exited!
    [junit] 2017-03-23 00:20:04,099 [myid:] - INFO  [main:FinalRequestProcessor@402] - shutdown
of request processor complete
    [junit] 2017-03-23 00:20:04,100 [myid:] - INFO  [main:FourLetterWordMain@62] - connecting
to 127.0.0.1 11221
    [junit] 2017-03-23 00:20:04,100 [myid:] - INFO  [ProcessThread(sid:0 cport:11221)::PrepRequestProcessor@143]
- PrepRequestProcessor exited loop!
    [junit] 2017-03-23 00:20:04,100 [myid:] - INFO  [main:JMXEnv@147] - ensureOnly:[]
    [junit] 2017-03-23 00:20:04,105 [myid:] - INFO  [main:ClientBase@547] - fdcount after
test is: 90 at start it was 78
    [junit] 2017-03-23 00:20:04,105 [myid:] - INFO  [main:ClientBase@549] - sleeping for 20
secs
    [junit] 2017-03-23 00:20:04,106 [myid:] - INFO  [main:ZKTestCase$1@69] - SUCCEEDED testQuota
    [junit] 2017-03-23 00:20:04,107 [myid:] - INFO  [main:ZKTestCase$1@64] - FINISHED testQuota
    [junit] Tests run: 1, Failures: 0, Errors: 0, Skipped: 0, Time elapsed: 0.669 sec

fail.build.on.test.failure:

BUILD FAILED
/home/jenkins/jenkins-slave/workspace/ZooKeeper_branch34/build.xml:1421: The following error
occurred while executing this line:
/home/jenkins/jenkins-slave/workspace/ZooKeeper_branch34/build.xml:1329: The following error
occurred while executing this line:
/home/jenkins/jenkins-slave/workspace/ZooKeeper_branch34/build.xml:1332: Tests failed!

Total time: 28 minutes 40 seconds
Build step 'Execute shell' marked build as failure
Recording test results
Email was triggered for: Failure - Any
Sending email for trigger: Failure - Any



###################################################################################
############################## FAILED TESTS (if any) ##############################
1 tests failed.
FAILED:  org.apache.zookeeper.test.ReadOnlyModeTest.testSessionEstablishment

Error Message:
KeeperErrorCode = ConnectionLoss for /test

Stack Trace:
org.apache.zookeeper.KeeperException$ConnectionLossException: KeeperErrorCode = ConnectionLoss
for /test
	at org.apache.zookeeper.KeeperException.create(KeeperException.java:99)
	at org.apache.zookeeper.KeeperException.create(KeeperException.java:51)
	at org.apache.zookeeper.ZooKeeper.create(ZooKeeper.java:783)
	at org.apache.zookeeper.test.ReadOnlyModeTest.testSessionEstablishment(ReadOnlyModeTest.java:216)
	at org.apache.zookeeper.JUnit4ZKTestRunner$LoggedInvokeMethod.evaluate(JUnit4ZKTestRunner.java:55)



Mime
  • Unnamed multipart/mixed (inline, None, 0 bytes)
View raw message