zookeeper-dev mailing list archives

Site index · List index
Message view « Date » · « Thread »
Top « Date » · « Thread »
From Apache Jenkins Server <jenk...@builds.apache.org>
Subject ZooKeeper_branch34_jdk8 - Build # 940 - Failure
Date Thu, 30 Mar 2017 23:06:37 GMT
See https://builds.apache.org/job/ZooKeeper_branch34_jdk8/940/

###################################################################################
########################## LAST 60 LINES OF THE CONSOLE ###########################
[...truncated 31.95 MB...]
    [junit] 2017-03-30 23:06:32,896 [myid:] - INFO  [ProcessThread(sid:0 cport:11221)::PrepRequestProcessor@143]
- PrepRequestProcessor exited loop!
    [junit] 2017-03-30 23:06:32,896 [myid:] - INFO  [SyncThread:0:SyncRequestProcessor@186]
- SyncRequestProcessor exited!
    [junit] 2017-03-30 23:06:32,897 [myid:] - INFO  [main:FinalRequestProcessor@402] - shutdown
of request processor complete
    [junit] 2017-03-30 23:06:32,897 [myid:] - INFO  [main:FourLetterWordMain@62] - connecting
to 127.0.0.1 11221
    [junit] 2017-03-30 23:06:32,898 [myid:] - INFO  [main:JMXEnv@147] - ensureOnly:[]
    [junit] 2017-03-30 23:06:32,899 [myid:] - INFO  [main:ClientBase@445] - STARTING server
    [junit] 2017-03-30 23:06:32,899 [myid:] - INFO  [main:ClientBase@366] - CREATING server
instance 127.0.0.1:11221
    [junit] 2017-03-30 23:06:32,900 [myid:] - INFO  [main:NIOServerCnxnFactory@89] - binding
to port 0.0.0.0/0.0.0.0:11221
    [junit] 2017-03-30 23:06:32,900 [myid:] - INFO  [main:ClientBase@341] - STARTING server
instance 127.0.0.1:11221
    [junit] 2017-03-30 23:06:32,901 [myid:] - INFO  [main:ZooKeeperServer@173] - Created server
with tickTime 3000 minSessionTimeout 6000 maxSessionTimeout 60000 datadir /home/jenkins/jenkins-slave/workspace/ZooKeeper_branch34_jdk8/build/test/tmp/test5908498345645134126.junit.dir/version-2
snapdir /home/jenkins/jenkins-slave/workspace/ZooKeeper_branch34_jdk8/build/test/tmp/test5908498345645134126.junit.dir/version-2
    [junit] 2017-03-30 23:06:32,903 [myid:] - ERROR [main:ZooKeeperServer@472] - ZKShutdownHandler
is not registered, so ZooKeeper server won't take any action on ERROR or SHUTDOWN server state
changes
    [junit] 2017-03-30 23:06:32,904 [myid:] - INFO  [main:FourLetterWordMain@62] - connecting
to 127.0.0.1 11221
    [junit] 2017-03-30 23:06:32,904 [myid:] - INFO  [NIOServerCxn.Factory:0.0.0.0/0.0.0.0:11221:NIOServerCnxnFactory@192]
- Accepted socket connection from /127.0.0.1:39247
    [junit] 2017-03-30 23:06:32,904 [myid:] - INFO  [NIOServerCxn.Factory:0.0.0.0/0.0.0.0:11221:NIOServerCnxn@883]
- Processing stat command from /127.0.0.1:39247
    [junit] 2017-03-30 23:06:32,905 [myid:] - INFO  [Thread-4:NIOServerCnxn$StatCommand@674]
- Stat command output
    [junit] 2017-03-30 23:06:32,905 [myid:] - INFO  [Thread-4:NIOServerCnxn@1044] - Closed
socket connection for client /127.0.0.1:39247 (no session established for client)
    [junit] 2017-03-30 23:06:32,906 [myid:] - INFO  [main:JMXEnv@230] - ensureParent:[InMemoryDataTree,
StandaloneServer_port]
    [junit] 2017-03-30 23:06:32,907 [myid:] - INFO  [main:JMXEnv@247] - expect:InMemoryDataTree
    [junit] 2017-03-30 23:06:32,908 [myid:] - INFO  [main:JMXEnv@251] - found:InMemoryDataTree
org.apache.ZooKeeperService:name0=StandaloneServer_port11221,name1=InMemoryDataTree
    [junit] 2017-03-30 23:06:32,908 [myid:] - INFO  [main:JMXEnv@247] - expect:StandaloneServer_port
    [junit] 2017-03-30 23:06:32,908 [myid:] - INFO  [main:JMXEnv@251] - found:StandaloneServer_port
org.apache.ZooKeeperService:name0=StandaloneServer_port11221
    [junit] 2017-03-30 23:06:32,908 [myid:] - INFO  [main:JUnit4ZKTestRunner$LoggedInvokeMethod@58]
- Memory used 35528
    [junit] 2017-03-30 23:06:32,909 [myid:] - INFO  [main:JUnit4ZKTestRunner$LoggedInvokeMethod@63]
- Number of threads 20
    [junit] 2017-03-30 23:06:32,909 [myid:] - INFO  [main:JUnit4ZKTestRunner$LoggedInvokeMethod@78]
- FINISHED TEST METHOD testQuota
    [junit] 2017-03-30 23:06:32,909 [myid:] - INFO  [main:ClientBase@522] - tearDown starting
    [junit] 2017-03-30 23:06:32,981 [myid:] - INFO  [main:ZooKeeper@684] - Session: 0x15b21786ed30000
closed
    [junit] 2017-03-30 23:06:32,981 [myid:] - INFO  [main:ClientBase@492] - STOPPING server
    [junit] 2017-03-30 23:06:32,981 [myid:] - INFO  [main-EventThread:ClientCnxn$EventThread@519]
- EventThread shut down for session: 0x15b21786ed30000
    [junit] 2017-03-30 23:06:32,981 [myid:] - INFO  [NIOServerCxn.Factory:0.0.0.0/0.0.0.0:11221:NIOServerCnxnFactory@219]
- NIOServerCnxn factory exited run method
    [junit] 2017-03-30 23:06:32,982 [myid:] - INFO  [main:ZooKeeperServer@505] - shutting
down
    [junit] 2017-03-30 23:06:32,982 [myid:] - ERROR [main:ZooKeeperServer@472] - ZKShutdownHandler
is not registered, so ZooKeeper server won't take any action on ERROR or SHUTDOWN server state
changes
    [junit] 2017-03-30 23:06:32,982 [myid:] - INFO  [main:SessionTrackerImpl@225] - Shutting
down
    [junit] 2017-03-30 23:06:32,982 [myid:] - INFO  [main:PrepRequestProcessor@764] - Shutting
down
    [junit] 2017-03-30 23:06:32,982 [myid:] - INFO  [main:SyncRequestProcessor@208] - Shutting
down
    [junit] 2017-03-30 23:06:32,982 [myid:] - INFO  [ProcessThread(sid:0 cport:11221)::PrepRequestProcessor@143]
- PrepRequestProcessor exited loop!
    [junit] 2017-03-30 23:06:32,983 [myid:] - INFO  [SyncThread:0:SyncRequestProcessor@186]
- SyncRequestProcessor exited!
    [junit] 2017-03-30 23:06:32,983 [myid:] - INFO  [main:FinalRequestProcessor@402] - shutdown
of request processor complete
    [junit] 2017-03-30 23:06:32,984 [myid:] - INFO  [main:FourLetterWordMain@62] - connecting
to 127.0.0.1 11221
    [junit] 2017-03-30 23:06:32,984 [myid:] - INFO  [main:JMXEnv@147] - ensureOnly:[]
    [junit] 2017-03-30 23:06:32,988 [myid:] - INFO  [main:ClientBase@547] - fdcount after
test is: 98 at start it was 80
    [junit] 2017-03-30 23:06:32,988 [myid:] - INFO  [main:ClientBase@549] - sleeping for 20
secs
    [junit] 2017-03-30 23:06:32,989 [myid:] - INFO  [main:ZKTestCase$1@69] - SUCCEEDED testQuota
    [junit] 2017-03-30 23:06:32,990 [myid:] - INFO  [main:ZKTestCase$1@64] - FINISHED testQuota
    [junit] Tests run: 1, Failures: 0, Errors: 0, Skipped: 0, Time elapsed: 0.83 sec
    [junit] 2017-03-30 23:06:33,000 [myid:] - INFO  [SessionTracker:SessionTrackerImpl@162]
- SessionTrackerImpl exited loop!
    [junit] 2017-03-30 23:06:33,000 [myid:] - INFO  [SessionTracker:SessionTrackerImpl@162]
- SessionTrackerImpl exited loop!
    [junit] 2017-03-30 23:06:33,000 [myid:] - INFO  [SessionTracker:SessionTrackerImpl@162]
- SessionTrackerImpl exited loop!

fail.build.on.test.failure:

BUILD FAILED
/home/jenkins/jenkins-slave/workspace/ZooKeeper_branch34_jdk8/build.xml:1330: The following
error occurred while executing this line:
/home/jenkins/jenkins-slave/workspace/ZooKeeper_branch34_jdk8/build.xml:1333: Tests failed!

Total time: 37 minutes 20 seconds
Build step 'Invoke Ant' marked build as failure
Recording test results
Email was triggered for: Failure - Any
Sending email for trigger: Failure - Any



###################################################################################
############################## FAILED TESTS (if any) ##############################
2 tests failed.
FAILED:  org.apache.zookeeper.test.FollowerResyncConcurrencyTest.testResyncBySnapThenDiffAfterFollowerCrashes

Error Message:
Forked Java VM exited abnormally. Please note the time in the report does not reflect the
time until the VM exit.

Stack Trace:
junit.framework.AssertionFailedError: Forked Java VM exited abnormally. Please note the time
in the report does not reflect the time until the VM exit.


FAILED:  org.apache.zookeeper.test.FollowerTest.testNoLogBeforeLeaderEstablishment

Error Message:
Not following

Stack Trace:
junit.framework.AssertionFailedError: Not following
	at org.apache.zookeeper.test.FollowerTest.testNoLogBeforeLeaderEstablishment(FollowerTest.java:181)
	at org.apache.zookeeper.JUnit4ZKTestRunner$LoggedInvokeMethod.evaluate(JUnit4ZKTestRunner.java:55)



Mime
  • Unnamed multipart/mixed (inline, None, 0 bytes)
View raw message