zookeeper-dev mailing list archives

Site index · List index
Message view « Date » · « Thread »
Top « Date » · « Thread »
From Apache Jenkins Server <jenk...@builds.apache.org>
Subject Failed: ZOOKEEPER- PreCommit Build #401
Date Sat, 11 Mar 2017 03:23:16 GMT
Build: https://builds.apache.org/job/PreCommit-ZOOKEEPER-github-pr-build/401/

###################################################################################
########################## LAST 60 LINES OF THE CONSOLE ###########################
[...truncated 69.83 MB...]
     [exec] 
     [exec]     +1 javadoc.  The javadoc tool did not generate any warning messages.
     [exec] 
     [exec]     +1 javac.  The applied patch does not increase the total number of javac compiler
warnings.
     [exec] 
     [exec]     +1 findbugs.  The patch does not introduce any new Findbugs (version 3.0.1)
warnings.
     [exec] 
     [exec]     -1 release audit.  The applied patch generated 2 release audit warnings (more
than the trunk's current 0 warnings).
     [exec] 
     [exec]     -1 core tests.  The patch failed core unit tests.
     [exec] 
     [exec]     +1 contrib tests.  The patch passed contrib unit tests.
     [exec] 
     [exec] Test results: https://builds.apache.org/job/PreCommit-ZOOKEEPER-github-pr-build/401//testReport/
     [exec] Release audit warnings: https://builds.apache.org/job/PreCommit-ZOOKEEPER-github-pr-build/401//artifact/trunk/patchprocess/patchReleaseAuditProblems.txt
     [exec] Findbugs warnings: https://builds.apache.org/job/PreCommit-ZOOKEEPER-github-pr-build/401//artifact/trunk/build/test/findbugs/newPatchFindbugsWarnings.html
     [exec] Console output: https://builds.apache.org/job/PreCommit-ZOOKEEPER-github-pr-build/401//console
     [exec] 
     [exec] This message is automatically generated.
     [exec] 
     [exec] 
     [exec] ======================================================================
     [exec] ======================================================================
     [exec]     Adding comment to Jira.
     [exec] ======================================================================
     [exec] ======================================================================
     [exec] 
     [exec] 
     [exec] Comment added.
     [exec] 551380d793d80fcbad1c3b7cd1f96cdf39042de1 logged out
     [exec] 
     [exec] 
     [exec] ======================================================================
     [exec] ======================================================================
     [exec]     Finished build.
     [exec] ======================================================================
     [exec] ======================================================================
     [exec] 
     [exec] 
     [exec] mv: '/home/jenkins/jenkins-slave/workspace/PreCommit-ZOOKEEPER-github-pr-build/patchprocess'
and '/home/jenkins/jenkins-slave/workspace/PreCommit-ZOOKEEPER-github-pr-build/patchprocess'
are the same file

BUILD FAILED
/home/jenkins/jenkins-slave/workspace/PreCommit-ZOOKEEPER-github-pr-build/build.xml:1634:
exec returned: 3

Total time: 25 minutes 8 seconds
Build step 'Execute shell' marked build as failure
Archiving artifacts
Setting JDK_1_7_LATEST__HOME=/home/jenkins/tools/java/latest1.7
Recording test results
Setting JDK_1_7_LATEST__HOME=/home/jenkins/tools/java/latest1.7
Setting JDK_1_7_LATEST__HOME=/home/jenkins/tools/java/latest1.7
[description-setter] Description set: ZOOKEEPER-236
Putting comment on the pull request
Setting JDK_1_7_LATEST__HOME=/home/jenkins/tools/java/latest1.7
Email was triggered for: Failure - Any
Sending email for trigger: Failure - Any
Setting JDK_1_7_LATEST__HOME=/home/jenkins/tools/java/latest1.7
Setting JDK_1_7_LATEST__HOME=/home/jenkins/tools/java/latest1.7
Setting JDK_1_7_LATEST__HOME=/home/jenkins/tools/java/latest1.7



###################################################################################
############################## FAILED TESTS (if any) ##############################
8 tests failed.
FAILED:  org.apache.zookeeper.server.quorum.LearnerTest.connectionRetryTimeoutTest

Error Message:
Unexpected exception, expected<java.io.IOException> but was<java.lang.NullPointerException>

Stack Trace:
java.lang.Exception: Unexpected exception, expected<java.io.IOException> but was<java.lang.NullPointerException>
Caused by: java.lang.NullPointerException
	at org.apache.zookeeper.server.quorum.Learner.connectToLeader(Learner.java:241)
	at org.apache.zookeeper.server.quorum.LearnerTest.connectionRetryTimeoutTest(LearnerTest.java:113)
	at org.apache.zookeeper.JUnit4ZKTestRunner$LoggedInvokeMethod.evaluate(JUnit4ZKTestRunner.java:79)


FAILED:  org.apache.zookeeper.server.quorum.LearnerTest.connectionInitLimitTimeoutTest

Error Message:
null

Stack Trace:
java.lang.NullPointerException
	at org.apache.zookeeper.server.quorum.Learner.connectToLeader(Learner.java:241)
	at org.apache.zookeeper.server.quorum.LearnerTest.connectionInitLimitTimeoutTest(LearnerTest.java:133)
	at org.apache.zookeeper.JUnit4ZKTestRunner$LoggedInvokeMethod.evaluate(JUnit4ZKTestRunner.java:79)


FAILED:  org.apache.zookeeper.server.quorum.QuorumPeerConfigTest.testCustomSSLAuth

Error Message:
ConfigException is expected

Stack Trace:
junit.framework.AssertionFailedError: ConfigException is expected
	at org.apache.zookeeper.server.quorum.QuorumPeerConfigTest.testCustomSSLAuth(QuorumPeerConfigTest.java:100)


FAILED:  org.apache.zookeeper.server.quorum.RaceConditionTest.testRaceConditionBetweenLeaderAndAckRequestProcessor

Error Message:
org.apache.zookeeper.server.quorum.QuorumPeer cannot be cast to org.apache.zookeeper.server.quorum.RaceConditionTest$CustomQuorumPeer

Stack Trace:
java.lang.ClassCastException: org.apache.zookeeper.server.quorum.QuorumPeer cannot be cast
to org.apache.zookeeper.server.quorum.RaceConditionTest$CustomQuorumPeer
	at org.apache.zookeeper.server.quorum.RaceConditionTest.shutdownFollowers(RaceConditionTest.java:149)
	at org.apache.zookeeper.server.quorum.RaceConditionTest.testRaceConditionBetweenLeaderAndAckRequestProcessor(RaceConditionTest.java:68)
	at org.apache.zookeeper.JUnit4ZKTestRunner$LoggedInvokeMethod.evaluate(JUnit4ZKTestRunner.java:79)
	at java.util.concurrent.FutureTask.run(FutureTask.java:262)
	at java.lang.Thread.run(Thread.java:745)


FAILED:  org.apache.zookeeper.server.quorum.Zab1_0Test.testNormalFollowerRun

Error Message:
Timeout occurred. Please note the time in the report does not reflect the time until the timeout.

Stack Trace:
junit.framework.AssertionFailedError: Timeout occurred. Please note the time in the report
does not reflect the time until the timeout.
	at java.lang.Thread.run(Thread.java:745)


FAILED:  org.apache.zookeeper.test.SSLAuthTest.testMisconfiguration

Error Message:
Timeout occurred. Please note the time in the report does not reflect the time until the timeout.

Stack Trace:
junit.framework.AssertionFailedError: Timeout occurred. Please note the time in the report
does not reflect the time until the timeout.
	at java.lang.Thread.run(Thread.java:745)


FAILED:  org.apache.zookeeper.test.SSLTest.testSecureQuorumServer

Error Message:
ZooKeeper client can not connect to 127.0.0.1:30074

Stack Trace:
junit.framework.AssertionFailedError: ZooKeeper client can not connect to 127.0.0.1:30074
	at org.apache.zookeeper.test.ClientBase.createZKClient(ClientBase.java:703)
	at org.apache.zookeeper.test.SSLTest.testSecureQuorumServer(SSLTest.java:99)
	at org.apache.zookeeper.JUnit4ZKTestRunner$LoggedInvokeMethod.evaluate(JUnit4ZKTestRunner.java:79)


FAILED:  org.apache.zookeeper.test.SSLTest.testSecureStandaloneServer

Error Message:
ZooKeeper client can not connect to 127.0.0.1:30085

Stack Trace:
junit.framework.AssertionFailedError: ZooKeeper client can not connect to 127.0.0.1:30085
	at org.apache.zookeeper.test.ClientBase.createZKClient(ClientBase.java:703)
	at org.apache.zookeeper.test.SSLTest.testSecureStandaloneServer(SSLTest.java:124)
	at org.apache.zookeeper.JUnit4ZKTestRunner$LoggedInvokeMethod.evaluate(JUnit4ZKTestRunner.java:79)



Mime
  • Unnamed multipart/mixed (inline, None, 0 bytes)
View raw message