zookeeper-dev mailing list archives

Site index · List index
Message view « Date » · « Thread »
Top « Date » · « Thread »
From Apache Jenkins Server <jenk...@builds.apache.org>
Subject ZooKeeper_branch34_openjdk7 - Build # 1449 - Failure
Date Thu, 30 Mar 2017 14:43:01 GMT
See https://builds.apache.org/job/ZooKeeper_branch34_openjdk7/1449/

###################################################################################
########################## LAST 60 LINES OF THE CONSOLE ###########################
Started by timer
[EnvInject] - Loading node environment variables.
Building remotely on ubuntu-2 (ubuntu) in workspace /home/jenkins/jenkins-slave/workspace/ZooKeeper_branch34_openjdk7
FATAL: java.io.IOException: Remote call on ubuntu-2 failed
hudson.remoting.RemotingSystemException: java.io.IOException: Remote call on ubuntu-2 failed
	at hudson.remoting.RemoteInvocationHandler.invoke(RemoteInvocationHandler.java:272)
	at com.sun.proxy.$Proxy96.hasGitRepo(Unknown Source)
	at org.jenkinsci.plugins.gitclient.RemoteGitImpl.hasGitRepo(RemoteGitImpl.java:280)
	at hudson.plugins.git.GitSCM.retrieveChanges(GitSCM.java:1046)
	at hudson.plugins.git.GitSCM.checkout(GitSCM.java:1101)
	at hudson.scm.SCM.checkout(SCM.java:495)
	at hudson.model.AbstractProject.checkout(AbstractProject.java:1278)
	at hudson.model.AbstractBuild$AbstractBuildExecution.defaultCheckout(AbstractBuild.java:604)
	at jenkins.scm.SCMCheckoutStrategy.checkout(SCMCheckoutStrategy.java:86)
	at hudson.model.AbstractBuild$AbstractBuildExecution.run(AbstractBuild.java:529)
	at hudson.model.Run.execute(Run.java:1728)
	at hudson.model.FreeStyleBuild.run(FreeStyleBuild.java:43)
	at hudson.model.ResourceController.execute(ResourceController.java:98)
	at hudson.model.Executor.run(Executor.java:404)
Caused by: java.io.IOException: Remote call on ubuntu-2 failed
	at hudson.remoting.Channel.call(Channel.java:830)
	at hudson.remoting.RemoteInvocationHandler.invoke(RemoteInvocationHandler.java:256)
	... 13 more
Caused by: java.lang.OutOfMemoryError: Java heap space
Recording test results
ERROR: Step ?Publish JUnit test result report? failed: Test reports were found but none of
them are new. Did tests run? 
For example, /home/jenkins/jenkins-slave/workspace/ZooKeeper_branch34_openjdk7/build/test/logs/TEST-org.apache.jute.BinaryInputArchiveTest.xml
is 12 days old

Email was triggered for: Failure - Any
Sending email for trigger: Failure - Any



###################################################################################
############################## FAILED TESTS (if any) ##############################
No tests ran.
Mime
  • Unnamed multipart/mixed (inline, None, 0 bytes)
View raw message