zookeeper-dev mailing list archives

Site index · List index
Message view « Date » · « Thread »
Top « Date » · « Thread »
From Apache Jenkins Server <jenk...@builds.apache.org>
Subject ZooKeeper_branch35_jdk8 - Build # 468 - Failure
Date Fri, 24 Mar 2017 11:48:06 GMT
See https://builds.apache.org/job/ZooKeeper_branch35_jdk8/468/

###################################################################################
########################## LAST 60 LINES OF THE CONSOLE ###########################
Started by timer
[EnvInject] - Loading node environment variables.
ERROR: SEVERE ERROR occurs
org.jenkinsci.lib.envinject.EnvInjectException: java.io.IOException: Remote call on ubuntu-eu3
failed
	at org.jenkinsci.plugins.envinject.EnvInjectListener.loadEnvironmentVariablesNode(EnvInjectListener.java:86)
	at org.jenkinsci.plugins.envinject.EnvInjectListener.setUpEnvironment(EnvInjectListener.java:42)
	at hudson.model.AbstractBuild$AbstractBuildExecution.createLauncher(AbstractBuild.java:572)
	at hudson.model.AbstractBuild$AbstractBuildExecution.run(AbstractBuild.java:492)
	at hudson.model.Run.execute(Run.java:1728)
	at hudson.model.FreeStyleBuild.run(FreeStyleBuild.java:43)
	at hudson.model.ResourceController.execute(ResourceController.java:98)
	at hudson.model.Executor.run(Executor.java:404)
Caused by: java.io.IOException: Remote call on ubuntu-eu3 failed
	at hudson.remoting.Channel.call(Channel.java:830)
	at hudson.FilePath.act(FilePath.java:1080)
	at org.jenkinsci.plugins.envinject.service.EnvInjectActionSetter.addEnvVarsToEnvInjectBuildAction(EnvInjectActionSetter.java:38)
	at org.jenkinsci.plugins.envinject.EnvInjectListener.loadEnvironmentVariablesNode(EnvInjectListener.java:83)
	... 7 more
Caused by: java.lang.OutOfMemoryError: GC overhead limit exceeded
ERROR: Step ‘Publish JUnit test result report’ failed: no workspace for ZooKeeper_branch35_jdk8
#468
[EnvInject] - [ERROR] - SEVERE ERROR occurs: Remote call on ubuntu-eu3 failed
Email was triggered for: Failure - Any
Sending email for trigger: Failure - Any



###################################################################################
############################## FAILED TESTS (if any) ##############################
No tests ran.
Mime
  • Unnamed multipart/mixed (inline, None, 0 bytes)
View raw message