zookeeper-dev mailing list archives

Site index · List index
Message view « Date » · « Thread »
Top « Date » · « Thread »
From Apache Jenkins Server <jenk...@builds.apache.org>
Subject Failed: ZOOKEEPER- PreCommit Build #495
Date Sat, 01 Apr 2017 00:02:18 GMT
Build: https://builds.apache.org/job/PreCommit-ZOOKEEPER-github-pr-build/495/

###################################################################################
########################## LAST 60 LINES OF THE CONSOLE ###########################
[...truncated 222.11 MB...]
     [exec]     +1 tests included.  The patch appears to include 10 new or modified tests.
     [exec] 
     [exec]     +1 javadoc.  The javadoc tool did not generate any warning messages.
     [exec] 
     [exec]     +1 javac.  The applied patch does not increase the total number of javac compiler warnings.
     [exec] 
     [exec]     +1 findbugs.  The patch does not introduce any new Findbugs (version 3.0.1) warnings.
     [exec] 
     [exec]     +1 release audit.  The applied patch does not increase the total number of release audit warnings.
     [exec] 
     [exec]     -1 core tests.  The patch failed core unit tests.
     [exec] 
     [exec]     +1 contrib tests.  The patch passed contrib unit tests.
     [exec] 
     [exec] Test results: https://builds.apache.org/job/PreCommit-ZOOKEEPER-github-pr-build/495//testReport/
     [exec] Findbugs warnings: https://builds.apache.org/job/PreCommit-ZOOKEEPER-github-pr-build/495//artifact/trunk/build/test/findbugs/newPatchFindbugsWarnings.html
     [exec] Console output: https://builds.apache.org/job/PreCommit-ZOOKEEPER-github-pr-build/495//console
     [exec] 
     [exec] This message is automatically generated.
     [exec] 
     [exec] 
     [exec] ======================================================================
     [exec] ======================================================================
     [exec]     Adding comment to Jira.
     [exec] ======================================================================
     [exec] ======================================================================
     [exec] 
     [exec] 
     [exec] Comment added.
     [exec] 3d937afe343f487cd3544267724164e4b6b5cad2 logged out
     [exec] 
     [exec] 
     [exec] ======================================================================
     [exec] ======================================================================
     [exec]     Finished build.
     [exec] ======================================================================
     [exec] ======================================================================
     [exec] 
     [exec] 
     [exec] mv: '/home/jenkins/jenkins-slave/workspace/PreCommit-ZOOKEEPER-github-pr-build/patchprocess' and '/home/jenkins/jenkins-slave/workspace/PreCommit-ZOOKEEPER-github-pr-build/patchprocess' are the same file

BUILD FAILED
/home/jenkins/jenkins-slave/workspace/PreCommit-ZOOKEEPER-github-pr-build/build.xml:1642: exec returned: 1

Total time: 38 minutes 53 seconds
Build step 'Execute shell' marked build as failure
Archiving artifacts
Setting JDK_1_7_LATEST__HOME=/home/jenkins/tools/java/latest1.7
Recording test results
Setting JDK_1_7_LATEST__HOME=/home/jenkins/tools/java/latest1.7
Setting JDK_1_7_LATEST__HOME=/home/jenkins/tools/java/latest1.7
[description-setter] Description set: ZOOKEEPER-2736
Putting comment on the pull request
Setting JDK_1_7_LATEST__HOME=/home/jenkins/tools/java/latest1.7
Email was triggered for: Failure - Any
Sending email for trigger: Failure - Any
Setting JDK_1_7_LATEST__HOME=/home/jenkins/tools/java/latest1.7
Setting JDK_1_7_LATEST__HOME=/home/jenkins/tools/java/latest1.7
Setting JDK_1_7_LATEST__HOME=/home/jenkins/tools/java/latest1.7



###################################################################################
############################## FAILED TESTS (if any) ##############################
290 tests failed.
FAILED:  org.apache.zookeeper.RemoveWatchesCmdTest.testRemoveNodeCreatedWatches

Error Message:
waiting for server up

Stack Trace:
junit.framework.AssertionFailedError: waiting for server up
	at org.apache.zookeeper.test.ClientBase.startServerInstance(ClientBase.java:379)
	at org.apache.zookeeper.test.ClientBase.startServer(ClientBase.java:488)
	at org.apache.zookeeper.test.ClientBase.startServer(ClientBase.java:484)
	at org.apache.zookeeper.test.ClientBase.setUp(ClientBase.java:475)
	at org.apache.zookeeper.RemoveWatchesCmdTest.setUp(RemoveWatchesCmdTest.java:46)


FAILED:  org.apache.zookeeper.RemoveWatchesCmdTest.testRemoveWatchesLocallyWhenNoServerConnection

Error Message:
waiting for server up

Stack Trace:
junit.framework.AssertionFailedError: waiting for server up
	at org.apache.zookeeper.test.ClientBase.startServerInstance(ClientBase.java:379)
	at org.apache.zookeeper.test.ClientBase.startServer(ClientBase.java:488)
	at org.apache.zookeeper.test.ClientBase.startServer(ClientBase.java:484)
	at org.apache.zookeeper.test.ClientBase.setUp(ClientBase.java:475)
	at org.apache.zookeeper.RemoveWatchesCmdTest.setUp(RemoveWatchesCmdTest.java:46)


FAILED:  org.apache.zookeeper.RemoveWatchesCmdTest.testRemoveWatchesWithNoPassedOptions

Error Message:
waiting for server up

Stack Trace:
junit.framework.AssertionFailedError: waiting for server up
	at org.apache.zookeeper.test.ClientBase.startServerInstance(ClientBase.java:379)
	at org.apache.zookeeper.test.ClientBase.startServer(ClientBase.java:488)
	at org.apache.zookeeper.test.ClientBase.startServer(ClientBase.java:484)
	at org.apache.zookeeper.test.ClientBase.setUp(ClientBase.java:475)
	at org.apache.zookeeper.RemoveWatchesCmdTest.setUp(RemoveWatchesCmdTest.java:46)


FAILED:  org.apache.zookeeper.RemoveWatchesCmdTest.testRemoveAnyWatches

Error Message:
waiting for server up

Stack Trace:
junit.framework.AssertionFailedError: waiting for server up
	at org.apache.zookeeper.test.ClientBase.startServerInstance(ClientBase.java:379)
	at org.apache.zookeeper.test.ClientBase.startServer(ClientBase.java:488)
	at org.apache.zookeeper.test.ClientBase.startServer(ClientBase.java:484)
	at org.apache.zookeeper.test.ClientBase.setUp(ClientBase.java:475)
	at org.apache.zookeeper.RemoveWatchesCmdTest.setUp(RemoveWatchesCmdTest.java:46)


FAILED:  org.apache.zookeeper.RemoveWatchesCmdTest.testRemoveNodeDeletedWatches

Error Message:
waiting for server up

Stack Trace:
junit.framework.AssertionFailedError: waiting for server up
	at org.apache.zookeeper.test.ClientBase.startServerInstance(ClientBase.java:379)
	at org.apache.zookeeper.test.ClientBase.startServer(ClientBase.java:488)
	at org.apache.zookeeper.test.ClientBase.startServer(ClientBase.java:484)
	at org.apache.zookeeper.test.ClientBase.setUp(ClientBase.java:475)
	at org.apache.zookeeper.RemoveWatchesCmdTest.setUp(RemoveWatchesCmdTest.java:46)


FAILED:  org.apache.zookeeper.RemoveWatchesCmdTest.testRemoveNodeDataChangedWatches

Error Message:
waiting for server up

Stack Trace:
junit.framework.AssertionFailedError: waiting for server up
	at org.apache.zookeeper.test.ClientBase.startServerInstance(ClientBase.java:379)
	at org.apache.zookeeper.test.ClientBase.startServer(ClientBase.java:488)
	at org.apache.zookeeper.test.ClientBase.startServer(ClientBase.java:484)
	at org.apache.zookeeper.test.ClientBase.setUp(ClientBase.java:475)
	at org.apache.zookeeper.RemoveWatchesCmdTest.setUp(RemoveWatchesCmdTest.java:46)


FAILED:  org.apache.zookeeper.RemoveWatchesCmdTest.testRemoveNodeChildrenChangedWatches

Error Message:
waiting for server up

Stack Trace:
junit.framework.AssertionFailedError: waiting for server up
	at org.apache.zookeeper.test.ClientBase.startServerInstance(ClientBase.java:379)
	at org.apache.zookeeper.test.ClientBase.startServer(ClientBase.java:488)
	at org.apache.zookeeper.test.ClientBase.startServer(ClientBase.java:484)
	at org.apache.zookeeper.test.ClientBase.setUp(ClientBase.java:475)
	at org.apache.zookeeper.RemoveWatchesCmdTest.setUp(RemoveWatchesCmdTest.java:46)


FAILED:  org.apache.zookeeper.RemoveWatchesTest.testRemoveWatcherWhenNoConnection[1]

Error Message:
Timeout occurred. Please note the time in the report does not reflect the time until the timeout.

Stack Trace:
junit.framework.AssertionFailedError: Timeout occurred. Please note the time in the report does not reflect the time until the timeout.
	at java.lang.Thread.run(Thread.java:745)


FAILED:  org.apache.zookeeper.ZooKeeperTest.testDeleteRecursive

Error Message:
Timeout occurred. Please note the time in the report does not reflect the time until the timeout.

Stack Trace:
junit.framework.AssertionFailedError: Timeout occurred. Please note the time in the report does not reflect the time until the timeout.
	at java.lang.Thread.run(Thread.java:745)


FAILED:  org.apache.zookeeper.ZooKeeperTestableTest.testSessionExpiration

Error Message:
waiting for server up

Stack Trace:
junit.framework.AssertionFailedError: waiting for server up
	at org.apache.zookeeper.test.ClientBase.startServerInstance(ClientBase.java:379)
	at org.apache.zookeeper.test.ClientBase.startServer(ClientBase.java:488)
	at org.apache.zookeeper.test.ClientBase.startServer(ClientBase.java:484)
	at org.apache.zookeeper.test.ClientBase.setUp(ClientBase.java:475)


FAILED:  org.apache.zookeeper.common.TimeTest.testElapsedTimeToDate

Error Message:
waiting for server up

Stack Trace:
junit.framework.AssertionFailedError: waiting for server up
	at org.apache.zookeeper.test.ClientBase.startServerInstance(ClientBase.java:379)
	at org.apache.zookeeper.test.ClientBase.startServer(ClientBase.java:488)
	at org.apache.zookeeper.test.ClientBase.startServer(ClientBase.java:484)
	at org.apache.zookeeper.test.ClientBase.setUp(ClientBase.java:475)


FAILED:  org.apache.zookeeper.server.CRCTest.testChecksums

Error Message:
waiting for server being up

Stack Trace:
junit.framework.AssertionFailedError: waiting for server being up
	at org.apache.zookeeper.server.CRCTest.testChecksums(CRCTest.java:116)
	at org.apache.zookeeper.JUnit4ZKTestRunner$LoggedInvokeMethod.evaluate(JUnit4ZKTestRunner.java:79)


FAILED:  org.apache.zookeeper.server.CreateContainerTest.testFalseEmpty

Error Message:
null

Stack Trace:
java.lang.NullPointerException
	at org.apache.zookeeper.server.CreateContainerTest.tearDown(CreateContainerTest.java:45)


FAILED:  org.apache.zookeeper.server.CreateContainerTest.testCreateWithStat

Error Message:
null

Stack Trace:
java.lang.NullPointerException
	at org.apache.zookeeper.server.CreateContainerTest.tearDown(CreateContainerTest.java:45)


FAILED:  org.apache.zookeeper.server.CreateContainerTest.testSimpleDeletionAsync

Error Message:
null

Stack Trace:
java.lang.NullPointerException
	at org.apache.zookeeper.server.CreateContainerTest.tearDown(CreateContainerTest.java:45)


FAILED:  org.apache.zookeeper.server.CreateContainerTest.testMaxPerMinute

Error Message:
null

Stack Trace:
java.lang.NullPointerException
	at org.apache.zookeeper.server.CreateContainerTest.tearDown(CreateContainerTest.java:45)


FAILED:  org.apache.zookeeper.server.CreateContainerTest.testMultiWithContainer

Error Message:
null

Stack Trace:
java.lang.NullPointerException
	at org.apache.zookeeper.server.CreateContainerTest.tearDown(CreateContainerTest.java:45)


FAILED:  org.apache.zookeeper.server.CreateContainerTest.testCascadingDeletion

Error Message:
null

Stack Trace:
java.lang.NullPointerException
	at org.apache.zookeeper.server.CreateContainerTest.tearDown(CreateContainerTest.java:45)


FAILED:  org.apache.zookeeper.server.CreateContainerTest.testSimpleDeletion

Error Message:
null

Stack Trace:
java.lang.NullPointerException
	at org.apache.zookeeper.server.CreateContainerTest.tearDown(CreateContainerTest.java:45)


FAILED:  org.apache.zookeeper.server.CreateContainerTest.testMultiWithContainerSimple

Error Message:
null

Stack Trace:
java.lang.NullPointerException
	at org.apache.zookeeper.server.CreateContainerTest.tearDown(CreateContainerTest.java:45)


FAILED:  org.apache.zookeeper.server.CreateContainerTest.testCreateWithNullStat

Error Message:
null

Stack Trace:
java.lang.NullPointerException
	at org.apache.zookeeper.server.CreateContainerTest.tearDown(CreateContainerTest.java:45)


FAILED:  org.apache.zookeeper.server.CreateContainerTest.testCreate

Error Message:
null

Stack Trace:
java.lang.NullPointerException
	at org.apache.zookeeper.server.CreateContainerTest.tearDown(CreateContainerTest.java:45)


FAILED:  org.apache.zookeeper.server.CreateTTLTest.testBadUsage

Error Message:
null

Stack Trace:
java.lang.NullPointerException
	at org.apache.zookeeper.server.CreateTTLTest.tearDown(CreateTTLTest.java:51)


FAILED:  org.apache.zookeeper.server.CreateTTLTest.testModifying

Error Message:
null

Stack Trace:
java.lang.NullPointerException
	at org.apache.zookeeper.server.CreateTTLTest.tearDown(CreateTTLTest.java:51)


FAILED:  org.apache.zookeeper.server.CreateTTLTest.testMulti

Error Message:
null

Stack Trace:
java.lang.NullPointerException
	at org.apache.zookeeper.server.CreateTTLTest.tearDown(CreateTTLTest.java:51)


FAILED:  org.apache.zookeeper.server.CreateTTLTest.testCreateAsync

Error Message:
null

Stack Trace:
java.lang.NullPointerException
	at org.apache.zookeeper.server.CreateTTLTest.tearDown(CreateTTLTest.java:51)


FAILED:  org.apache.zookeeper.server.CreateTTLTest.testCreateSequential

Error Message:
null

Stack Trace:
java.lang.NullPointerException
	at org.apache.zookeeper.server.CreateTTLTest.tearDown(CreateTTLTest.java:51)


FAILED:  org.apache.zookeeper.server.CreateTTLTest.testCreate

Error Message:
null

Stack Trace:
java.lang.NullPointerException
	at org.apache.zookeeper.server.CreateTTLTest.tearDown(CreateTTLTest.java:51)


FAILED:  org.apache.zookeeper.server.InvalidSnapshotTest.testInvalidSnapshot

Error Message:
waiting for server up

Stack Trace:
junit.framework.AssertionFailedError: waiting for server up
	at org.apache.zookeeper.test.ClientBase.startServerInstance(ClientBase.java:379)
	at org.apache.zookeeper.test.ClientBase.startServer(ClientBase.java:488)
	at org.apache.zookeeper.test.ClientBase.startServer(ClientBase.java:484)
	at org.apache.zookeeper.test.ClientBase.setUp(ClientBase.java:475)


FAILED:  org.apache.zookeeper.server.MultiOpSessionUpgradeTest.directCheckUpgradeSessionTest

Error Message:
waiting for server up

Stack Trace:
junit.framework.AssertionFailedError: waiting for server up
	at org.apache.zookeeper.test.QuorumBase.startServers(QuorumBase.java:223)
	at org.apache.zookeeper.test.QuorumBase.setUp(QuorumBase.java:120)
	at org.apache.zookeeper.test.QuorumBase.setUp(QuorumBase.java:78)
	at org.apache.zookeeper.server.MultiOpSessionUpgradeTest.setUp(MultiOpSessionUpgradeTest.java:54)


FAILED:  org.apache.zookeeper.server.MultiOpSessionUpgradeTest.ephemeralCreateMultiOpTest

Error Message:
waiting for server up

Stack Trace:
junit.framework.AssertionFailedError: waiting for server up
	at org.apache.zookeeper.test.QuorumBase.startServers(QuorumBase.java:223)
	at org.apache.zookeeper.test.QuorumBase.setUp(QuorumBase.java:120)
	at org.apache.zookeeper.test.QuorumBase.setUp(QuorumBase.java:78)
	at org.apache.zookeeper.server.MultiOpSessionUpgradeTest.setUp(MultiOpSessionUpgradeTest.java:54)


FAILED:  org.apache.zookeeper.server.MultiOpSessionUpgradeTest.testNull

Error Message:
waiting for server up

Stack Trace:
junit.framework.AssertionFailedError: waiting for server up
	at org.apache.zookeeper.test.QuorumBase.startServers(QuorumBase.java:223)
	at org.apache.zookeeper.test.QuorumBase.setUp(QuorumBase.java:120)
	at org.apache.zookeeper.test.QuorumBase.setUp(QuorumBase.java:78)
	at org.apache.zookeeper.server.MultiOpSessionUpgradeTest.setUp(MultiOpSessionUpgradeTest.java:54)


FAILED:  org.apache.zookeeper.server.NIOServerCnxnTest.testOperationsAfterCnxnClose

Error Message:
waiting for server up

Stack Trace:
junit.framework.AssertionFailedError: waiting for server up
	at org.apache.zookeeper.test.ClientBase.startServerInstance(ClientBase.java:379)
	at org.apache.zookeeper.test.ClientBase.startServer(ClientBase.java:488)
	at org.apache.zookeeper.test.ClientBase.startServer(ClientBase.java:484)
	at org.apache.zookeeper.test.ClientBase.setUp(ClientBase.java:475)


FAILED:  org.apache.zookeeper.server.PrepRequestProcessorTest.testInvalidPath

Error Message:
waiting for server up

Stack Trace:
junit.framework.AssertionFailedError: waiting for server up
	at org.apache.zookeeper.test.ClientBase.startServerInstance(ClientBase.java:379)
	at org.apache.zookeeper.test.ClientBase.startServer(ClientBase.java:488)
	at org.apache.zookeeper.test.ClientBase.startServer(ClientBase.java:484)
	at org.apache.zookeeper.test.ClientBase.setUp(ClientBase.java:475)


FAILED:  org.apache.zookeeper.server.PrepRequestProcessorTest.testMultiRollbackNoLastChange

Error Message:
waiting for server up

Stack Trace:
junit.framework.AssertionFailedError: waiting for server up
	at org.apache.zookeeper.test.ClientBase.startServerInstance(ClientBase.java:379)
	at org.apache.zookeeper.test.ClientBase.startServer(ClientBase.java:488)
	at org.apache.zookeeper.test.ClientBase.startServer(ClientBase.java:484)
	at org.apache.zookeeper.test.ClientBase.setUp(ClientBase.java:475)


FAILED:  org.apache.zookeeper.server.PrepRequestProcessorTest.testPRequest

Error Message:
waiting for server up

Stack Trace:
junit.framework.AssertionFailedError: waiting for server up
	at org.apache.zookeeper.test.ClientBase.startServerInstance(ClientBase.java:379)
	at org.apache.zookeeper.test.ClientBase.startServer(ClientBase.java:488)
	at org.apache.zookeeper.test.ClientBase.startServer(ClientBase.java:484)
	at org.apache.zookeeper.test.ClientBase.setUp(ClientBase.java:475)


FAILED:  org.apache.zookeeper.server.PrepRequestProcessorTest.testMultiOutstandingChange

Error Message:
waiting for server up

Stack Trace:
junit.framework.AssertionFailedError: waiting for server up
	at org.apache.zookeeper.test.ClientBase.startServerInstance(ClientBase.java:379)
	at org.apache.zookeeper.test.ClientBase.startServer(ClientBase.java:488)
	at org.apache.zookeeper.test.ClientBase.startServer(ClientBase.java:484)
	at org.apache.zookeeper.test.ClientBase.setUp(ClientBase.java:475)


FAILED:  org.apache.zookeeper.server.PurgeTxnTest.testPurge

Error Message:
waiting for server being up 

Stack Trace:
junit.framework.AssertionFailedError: waiting for server being up 
	at org.apache.zookeeper.server.PurgeTxnTest.testPurge(PurgeTxnTest.java:79)
	at org.apache.zookeeper.JUnit4ZKTestRunner$LoggedInvokeMethod.evaluate(JUnit4ZKTestRunner.java:79)


FAILED:  org.apache.zookeeper.server.PurgeTxnTest.testPurgeDoesNotDeleteOverlappingLogFile

Error Message:
waiting for server being up 

Stack Trace:
junit.framework.AssertionFailedError: waiting for server being up 
	at org.apache.zookeeper.server.PurgeTxnTest.testPurgeDoesNotDeleteOverlappingLogFile(PurgeTxnTest.java:460)
	at org.apache.zookeeper.JUnit4ZKTestRunner$LoggedInvokeMethod.evaluate(JUnit4ZKTestRunner.java:79)


FAILED:  org.apache.zookeeper.server.PurgeTxnTest.testPurgeWhenLogRollingInProgress

Error Message:
waiting for server being up 

Stack Trace:
junit.framework.AssertionFailedError: waiting for server being up 
	at org.apache.zookeeper.server.PurgeTxnTest.testPurgeWhenLogRollingInProgress(PurgeTxnTest.java:126)
	at org.apache.zookeeper.JUnit4ZKTestRunner$LoggedInvokeMethod.evaluate(JUnit4ZKTestRunner.java:79)


FAILED:  org.apache.zookeeper.server.ZooKeeperServerStartupTest.testFourLetterWords

Error Message:
Exception while executing four letter word: conf

Stack Trace:
java.io.IOException: Exception while executing four letter word: conf
	at org.apache.zookeeper.client.FourLetterWordMain.send4LetterWord(FourLetterWordMain.java:124)
	at org.apache.zookeeper.client.FourLetterWordMain.send4LetterWord(FourLetterWordMain.java:54)
	at org.apache.zookeeper.server.ZooKeeperServerStartupTest.sendRequest(ZooKeeperServerStartupTest.java:194)
	at org.apache.zookeeper.server.ZooKeeperServerStartupTest.verify(ZooKeeperServerStartupTest.java:187)
	at org.apache.zookeeper.server.ZooKeeperServerStartupTest.testFourLetterWords(ZooKeeperServerStartupTest.java:171)
	at org.apache.zookeeper.JUnit4ZKTestRunner$LoggedInvokeMethod.evaluate(JUnit4ZKTestRunner.java:79)
	at java.util.concurrent.FutureTask.run(FutureTask.java:262)
	at java.lang.Thread.run(Thread.java:745)
Caused by: java.net.SocketTimeoutException: Read timed out
	at java.net.SocketInputStream.socketRead0(Native Method)
	at java.net.SocketInputStream.read(SocketInputStream.java:152)
	at java.net.SocketInputStream.read(SocketInputStream.java:122)
	at sun.nio.cs.StreamDecoder.readBytes(StreamDecoder.java:283)
	at sun.nio.cs.StreamDecoder.implRead(StreamDecoder.java:325)
	at sun.nio.cs.StreamDecoder.read(StreamDecoder.java:177)
	at java.io.InputStreamReader.read(InputStreamReader.java:184)
	at java.io.BufferedReader.fill(BufferedReader.java:154)
	at java.io.BufferedReader.readLine(BufferedReader.java:317)
	at java.io.BufferedReader.readLine(BufferedReader.java:382)
	at org.apache.zookeeper.client.FourLetterWordMain.send4LetterWord(FourLetterWordMain.java:119)


FAILED:  org.apache.zookeeper.server.ZooKeeperServerStartupTest.testClientConnectionRequestDuringStartupWithNIOServerCnxn

Error Message:
test timed out after 30000 milliseconds

Stack Trace:
org.junit.runners.model.TestTimedOutException: test timed out after 30000 milliseconds
	at java.lang.Thread.sleep(Native Method)
	at org.apache.zookeeper.test.ClientBase.waitForServerUp(ClientBase.java:257)
	at org.apache.zookeeper.test.ClientBase.waitForServerUp(ClientBase.java:232)
	at org.apache.zookeeper.server.ZooKeeperServerStartupTest.testClientConnectionRequestDuringStartupWithNIOServerCnxn(ZooKeeperServerStartupTest.java:101)
	at org.apache.zookeeper.JUnit4ZKTestRunner$LoggedInvokeMethod.evaluate(JUnit4ZKTestRunner.java:79)
	at java.util.concurrent.FutureTask.run(FutureTask.java:262)
	at java.lang.Thread.run(Thread.java:745)


FAILED:  org.apache.zookeeper.server.ZxidRolloverTest.testSimpleRolloverFollower

Error Message:
null

Stack Trace:
java.lang.NullPointerException
	at org.apache.zookeeper.server.ZxidRolloverTest.tearDown(ZxidRolloverTest.java:217)


FAILED:  org.apache.zookeeper.server.ZxidRolloverTest.testRolloverThenLeaderRestart

Error Message:
null

Stack Trace:
java.lang.NullPointerException
	at org.apache.zookeeper.server.ZxidRolloverTest.tearDown(ZxidRolloverTest.java:217)


FAILED:  org.apache.zookeeper.server.ZxidRolloverTest.testRolloverThenFollowerRestart

Error Message:
null

Stack Trace:
java.lang.NullPointerException
	at org.apache.zookeeper.server.ZxidRolloverTest.tearDown(ZxidRolloverTest.java:217)


FAILED:  org.apache.zookeeper.server.ZxidRolloverTest.testMultipleRollover

Error Message:
null

Stack Trace:
java.lang.NullPointerException
	at org.apache.zookeeper.server.ZxidRolloverTest.tearDown(ZxidRolloverTest.java:217)


FAILED:  org.apache.zookeeper.server.ZxidRolloverTest.testRolloverThenRestart

Error Message:
null

Stack Trace:
java.lang.NullPointerException
	at org.apache.zookeeper.server.ZxidRolloverTest.tearDown(ZxidRolloverTest.java:217)


FAILED:  org.apache.zookeeper.server.admin.CommandsTest.testWatchesByPath

Error Message:
waiting for server up

Stack Trace:
junit.framework.AssertionFailedError: waiting for server up
	at org.apache.zookeeper.test.ClientBase.startServerInstance(ClientBase.java:379)
	at org.apache.zookeeper.test.ClientBase.startServer(ClientBase.java:488)
	at org.apache.zookeeper.test.ClientBase.startServer(ClientBase.java:484)
	at org.apache.zookeeper.test.ClientBase.setUp(ClientBase.java:475)


FAILED:  org.apache.zookeeper.server.admin.CommandsTest.testStatReset

Error Message:
waiting for server up

Stack Trace:
junit.framework.AssertionFailedError: waiting for server up
	at org.apache.zookeeper.test.ClientBase.startServerInstance(ClientBase.java:379)
	at org.apache.zookeeper.test.ClientBase.startServer(ClientBase.java:488)
	at org.apache.zookeeper.test.ClientBase.startServer(ClientBase.java:484)
	at org.apache.zookeeper.test.ClientBase.setUp(ClientBase.java:475)


FAILED:  org.apache.zookeeper.server.admin.CommandsTest.testServerStats

Error Message:
waiting for server up

Stack Trace:
junit.framework.AssertionFailedError: waiting for server up
	at org.apache.zookeeper.test.ClientBase.startServerInstance(ClientBase.java:379)
	at org.apache.zookeeper.test.ClientBase.startServer(ClientBase.java:488)
	at org.apache.zookeeper.test.ClientBase.startServer(ClientBase.java:484)
	at org.apache.zookeeper.test.ClientBase.setUp(ClientBase.java:475)


FAILED:  org.apache.zookeeper.server.admin.CommandsTest.testDump

Error Message:
waiting for server up

Stack Trace:
junit.framework.AssertionFailedError: waiting for server up
	at org.apache.zookeeper.test.ClientBase.startServerInstance(ClientBase.java:379)
	at org.apache.zookeeper.test.ClientBase.startServer(ClientBase.java:488)
	at org.apache.zookeeper.test.ClientBase.startServer(ClientBase.java:484)
	at org.apache.zookeeper.test.ClientBase.setUp(ClientBase.java:475)


FAILED:  org.apache.zookeeper.server.admin.CommandsTest.testRuok

Error Message:
waiting for server up

Stack Trace:
junit.framework.AssertionFailedError: waiting for server up
	at org.apache.zookeeper.test.ClientBase.startServerInstance(ClientBase.java:379)
	at org.apache.zookeeper.test.ClientBase.startServer(ClientBase.java:488)
	at org.apache.zookeeper.test.ClientBase.startServer(ClientBase.java:484)
	at org.apache.zookeeper.test.ClientBase.setUp(ClientBase.java:475)


FAILED:  org.apache.zookeeper.server.admin.CommandsTest.testStat

Error Message:
waiting for server up

Stack Trace:
junit.framework.AssertionFailedError: waiting for server up
	at org.apache.zookeeper.test.ClientBase.startServerInstance(ClientBase.java:379)
	at org.apache.zookeeper.test.ClientBase.startServer(ClientBase.java:488)
	at org.apache.zookeeper.test.ClientBase.startServer(ClientBase.java:484)
	at org.apache.zookeeper.test.ClientBase.setUp(ClientBase.java:475)


FAILED:  org.apache.zookeeper.server.admin.CommandsTest.testSetTraceMask

Error Message:
waiting for server up

Stack Trace:
junit.framework.AssertionFailedError: waiting for server up
	at org.apache.zookeeper.test.ClientBase.startServerInstance(ClientBase.java:379)
	at org.apache.zookeeper.test.ClientBase.startServer(ClientBase.java:488)
	at org.apache.zookeeper.test.ClientBase.startServer(ClientBase.java:484)
	at org.apache.zookeeper.test.ClientBase.setUp(ClientBase.java:475)


FAILED:  org.apache.zookeeper.server.admin.CommandsTest.testEnvironment

Error Message:
waiting for server up

Stack Trace:
junit.framework.AssertionFailedError: waiting for server up
	at org.apache.zookeeper.test.ClientBase.startServerInstance(ClientBase.java:379)
	at org.apache.zookeeper.test.ClientBase.startServer(ClientBase.java:488)
	at org.apache.zookeeper.test.ClientBase.startServer(ClientBase.java:484)
	at org.apache.zookeeper.test.ClientBase.setUp(ClientBase.java:475)


FAILED:  org.apache.zookeeper.server.admin.CommandsTest.testConfiguration

Error Message:
waiting for server up

Stack Trace:
junit.framework.AssertionFailedError: waiting for server up
	at org.apache.zookeeper.test.ClientBase.startServerInstance(ClientBase.java:379)
	at org.apache.zookeeper.test.ClientBase.startServer(ClientBase.java:488)
	at org.apache.zookeeper.test.ClientBase.startServer(ClientBase.java:484)
	at org.apache.zookeeper.test.ClientBase.setUp(ClientBase.java:475)


FAILED:  org.apache.zookeeper.server.admin.CommandsTest.testWatches

Error Message:
waiting for server up

Stack Trace:
junit.framework.AssertionFailedError: waiting for server up
	at org.apache.zookeeper.test.ClientBase.startServerInstance(ClientBase.java:379)
	at org.apache.zookeeper.test.ClientBase.startServer(ClientBase.java:488)
	at org.apache.zookeeper.test.ClientBase.startServer(ClientBase.java:484)
	at org.apache.zookeeper.test.ClientBase.setUp(ClientBase.java:475)


FAILED:  org.apache.zookeeper.server.admin.CommandsTest.testMonitor

Error Message:
waiting for server up

Stack Trace:
junit.framework.AssertionFailedError: waiting for server up
	at org.apache.zookeeper.test.ClientBase.startServerInstance(ClientBase.java:379)
	at org.apache.zookeeper.test.ClientBase.startServer(ClientBase.java:488)
	at org.apache.zookeeper.test.ClientBase.startServer(ClientBase.java:484)
	at org.apache.zookeeper.test.ClientBase.setUp(ClientBase.java:475)


FAILED:  org.apache.zookeeper.server.admin.CommandsTest.testConnections

Error Message:
waiting for server up

Stack Trace:
junit.framework.AssertionFailedError: waiting for server up
	at org.apache.zookeeper.test.ClientBase.startServerInstance(ClientBase.java:379)
	at org.apache.zookeeper.test.ClientBase.startServer(ClientBase.java:488)
	at org.apache.zookeeper.test.ClientBase.startServer(ClientBase.java:484)
	at org.apache.zookeeper.test.ClientBase.setUp(ClientBase.java:475)


FAILED:  org.apache.zookeeper.server.admin.CommandsTest.testGetTraceMask

Error Message:
waiting for server up

Stack Trace:
junit.framework.AssertionFailedError: waiting for server up
	at org.apache.zookeeper.test.ClientBase.startServerInstance(ClientBase.java:379)
	at org.apache.zookeeper.test.ClientBase.startServer(ClientBase.java:488)
	at org.apache.zookeeper.test.ClientBase.startServer(ClientBase.java:484)
	at org.apache.zookeeper.test.ClientBase.setUp(ClientBase.java:475)


FAILED:  org.apache.zookeeper.server.admin.CommandsTest.testWatchSummary

Error Message:
waiting for server up

Stack Trace:
junit.framework.AssertionFailedError: waiting for server up
	at org.apache.zookeeper.test.ClientBase.startServerInstance(ClientBase.java:379)
	at org.apache.zookeeper.test.ClientBase.startServer(ClientBase.java:488)
	at org.apache.zookeeper.test.ClientBase.startServer(ClientBase.java:484)
	at org.apache.zookeeper.test.ClientBase.setUp(ClientBase.java:475)


FAILED:  org.apache.zookeeper.server.admin.CommandsTest.testIsReadOnly

Error Message:
waiting for server up

Stack Trace:
junit.framework.AssertionFailedError: waiting for server up
	at org.apache.zookeeper.test.ClientBase.startServerInstance(ClientBase.java:379)
	at org.apache.zookeeper.test.ClientBase.startServer(ClientBase.java:488)
	at org.apache.zookeeper.test.ClientBase.startServer(ClientBase.java:484)
	at org.apache.zookeeper.test.ClientBase.setUp(ClientBase.java:475)


FAILED:  org.apache.zookeeper.server.admin.CommandsTest.testConnectionStatReset

Error Message:
waiting for server up

Stack Trace:
junit.framework.AssertionFailedError: waiting for server up
	at org.apache.zookeeper.test.ClientBase.startServerInstance(ClientBase.java:379)
	at org.apache.zookeeper.test.ClientBase.startServer(ClientBase.java:488)
	at org.apache.zookeeper.test.ClientBase.startServer(ClientBase.java:484)
	at org.apache.zookeeper.test.ClientBase.setUp(ClientBase.java:475)


FAILED:  org.apache.zookeeper.server.quorum.QuorumRequestPipelineTest.testNull[2]

Error Message:
Timeout occurred. Please note the time in the report does not reflect the time until the timeout.

Stack Trace:
junit.framework.AssertionFailedError: Timeout occurred. Please note the time in the report does not reflect the time until the timeout.
	at java.lang.Thread.run(Thread.java:745)


FAILED:  org.apache.zookeeper.server.quorum.ReconfigFailureCasesTest.testTooFewRemainingPariticipants

Error Message:
waiting for server up

Stack Trace:
junit.framework.AssertionFailedError: waiting for server up
	at org.apache.zookeeper.test.QuorumUtil.startAll(QuorumUtil.java:151)
	at org.apache.zookeeper.server.quorum.ReconfigFailureCasesTest.testTooFewRemainingPariticipants(ReconfigFailureCasesTest.java:116)
	at org.apache.zookeeper.JUnit4ZKTestRunner$LoggedInvokeMethod.evaluate(JUnit4ZKTestRunner.java:79)


FAILED:  org.apache.zookeeper.server.quorum.ReconfigFailureCasesTest.testReconfigVersionConditionFails

Error Message:
waiting for server up

Stack Trace:
junit.framework.AssertionFailedError: waiting for server up
	at org.apache.zookeeper.test.QuorumUtil.startAll(QuorumUtil.java:151)
	at org.apache.zookeeper.server.quorum.ReconfigFailureCasesTest.testReconfigVersionConditionFails(ReconfigFailureCasesTest.java:143)
	at org.apache.zookeeper.JUnit4ZKTestRunner$LoggedInvokeMethod.evaluate(JUnit4ZKTestRunner.java:79)


FAILED:  org.apache.zookeeper.server.quorum.ReconfigFailureCasesTest.testIncrementalReconfigInvokedOnHiearchicalQS

Error Message:
waiting for server up

Stack Trace:
junit.framework.AssertionFailedError: waiting for server up
	at org.apache.zookeeper.test.QuorumUtil.startAll(QuorumUtil.java:151)
	at org.apache.zookeeper.server.quorum.ReconfigFailureCasesTest.testIncrementalReconfigInvokedOnHiearchicalQS(ReconfigFailureCasesTest.java:66)
	at org.apache.zookeeper.JUnit4ZKTestRunner$LoggedInvokeMethod.evaluate(JUnit4ZKTestRunner.java:79)


FAILED:  org.apache.zookeeper.server.quorum.ReconfigFailureCasesTest.testLeaderTimesoutOnNewQuorum

Error Message:
waiting for server up

Stack Trace:
junit.framework.AssertionFailedError: waiting for server up
	at org.apache.zookeeper.test.QuorumUtil.startAll(QuorumUtil.java:151)
	at org.apache.zookeeper.server.quorum.ReconfigFailureCasesTest.testLeaderTimesoutOnNewQuorum(ReconfigFailureCasesTest.java:170)
	at org.apache.zookeeper.JUnit4ZKTestRunner$LoggedInvokeMethod.evaluate(JUnit4ZKTestRunner.java:79)


FAILED:  org.apache.zookeeper.test.ACLCountTest.testAclCount

Error Message:
waiting for server being up

Stack Trace:
junit.framework.AssertionFailedError: waiting for server being up
	at org.apache.zookeeper.test.ACLCountTest.testAclCount(ACLCountTest.java:82)
	at org.apache.zookeeper.JUnit4ZKTestRunner$LoggedInvokeMethod.evaluate(JUnit4ZKTestRunner.java:79)


FAILED:  org.apache.zookeeper.test.ACLRootTest.testRootAcl

Error Message:
waiting for server up

Stack Trace:
junit.framework.AssertionFailedError: waiting for server up
	at org.apache.zookeeper.test.ClientBase.startServerInstance(ClientBase.java:379)
	at org.apache.zookeeper.test.ClientBase.startServer(ClientBase.java:488)
	at org.apache.zookeeper.test.ClientBase.startServer(ClientBase.java:484)
	at org.apache.zookeeper.test.ClientBase.setUp(ClientBase.java:475)


FAILED:  org.apache.zookeeper.test.ACLTest.testAcls

Error Message:
waiting for server being up

Stack Trace:
junit.framework.AssertionFailedError: waiting for server being up
	at org.apache.zookeeper.test.ACLTest.testAcls(ACLTest.java:109)
	at org.apache.zookeeper.JUnit4ZKTestRunner$LoggedInvokeMethod.evaluate(JUnit4ZKTestRunner.java:79)


FAILED:  org.apache.zookeeper.test.ACLTest.testDisconnectedAddAuth

Error Message:
waiting for server being up

Stack Trace:
junit.framework.AssertionFailedError: waiting for server being up
	at org.apache.zookeeper.test.ACLTest.testDisconnectedAddAuth(ACLTest.java:73)
	at org.apache.zookeeper.JUnit4ZKTestRunner$LoggedInvokeMethod.evaluate(JUnit4ZKTestRunner.java:79)


FAILED:  org.apache.zookeeper.test.AsyncHammerTest.testHammer

Error Message:
waiting for server up

Stack Trace:
junit.framework.AssertionFailedError: waiting for server up
	at org.apache.zookeeper.test.QuorumBase.startServers(QuorumBase.java:223)
	at org.apache.zookeeper.test.QuorumBase.setUp(QuorumBase.java:120)
	at org.apache.zookeeper.test.AsyncHammerTest.setUp(AsyncHammerTest.java:52)
	at org.apache.zookeeper.test.AsyncHammerTest.testHammer(AsyncHammerTest.java:171)
	at org.apache.zookeeper.JUnit4ZKTestRunner$LoggedInvokeMethod.evaluate(JUnit4ZKTestRunner.java:79)


FAILED:  org.apache.zookeeper.test.AsyncHammerTest.testObserversHammer

Error Message:
waiting for server up

Stack Trace:
junit.framework.AssertionFailedError: waiting for server up
	at org.apache.zookeeper.test.QuorumBase.startServers(QuorumBase.java:223)
	at org.apache.zookeeper.test.QuorumBase.setUp(QuorumBase.java:120)
	at org.apache.zookeeper.test.AsyncHammerTest.setUp(AsyncHammerTest.java:52)
	at org.apache.zookeeper.test.AsyncHammerTest.testObserversHammer(AsyncHammerTest.java:203)
	at org.apache.zookeeper.JUnit4ZKTestRunner$LoggedInvokeMethod.evaluate(JUnit4ZKTestRunner.java:79)


FAILED:  org.apache.zookeeper.test.AsyncOpsTest.testAsyncCreate2Failure_NoChildForEphemeral

Error Message:
Timeout occurred. Please note the time in the report does not reflect the time until the timeout.

Stack Trace:
junit.framework.AssertionFailedError: Timeout occurred. Please note the time in the report does not reflect the time until the timeout.
	at java.lang.Thread.run(Thread.java:745)


FAILED:  org.apache.zookeeper.test.AsyncTest.testAsync

Error Message:
waiting for server up

Stack Trace:
junit.framework.AssertionFailedError: waiting for server up
	at org.apache.zookeeper.test.QuorumBase.startServers(QuorumBase.java:223)
	at org.apache.zookeeper.test.QuorumBase.setUp(QuorumBase.java:120)
	at org.apache.zookeeper.test.QuorumBase.setUp(QuorumBase.java:78)
	at org.apache.zookeeper.test.AsyncTest.setUp(AsyncTest.java:50)


FAILED:  org.apache.zookeeper.test.AuthTest.testSuper

Error Message:
waiting for server up

Stack Trace:
junit.framework.AssertionFailedError: waiting for server up
	at org.apache.zookeeper.test.ClientBase.startServerInstance(ClientBase.java:379)
	at org.apache.zookeeper.test.ClientBase.startServer(ClientBase.java:488)
	at org.apache.zookeeper.test.ClientBase.startServer(ClientBase.java:484)
	at org.apache.zookeeper.test.ClientBase.setUp(ClientBase.java:475)


FAILED:  org.apache.zookeeper.test.AuthTest.testSuperACL

Error Message:
waiting for server up

Stack Trace:
junit.framework.AssertionFailedError: waiting for server up
	at org.apache.zookeeper.test.ClientBase.startServerInstance(ClientBase.java:379)
	at org.apache.zookeeper.test.ClientBase.startServer(ClientBase.java:488)
	at org.apache.zookeeper.test.ClientBase.startServer(ClientBase.java:484)
	at org.apache.zookeeper.test.ClientBase.setUp(ClientBase.java:475)


FAILED:  org.apache.zookeeper.test.AuthTest.testBadAuthNotifiesWatch

Error Message:
waiting for server up

Stack Trace:
junit.framework.AssertionFailedError: waiting for server up
	at org.apache.zookeeper.test.ClientBase.startServerInstance(ClientBase.java:379)
	at org.apache.zookeeper.test.ClientBase.startServer(ClientBase.java:488)
	at org.apache.zookeeper.test.ClientBase.startServer(ClientBase.java:484)
	at org.apache.zookeeper.test.ClientBase.setUp(ClientBase.java:475)


FAILED:  org.apache.zookeeper.test.AuthTest.testBadAuthThenSendOtherCommands

Error Message:
waiting for server up

Stack Trace:
junit.framework.AssertionFailedError: waiting for server up
	at org.apache.zookeeper.test.ClientBase.startServerInstance(ClientBase.java:379)
	at org.apache.zookeeper.test.ClientBase.startServer(ClientBase.java:488)
	at org.apache.zookeeper.test.ClientBase.startServer(ClientBase.java:484)
	at org.apache.zookeeper.test.ClientBase.setUp(ClientBase.java:475)


FAILED:  org.apache.zookeeper.test.BufferSizeTest.testCreatesReqs

Error Message:
waiting for server up

Stack Trace:
junit.framework.AssertionFailedError: waiting for server up
	at org.apache.zookeeper.test.ClientBase.startServerInstance(ClientBase.java:379)
	at org.apache.zookeeper.test.ClientBase.startServer(ClientBase.java:488)
	at org.apache.zookeeper.test.ClientBase.startServer(ClientBase.java:484)
	at org.apache.zookeeper.test.ClientBase.setUp(ClientBase.java:475)


FAILED:  org.apache.zookeeper.test.BufferSizeTest.testStartupFailureSnapshot

Error Message:
waiting for server up

Stack Trace:
junit.framework.AssertionFailedError: waiting for server up
	at org.apache.zookeeper.test.ClientBase.startServerInstance(ClientBase.java:379)
	at org.apache.zookeeper.test.ClientBase.startServer(ClientBase.java:488)
	at org.apache.zookeeper.test.ClientBase.startServer(ClientBase.java:484)
	at org.apache.zookeeper.test.ClientBase.setUp(ClientBase.java:475)


FAILED:  org.apache.zookeeper.test.BufferSizeTest.testStartupFailureSet

Error Message:
waiting for server up

Stack Trace:
junit.framework.AssertionFailedError: waiting for server up
	at org.apache.zookeeper.test.ClientBase.startServerInstance(ClientBase.java:379)
	at org.apache.zookeeper.test.ClientBase.startServer(ClientBase.java:488)
	at org.apache.zookeeper.test.ClientBase.startServer(ClientBase.java:484)
	at org.apache.zookeeper.test.ClientBase.setUp(ClientBase.java:475)


FAILED:  org.apache.zookeeper.test.BufferSizeTest.testStartupFailureCreate

Error Message:
waiting for server up

Stack Trace:
junit.framework.AssertionFailedError: waiting for server up
	at org.apache.zookeeper.test.ClientBase.startServerInstance(ClientBase.java:379)
	at org.apache.zookeeper.test.ClientBase.startServer(ClientBase.java:488)
	at org.apache.zookeeper.test.ClientBase.startServer(ClientBase.java:484)
	at org.apache.zookeeper.test.ClientBase.setUp(ClientBase.java:475)


FAILED:  org.apache.zookeeper.test.BufferSizeTest.testSetReqs

Error Message:
waiting for server up

Stack Trace:
junit.framework.AssertionFailedError: waiting for server up
	at org.apache.zookeeper.test.ClientBase.startServerInstance(ClientBase.java:379)
	at org.apache.zookeeper.test.ClientBase.startServer(ClientBase.java:488)
	at org.apache.zookeeper.test.ClientBase.startServer(ClientBase.java:484)
	at org.apache.zookeeper.test.ClientBase.setUp(ClientBase.java:475)


FAILED:  org.apache.zookeeper.test.BufferSizeTest.testStartup

Error Message:
waiting for server up

Stack Trace:
junit.framework.AssertionFailedError: waiting for server up
	at org.apache.zookeeper.test.ClientBase.startServerInstance(ClientBase.java:379)
	at org.apache.zookeeper.test.ClientBase.startServer(ClientBase.java:488)
	at org.apache.zookeeper.test.ClientBase.startServer(ClientBase.java:484)
	at org.apache.zookeeper.test.ClientBase.setUp(ClientBase.java:475)


FAILED:  org.apache.zookeeper.test.ChrootAsyncTest.testAsyncCreate2Failure_NoChildForEphemeral

Error Message:
Timeout occurred. Please note the time in the report does not reflect the time until the timeout.

Stack Trace:
junit.framework.AssertionFailedError: Timeout occurred. Please note the time in the report does not reflect the time until the timeout.
	at java.lang.Thread.run(Thread.java:745)


FAILED:  org.apache.zookeeper.test.ChrootClientTest.testPing

Error Message:
waiting for server up

Stack Trace:
junit.framework.AssertionFailedError: waiting for server up
	at org.apache.zookeeper.test.ClientBase.startServerInstance(ClientBase.java:379)
	at org.apache.zookeeper.test.ClientBase.startServer(ClientBase.java:488)
	at org.apache.zookeeper.test.ClientBase.startServer(ClientBase.java:484)
	at org.apache.zookeeper.test.ClientBase.setUp(ClientBase.java:475)
	at org.apache.zookeeper.test.ChrootClientTest.setUp(ChrootClientTest.java:37)


FAILED:  org.apache.zookeeper.test.ChrootClientTest.testTryWithResources

Error Message:
waiting for server up

Stack Trace:
junit.framework.AssertionFailedError: waiting for server up
	at org.apache.zookeeper.test.ClientBase.startServerInstance(ClientBase.java:379)
	at org.apache.zookeeper.test.ClientBase.startServer(ClientBase.java:488)
	at org.apache.zookeeper.test.ClientBase.startServer(ClientBase.java:484)
	at org.apache.zookeeper.test.ClientBase.setUp(ClientBase.java:475)
	at org.apache.zookeeper.test.ChrootClientTest.setUp(ChrootClientTest.java:37)


FAILED:  org.apache.zookeeper.test.ChrootClientTest.testACLs

Error Message:
waiting for server up

Stack Trace:
junit.framework.AssertionFailedError: waiting for server up
	at org.apache.zookeeper.test.ClientBase.startServerInstance(ClientBase.java:379)
	at org.apache.zookeeper.test.ClientBase.startServer(ClientBase.java:488)
	at org.apache.zookeeper.test.ClientBase.startServer(ClientBase.java:484)
	at org.apache.zookeeper.test.ClientBase.setUp(ClientBase.java:475)
	at org.apache.zookeeper.test.ChrootClientTest.setUp(ChrootClientTest.java:37)


FAILED:  org.apache.zookeeper.test.ChrootClientTest.testClientCleanup

Error Message:
waiting for server up

Stack Trace:
junit.framework.AssertionFailedError: waiting for server up
	at org.apache.zookeeper.test.ClientBase.startServerInstance(ClientBase.java:379)
	at org.apache.zookeeper.test.ClientBase.startServer(ClientBase.java:488)
	at org.apache.zookeeper.test.ClientBase.startServer(ClientBase.java:484)
	at org.apache.zookeeper.test.ClientBase.setUp(ClientBase.java:475)
	at org.apache.zookeeper.test.ChrootClientTest.setUp(ChrootClientTest.java:37)


FAILED:  org.apache.zookeeper.test.ChrootClientTest.testClientwithoutWatcherObj

Error Message:
waiting for server up

Stack Trace:
junit.framework.AssertionFailedError: waiting for server up
	at org.apache.zookeeper.test.ClientBase.startServerInstance(ClientBase.java:379)
	at org.apache.zookeeper.test.ClientBase.startServer(ClientBase.java:488)
	at org.apache.zookeeper.test.ClientBase.startServer(ClientBase.java:484)
	at org.apache.zookeeper.test.ClientBase.setUp(ClientBase.java:475)
	at org.apache.zookeeper.test.ChrootClientTest.setUp(ChrootClientTest.java:37)


FAILED:  org.apache.zookeeper.test.ChrootClientTest.testSequentialNodeData

Error Message:
waiting for server up

Stack Trace:
junit.framework.AssertionFailedError: waiting for server up
	at org.apache.zookeeper.test.ClientBase.startServerInstance(ClientBase.java:379)
	at org.apache.zookeeper.test.ClientBase.startServer(ClientBase.java:488)
	at org.apache.zookeeper.test.ClientBase.startServer(ClientBase.java:484)
	at org.apache.zookeeper.test.ClientBase.setUp(ClientBase.java:475)
	at org.apache.zookeeper.test.ChrootClientTest.setUp(ChrootClientTest.java:37)


FAILED:  org.apache.zookeeper.test.ChrootClientTest.testSequentialNodeNames

Error Message:
waiting for server up

Stack Trace:
junit.framework.AssertionFailedError: waiting for server up
	at org.apache.zookeeper.test.ClientBase.startServerInstance(ClientBase.java:379)
	at org.apache.zookeeper.test.ClientBase.startServer(ClientBase.java:488)
	at org.apache.zookeeper.test.ClientBase.startServer(ClientBase.java:484)
	at org.apache.zookeeper.test.ClientBase.setUp(ClientBase.java:475)
	at org.apache.zookeeper.test.ChrootClientTest.setUp(ChrootClientTest.java:37)


FAILED:  org.apache.zookeeper.test.ChrootClientTest.testClientWithWatcherObj

Error Message:
waiting for server up

Stack Trace:
junit.framework.AssertionFailedError: waiting for server up
	at org.apache.zookeeper.test.ClientBase.startServerInstance(ClientBase.java:379)
	at org.apache.zookeeper.test.ClientBase.startServer(ClientBase.java:488)
	at org.apache.zookeeper.test.ClientBase.startServer(ClientBase.java:484)
	at org.apache.zookeeper.test.ClientBase.setUp(ClientBase.java:475)
	at org.apache.zookeeper.test.ChrootClientTest.setUp(ChrootClientTest.java:37)


FAILED:  org.apache.zookeeper.test.ChrootClientTest.testTestability

Error Message:
waiting for server up

Stack Trace:
junit.framework.AssertionFailedError: waiting for server up
	at org.apache.zookeeper.test.ClientBase.startServerInstance(ClientBase.java:379)
	at org.apache.zookeeper.test.ClientBase.startServer(ClientBase.java:488)
	at org.apache.zookeeper.test.ClientBase.startServer(ClientBase.java:484)
	at org.apache.zookeeper.test.ClientBase.setUp(ClientBase.java:475)
	at org.apache.zookeeper.test.ChrootClientTest.setUp(ChrootClientTest.java:37)


FAILED:  org.apache.zookeeper.test.ChrootClientTest.testNullAuthId

Error Message:
waiting for server up

Stack Trace:
junit.framework.AssertionFailedError: waiting for server up
	at org.apache.zookeeper.test.ClientBase.startServerInstance(ClientBase.java:379)
	at org.apache.zookeeper.test.ClientBase.startServer(ClientBase.java:488)
	at org.apache.zookeeper.test.ClientBase.startServer(ClientBase.java:484)
	at org.apache.zookeeper.test.ClientBase.setUp(ClientBase.java:475)
	at org.apache.zookeeper.test.ChrootClientTest.setUp(ChrootClientTest.java:37)


FAILED:  org.apache.zookeeper.test.ChrootClientTest.testNonExistingOpCode

Error Message:
waiting for server up

Stack Trace:
junit.framework.AssertionFailedError: waiting for server up
	at org.apache.zookeeper.test.ClientBase.startServerInstance(ClientBase.java:379)
	at org.apache.zookeeper.test.ClientBase.startServer(ClientBase.java:488)
	at org.apache.zookeeper.test.ClientBase.startServer(ClientBase.java:484)
	at org.apache.zookeeper.test.ClientBase.setUp(ClientBase.java:475)
	at org.apache.zookeeper.test.ChrootClientTest.setUp(ChrootClientTest.java:37)


FAILED:  org.apache.zookeeper.test.ChrootClientTest.testDeleteWithChildren

Error Message:
waiting for server up

Stack Trace:
junit.framework.AssertionFailedError: waiting for server up
	at org.apache.zookeeper.test.ClientBase.startServerInstance(ClientBase.java:379)
	at org.apache.zookeeper.test.ClientBase.startServer(ClientBase.java:488)
	at org.apache.zookeeper.test.ClientBase.startServer(ClientBase.java:484)
	at org.apache.zookeeper.test.ClientBase.setUp(ClientBase.java:475)
	at org.apache.zookeeper.test.ChrootClientTest.setUp(ChrootClientTest.java:37)


FAILED:  org.apache.zookeeper.test.ChrootClientTest.testPathValidation

Error Message:
waiting for server up

Stack Trace:
junit.framework.AssertionFailedError: waiting for server up
	at org.apache.zookeeper.test.ClientBase.startServerInstance(ClientBase.java:379)
	at org.apache.zookeeper.test.ClientBase.startServer(ClientBase.java:488)
	at org.apache.zookeeper.test.ClientBase.startServer(ClientBase.java:484)
	at org.apache.zookeeper.test.ClientBase.setUp(ClientBase.java:475)
	at org.apache.zookeeper.test.ChrootClientTest.setUp(ChrootClientTest.java:37)


FAILED:  org.apache.zookeeper.test.ChrootClientTest.testLargeNodeData

Error Message:
waiting for server up

Stack Trace:
junit.framework.AssertionFailedError: waiting for server up
	at org.apache.zookeeper.test.ClientBase.startServerInstance(ClientBase.java:379)
	at org.apache.zookeeper.test.ClientBase.startServer(ClientBase.java:488)
	at org.apache.zookeeper.test.ClientBase.startServer(ClientBase.java:484)
	at org.apache.zookeeper.test.ClientBase.setUp(ClientBase.java:475)
	at org.apache.zookeeper.test.ChrootClientTest.setUp(ChrootClientTest.java:37)


FAILED:  org.apache.zookeeper.test.ChrootClientTest.testMutipleWatcherObjs

Error Message:
waiting for server up

Stack Trace:
junit.framework.AssertionFailedError: waiting for server up
	at org.apache.zookeeper.test.ClientBase.startServerInstance(ClientBase.java:379)
	at org.apache.zookeeper.test.ClientBase.startServer(ClientBase.java:488)
	at org.apache.zookeeper.test.ClientBase.startServer(ClientBase.java:484)
	at org.apache.zookeeper.test.ClientBase.setUp(ClientBase.java:475)
	at org.apache.zookeeper.test.ChrootClientTest.setUp(ChrootClientTest.java:37)


FAILED:  org.apache.zookeeper.test.ChrootTest.testChrootSynchronous

Error Message:
waiting for server up

Stack Trace:
junit.framework.AssertionFailedError: waiting for server up
	at org.apache.zookeeper.test.ClientBase.startServerInstance(ClientBase.java:379)
	at org.apache.zookeeper.test.ClientBase.startServer(ClientBase.java:488)
	at org.apache.zookeeper.test.ClientBase.startServer(ClientBase.java:484)
	at org.apache.zookeeper.test.ClientBase.setUp(ClientBase.java:475)


FAILED:  org.apache.zookeeper.test.ClientHammerTest.testHammerBasic

Error Message:
waiting for server up

Stack Trace:
junit.framework.AssertionFailedError: waiting for server up
	at org.apache.zookeeper.test.ClientBase.startServerInstance(ClientBase.java:379)
	at org.apache.zookeeper.test.ClientBase.startServer(ClientBase.java:488)
	at org.apache.zookeeper.test.ClientBase.startServer(ClientBase.java:484)
	at org.apache.zookeeper.test.ClientBase.setUp(ClientBase.java:475)


FAILED:  org.apache.zookeeper.test.ClientHammerTest.testHammerSuper

Error Message:
waiting for server up

Stack Trace:
junit.framework.AssertionFailedError: waiting for server up
	at org.apache.zookeeper.test.ClientBase.startServerInstance(ClientBase.java:379)
	at org.apache.zookeeper.test.ClientBase.startServer(ClientBase.java:488)
	at org.apache.zookeeper.test.ClientBase.startServer(ClientBase.java:484)
	at org.apache.zookeeper.test.ClientBase.setUp(ClientBase.java:475)


FAILED:  org.apache.zookeeper.test.ClientPortBindTest.testBindByAddress

Error Message:
waiting for server up

Stack Trace:
junit.framework.AssertionFailedError: waiting for server up
	at org.apache.zookeeper.test.ClientPortBindTest.testBindByAddress(ClientPortBindTest.java:91)
	at org.apache.zookeeper.JUnit4ZKTestRunner$LoggedInvokeMethod.evaluate(JUnit4ZKTestRunner.java:79)


FAILED:  org.apache.zookeeper.test.ClientRetryTest.testClientRetry

Error Message:
waiting for server up

Stack Trace:
junit.framework.AssertionFailedError: waiting for server up
	at org.apache.zookeeper.test.ClientBase.startServerInstance(ClientBase.java:379)
	at org.apache.zookeeper.test.ClientBase.startServer(ClientBase.java:488)
	at org.apache.zookeeper.test.ClientBase.startServer(ClientBase.java:484)
	at org.apache.zookeeper.test.ClientBase.setUp(ClientBase.java:475)
	at org.apache.zookeeper.test.ClientRetryTest.setUp(ClientRetryTest.java:33)


FAILED:  org.apache.zookeeper.test.ClientSkipACLTest.testTryWithResources

Error Message:
waiting for server up

Stack Trace:
junit.framework.AssertionFailedError: waiting for server up
	at org.apache.zookeeper.test.ClientBase.startServerInstance(ClientBase.java:379)
	at org.apache.zookeeper.test.ClientBase.startServer(ClientBase.java:488)
	at org.apache.zookeeper.test.ClientBase.startServer(ClientBase.java:484)
	at org.apache.zookeeper.test.ClientBase.setUp(ClientBase.java:475)


FAILED:  org.apache.zookeeper.test.ClientSkipACLTest.testACLs

Error Message:
waiting for server up

Stack Trace:
junit.framework.AssertionFailedError: waiting for server up
	at org.apache.zookeeper.test.ClientBase.startServerInstance(ClientBase.java:379)
	at org.apache.zookeeper.test.ClientBase.startServer(ClientBase.java:488)
	at org.apache.zookeeper.test.ClientBase.startServer(ClientBase.java:484)
	at org.apache.zookeeper.test.ClientBase.setUp(ClientBase.java:475)


FAILED:  org.apache.zookeeper.test.ClientSkipACLTest.testPing

Error Message:
waiting for server up

Stack Trace:
junit.framework.AssertionFailedError: waiting for server up
	at org.apache.zookeeper.test.ClientBase.startServerInstance(ClientBase.java:379)
	at org.apache.zookeeper.test.ClientBase.startServer(ClientBase.java:488)
	at org.apache.zookeeper.test.ClientBase.startServer(ClientBase.java:484)
	at org.apache.zookeeper.test.ClientBase.setUp(ClientBase.java:475)


FAILED:  org.apache.zookeeper.test.ClientSkipACLTest.testClientCleanup

Error Message:
waiting for server up

Stack Trace:
junit.framework.AssertionFailedError: waiting for server up
	at org.apache.zookeeper.test.ClientBase.startServerInstance(ClientBase.java:379)
	at org.apache.zookeeper.test.ClientBase.startServer(ClientBase.java:488)
	at org.apache.zookeeper.test.ClientBase.startServer(ClientBase.java:484)
	at org.apache.zookeeper.test.ClientBase.setUp(ClientBase.java:475)


FAILED:  org.apache.zookeeper.test.ClientSkipACLTest.testClientwithoutWatcherObj

Error Message:
waiting for server up

Stack Trace:
junit.framework.AssertionFailedError: waiting for server up
	at org.apache.zookeeper.test.ClientBase.startServerInstance(ClientBase.java:379)
	at org.apache.zookeeper.test.ClientBase.startServer(ClientBase.java:488)
	at org.apache.zookeeper.test.ClientBase.startServer(ClientBase.java:484)
	at org.apache.zookeeper.test.ClientBase.setUp(ClientBase.java:475)


FAILED:  org.apache.zookeeper.test.ClientSkipACLTest.testSequentialNodeData

Error Message:
waiting for server up

Stack Trace:
junit.framework.AssertionFailedError: waiting for server up
	at org.apache.zookeeper.test.ClientBase.startServerInstance(ClientBase.java:379)
	at org.apache.zookeeper.test.ClientBase.startServer(ClientBase.java:488)
	at org.apache.zookeeper.test.ClientBase.startServer(ClientBase.java:484)
	at org.apache.zookeeper.test.ClientBase.setUp(ClientBase.java:475)


FAILED:  org.apache.zookeeper.test.ClientSkipACLTest.testSequentialNodeNames

Error Message:
waiting for server up

Stack Trace:
junit.framework.AssertionFailedError: waiting for server up
	at org.apache.zookeeper.test.ClientBase.startServerInstance(ClientBase.java:379)
	at org.apache.zookeeper.test.ClientBase.startServer(ClientBase.java:488)
	at org.apache.zookeeper.test.ClientBase.startServer(ClientBase.java:484)
	at org.apache.zookeeper.test.ClientBase.setUp(ClientBase.java:475)


FAILED:  org.apache.zookeeper.test.ClientSkipACLTest.testClientWithWatcherObj

Error Message:
waiting for server up

Stack Trace:
junit.framework.AssertionFailedError: waiting for server up
	at org.apache.zookeeper.test.ClientBase.startServerInstance(ClientBase.java:379)
	at org.apache.zookeeper.test.ClientBase.startServer(ClientBase.java:488)
	at org.apache.zookeeper.test.ClientBase.startServer(ClientBase.java:484)
	at org.apache.zookeeper.test.ClientBase.setUp(ClientBase.java:475)


FAILED:  org.apache.zookeeper.test.ClientSkipACLTest.testTestability

Error Message:
waiting for server up

Stack Trace:
junit.framework.AssertionFailedError: waiting for server up
	at org.apache.zookeeper.test.ClientBase.startServerInstance(ClientBase.java:379)
	at org.apache.zookeeper.test.ClientBase.startServer(ClientBase.java:488)
	at org.apache.zookeeper.test.ClientBase.startServer(ClientBase.java:484)
	at org.apache.zookeeper.test.ClientBase.setUp(ClientBase.java:475)


FAILED:  org.apache.zookeeper.test.ClientSkipACLTest.testNullAuthId

Error Message:
waiting for server up

Stack Trace:
junit.framework.AssertionFailedError: waiting for server up
	at org.apache.zookeeper.test.ClientBase.startServerInstance(ClientBase.java:379)
	at org.apache.zookeeper.test.ClientBase.startServer(ClientBase.java:488)
	at org.apache.zookeeper.test.ClientBase.startServer(ClientBase.java:484)
	at org.apache.zookeeper.test.ClientBase.setUp(ClientBase.java:475)


FAILED:  org.apache.zookeeper.test.ClientSkipACLTest.testNonExistingOpCode

Error Message:
waiting for server up

Stack Trace:
junit.framework.AssertionFailedError: waiting for server up
	at org.apache.zookeeper.test.ClientBase.startServerInstance(ClientBase.java:379)
	at org.apache.zookeeper.test.ClientBase.startServer(ClientBase.java:488)
	at org.apache.zookeeper.test.ClientBase.startServer(ClientBase.java:484)
	at org.apache.zookeeper.test.ClientBase.setUp(ClientBase.java:475)


FAILED:  org.apache.zookeeper.test.ClientSkipACLTest.testDeleteWithChildren

Error Message:
waiting for server up

Stack Trace:
junit.framework.AssertionFailedError: waiting for server up
	at org.apache.zookeeper.test.ClientBase.startServerInstance(ClientBase.java:379)
	at org.apache.zookeeper.test.ClientBase.startServer(ClientBase.java:488)
	at org.apache.zookeeper.test.ClientBase.startServer(ClientBase.java:484)
	at org.apache.zookeeper.test.ClientBase.setUp(ClientBase.java:475)


FAILED:  org.apache.zookeeper.test.ClientSkipACLTest.testPathValidation

Error Message:
waiting for server up

Stack Trace:
junit.framework.AssertionFailedError: waiting for server up
	at org.apache.zookeeper.test.ClientBase.startServerInstance(ClientBase.java:379)
	at org.apache.zookeeper.test.ClientBase.startServer(ClientBase.java:488)
	at org.apache.zookeeper.test.ClientBase.startServer(ClientBase.java:484)
	at org.apache.zookeeper.test.ClientBase.setUp(ClientBase.java:475)


FAILED:  org.apache.zookeeper.test.ClientSkipACLTest.testLargeNodeData

Error Message:
waiting for server up

Stack Trace:
junit.framework.AssertionFailedError: waiting for server up
	at org.apache.zookeeper.test.ClientBase.startServerInstance(ClientBase.java:379)
	at org.apache.zookeeper.test.ClientBase.startServer(ClientBase.java:488)
	at org.apache.zookeeper.test.ClientBase.startServer(ClientBase.java:484)
	at org.apache.zookeeper.test.ClientBase.setUp(ClientBase.java:475)


FAILED:  org.apache.zookeeper.test.ClientSkipACLTest.testMutipleWatcherObjs

Error Message:
waiting for server up

Stack Trace:
junit.framework.AssertionFailedError: waiting for server up
	at org.apache.zookeeper.test.ClientBase.startServerInstance(ClientBase.java:379)
	at org.apache.zookeeper.test.ClientBase.startServer(ClientBase.java:488)
	at org.apache.zookeeper.test.ClientBase.startServer(ClientBase.java:484)
	at org.apache.zookeeper.test.ClientBase.setUp(ClientBase.java:475)


FAILED:  org.apache.zookeeper.test.ClientTest.testTryWithResources

Error Message:
waiting for server up

Stack Trace:
junit.framework.AssertionFailedError: waiting for server up
	at org.apache.zookeeper.test.ClientBase.startServerInstance(ClientBase.java:379)
	at org.apache.zookeeper.test.ClientBase.startServer(ClientBase.java:488)
	at org.apache.zookeeper.test.ClientBase.startServer(ClientBase.java:484)
	at org.apache.zookeeper.test.ClientBase.setUp(ClientBase.java:475)


FAILED:  org.apache.zookeeper.test.ClientTest.testACLs

Error Message:
waiting for server up

Stack Trace:
junit.framework.AssertionFailedError: waiting for server up
	at org.apache.zookeeper.test.ClientBase.startServerInstance(ClientBase.java:379)
	at org.apache.zookeeper.test.ClientBase.startServer(ClientBase.java:488)
	at org.apache.zookeeper.test.ClientBase.startServer(ClientBase.java:484)
	at org.apache.zookeeper.test.ClientBase.setUp(ClientBase.java:475)


FAILED:  org.apache.zookeeper.test.ClientTest.testPing

Error Message:
waiting for server up

Stack Trace:
junit.framework.AssertionFailedError: waiting for server up
	at org.apache.zookeeper.test.ClientBase.startServerInstance(ClientBase.java:379)
	at org.apache.zookeeper.test.ClientBase.startServer(ClientBase.java:488)
	at org.apache.zookeeper.test.ClientBase.startServer(ClientBase.java:484)
	at org.apache.zookeeper.test.ClientBase.setUp(ClientBase.java:475)


FAILED:  org.apache.zookeeper.test.ClientTest.testClientCleanup

Error Message:
waiting for server up

Stack Trace:
junit.framework.AssertionFailedError: waiting for server up
	at org.apache.zookeeper.test.ClientBase.startServerInstance(ClientBase.java:379)
	at org.apache.zookeeper.test.ClientBase.startServer(ClientBase.java:488)
	at org.apache.zookeeper.test.ClientBase.startServer(ClientBase.java:484)
	at org.apache.zookeeper.test.ClientBase.setUp(ClientBase.java:475)


FAILED:  org.apache.zookeeper.test.ClientTest.testClientwithoutWatcherObj

Error Message:
waiting for server up

Stack Trace:
junit.framework.AssertionFailedError: waiting for server up
	at org.apache.zookeeper.test.ClientBase.startServerInstance(ClientBase.java:379)
	at org.apache.zookeeper.test.ClientBase.startServer(ClientBase.java:488)
	at org.apache.zookeeper.test.ClientBase.startServer(ClientBase.java:484)
	at org.apache.zookeeper.test.ClientBase.setUp(ClientBase.java:475)


FAILED:  org.apache.zookeeper.test.ClientTest.testSequentialNodeData

Error Message:
waiting for server up

Stack Trace:
junit.framework.AssertionFailedError: waiting for server up
	at org.apache.zookeeper.test.ClientBase.startServerInstance(ClientBase.java:379)
	at org.apache.zookeeper.test.ClientBase.startServer(ClientBase.java:488)
	at org.apache.zookeeper.test.ClientBase.startServer(ClientBase.java:484)
	at org.apache.zookeeper.test.ClientBase.setUp(ClientBase.java:475)


FAILED:  org.apache.zookeeper.test.ClientTest.testSequentialNodeNames

Error Message:
waiting for server up

Stack Trace:
junit.framework.AssertionFailedError: waiting for server up
	at org.apache.zookeeper.test.ClientBase.startServerInstance(ClientBase.java:379)
	at org.apache.zookeeper.test.ClientBase.startServer(ClientBase.java:488)
	at org.apache.zookeeper.test.ClientBase.startServer(ClientBase.java:484)
	at org.apache.zookeeper.test.ClientBase.setUp(ClientBase.java:475)


FAILED:  org.apache.zookeeper.test.ClientTest.testClientWithWatcherObj

Error Message:
waiting for server up

Stack Trace:
junit.framework.AssertionFailedError: waiting for server up
	at org.apache.zookeeper.test.ClientBase.startServerInstance(ClientBase.java:379)
	at org.apache.zookeeper.test.ClientBase.startServer(ClientBase.java:488)
	at org.apache.zookeeper.test.ClientBase.startServer(ClientBase.java:484)
	at org.apache.zookeeper.test.ClientBase.setUp(ClientBase.java:475)


FAILED:  org.apache.zookeeper.test.ClientTest.testTestability

Error Message:
waiting for server up

Stack Trace:
junit.framework.AssertionFailedError: waiting for server up
	at org.apache.zookeeper.test.ClientBase.startServerInstance(ClientBase.java:379)
	at org.apache.zookeeper.test.ClientBase.startServer(ClientBase.java:488)
	at org.apache.zookeeper.test.ClientBase.startServer(ClientBase.java:484)
	at org.apache.zookeeper.test.ClientBase.setUp(ClientBase.java:475)


FAILED:  org.apache.zookeeper.test.ClientTest.testNullAuthId

Error Message:
waiting for server up

Stack Trace:
junit.framework.AssertionFailedError: waiting for server up
	at org.apache.zookeeper.test.ClientBase.startServerInstance(ClientBase.java:379)
	at org.apache.zookeeper.test.ClientBase.startServer(ClientBase.java:488)
	at org.apache.zookeeper.test.ClientBase.startServer(ClientBase.java:484)
	at org.apache.zookeeper.test.ClientBase.setUp(ClientBase.java:475)


FAILED:  org.apache.zookeeper.test.ClientTest.testNonExistingOpCode

Error Message:
waiting for server up

Stack Trace:
junit.framework.AssertionFailedError: waiting for server up
	at org.apache.zookeeper.test.ClientBase.startServerInstance(ClientBase.java:379)
	at org.apache.zookeeper.test.ClientBase.startServer(ClientBase.java:488)
	at org.apache.zookeeper.test.ClientBase.startServer(ClientBase.java:484)
	at org.apache.zookeeper.test.ClientBase.setUp(ClientBase.java:475)


FAILED:  org.apache.zookeeper.test.ClientTest.testDeleteWithChildren

Error Message:
waiting for server up

Stack Trace:
junit.framework.AssertionFailedError: waiting for server up
	at org.apache.zookeeper.test.ClientBase.startServerInstance(ClientBase.java:379)
	at org.apache.zookeeper.test.ClientBase.startServer(ClientBase.java:488)
	at org.apache.zookeeper.test.ClientBase.startServer(ClientBase.java:484)
	at org.apache.zookeeper.test.ClientBase.setUp(ClientBase.java:475)


FAILED:  org.apache.zookeeper.test.ClientTest.testPathValidation

Error Message:
waiting for server up

Stack Trace:
junit.framework.AssertionFailedError: waiting for server up
	at org.apache.zookeeper.test.ClientBase.startServerInstance(ClientBase.java:379)
	at org.apache.zookeeper.test.ClientBase.startServer(ClientBase.java:488)
	at org.apache.zookeeper.test.ClientBase.startServer(ClientBase.java:484)
	at org.apache.zookeeper.test.ClientBase.setUp(ClientBase.java:475)


FAILED:  org.apache.zookeeper.test.ClientTest.testLargeNodeData

Error Message:
waiting for server up

Stack Trace:
junit.framework.AssertionFailedError: waiting for server up
	at org.apache.zookeeper.test.ClientBase.startServerInstance(ClientBase.java:379)
	at org.apache.zookeeper.test.ClientBase.startServer(ClientBase.java:488)
	at org.apache.zookeeper.test.ClientBase.startServer(ClientBase.java:484)
	at org.apache.zookeeper.test.ClientBase.setUp(ClientBase.java:475)


FAILED:  org.apache.zookeeper.test.ClientTest.testMutipleWatcherObjs

Error Message:
waiting for server up

Stack Trace:
junit.framework.AssertionFailedError: waiting for server up
	at org.apache.zookeeper.test.ClientBase.startServerInstance(ClientBase.java:379)
	at org.apache.zookeeper.test.ClientBase.startServer(ClientBase.java:488)
	at org.apache.zookeeper.test.ClientBase.startServer(ClientBase.java:484)
	at org.apache.zookeeper.test.ClientBase.setUp(ClientBase.java:475)


FAILED:  org.apache.zookeeper.test.CreateTest.testCreateWithStat

Error Message:
null

Stack Trace:
java.lang.NullPointerException
	at org.apache.zookeeper.test.CreateTest.tearDown(CreateTest.java:48)


FAILED:  org.apache.zookeeper.test.CreateTest.testCreateWithNullStat

Error Message:
null

Stack Trace:
java.lang.NullPointerException
	at org.apache.zookeeper.test.CreateTest.tearDown(CreateTest.java:48)


FAILED:  org.apache.zookeeper.test.CreateTest.testCreate

Error Message:
null

Stack Trace:
java.lang.NullPointerException
	at org.apache.zookeeper.test.CreateTest.tearDown(CreateTest.java:48)


FAILED:  org.apache.zookeeper.test.DisconnectedWatcherTest.testDeepChildWatcherAutoResetWithChroot

Error Message:
waiting for server up

Stack Trace:
junit.framework.AssertionFailedError: waiting for server up
	at org.apache.zookeeper.test.ClientBase.startServerInstance(ClientBase.java:379)
	at org.apache.zookeeper.test.ClientBase.startServer(ClientBase.java:488)
	at org.apache.zookeeper.test.ClientBase.startServer(ClientBase.java:484)
	at org.apache.zookeeper.test.ClientBase.setUp(ClientBase.java:475)


FAILED:  org.apache.zookeeper.test.DisconnectedWatcherTest.testChildWatcherAutoResetWithChroot

Error Message:
waiting for server up

Stack Trace:
junit.framework.AssertionFailedError: waiting for server up
	at org.apache.zookeeper.test.ClientBase.startServerInstance(ClientBase.java:379)
	at org.apache.zookeeper.test.ClientBase.startServer(ClientBase.java:488)
	at org.apache.zookeeper.test.ClientBase.startServer(ClientBase.java:484)
	at org.apache.zookeeper.test.ClientBase.setUp(ClientBase.java:475)


FAILED:  org.apache.zookeeper.test.DisconnectedWatcherTest.testDefaultWatcherAutoResetWithChroot

Error Message:
waiting for server up

Stack Trace:
junit.framework.AssertionFailedError: waiting for server up
	at org.apache.zookeeper.test.ClientBase.startServerInstance(ClientBase.java:379)
	at org.apache.zookeeper.test.ClientBase.startServer(ClientBase.java:488)
	at org.apache.zookeeper.test.ClientBase.startServer(ClientBase.java:484)
	at org.apache.zookeeper.test.ClientBase.setUp(ClientBase.java:475)


FAILED:  org.apache.zookeeper.test.DisconnectedWatcherTest.testManyChildWatchersAutoReset

Error Message:
waiting for server up

Stack Trace:
junit.framework.AssertionFailedError: waiting for server up
	at org.apache.zookeeper.test.ClientBase.startServerInstance(ClientBase.java:379)
	at org.apache.zookeeper.test.ClientBase.startServer(ClientBase.java:488)
	at org.apache.zookeeper.test.ClientBase.startServer(ClientBase.java:484)
	at org.apache.zookeeper.test.ClientBase.setUp(ClientBase.java:475)


FAILED:  org.apache.zookeeper.test.DuplicateLocalSessionUpgradeTest.testLocalSessionUpgradeOnFollower

Error Message:
waiting for server up

Stack Trace:
junit.framework.AssertionFailedError: waiting for server up
	at org.apache.zookeeper.test.QuorumBase.startServers(QuorumBase.java:223)
	at org.apache.zookeeper.test.QuorumBase.setUp(QuorumBase.java:120)
	at org.apache.zookeeper.test.QuorumBase.setUp(QuorumBase.java:78)
	at org.apache.zookeeper.test.DuplicateLocalSessionUpgradeTest.setUp(DuplicateLocalSessionUpgradeTest.java:53)


FAILED:  org.apache.zookeeper.test.DuplicateLocalSessionUpgradeTest.testLocalSessionUpgradeOnLeader

Error Message:
waiting for server up

Stack Trace:
junit.framework.AssertionFailedError: waiting for server up
	at org.apache.zookeeper.test.QuorumBase.startServers(QuorumBase.java:223)
	at org.apache.zookeeper.test.QuorumBase.setUp(QuorumBase.java:120)
	at org.apache.zookeeper.test.QuorumBase.setUp(QuorumBase.java:78)
	at org.apache.zookeeper.test.DuplicateLocalSessionUpgradeTest.setUp(DuplicateLocalSessionUpgradeTest.java:53)


FAILED:  org.apache.zookeeper.test.EmptiedSnapshotRecoveryTest.testRestoreWithEmptySnapFiles

Error Message:
waiting for server being up 

Stack Trace:
junit.framework.AssertionFailedError: waiting for server being up 
	at org.apache.zookeeper.test.EmptiedSnapshotRecoveryTest.runTest(EmptiedSnapshotRecoveryTest.java:63)
	at org.apache.zookeeper.test.EmptiedSnapshotRecoveryTest.testRestoreWithEmptySnapFiles(EmptiedSnapshotRecoveryTest.java:117)
	at org.apache.zookeeper.JUnit4ZKTestRunner$LoggedInvokeMethod.evaluate(JUnit4ZKTestRunner.java:79)


FAILED:  org.apache.zookeeper.test.EmptiedSnapshotRecoveryTest.testRestoreWithNoSnapFiles

Error Message:
waiting for server being up 

Stack Trace:
junit.framework.AssertionFailedError: waiting for server being up 
	at org.apache.zookeeper.test.EmptiedSnapshotRecoveryTest.runTest(EmptiedSnapshotRecoveryTest.java:63)
	at org.apache.zookeeper.test.EmptiedSnapshotRecoveryTest.testRestoreWithNoSnapFiles(EmptiedSnapshotRecoveryTest.java:126)
	at org.apache.zookeeper.JUnit4ZKTestRunner$LoggedInvokeMethod.evaluate(JUnit4ZKTestRunner.java:79)


FAILED:  org.apache.zookeeper.test.FollowerResyncConcurrencyTest.testResyncByTxnlogThenDiffAfterFollowerCrashes

Error Message:
waiting for server up

Stack Trace:
junit.framework.AssertionFailedError: waiting for server up
	at org.apache.zookeeper.test.QuorumUtil.startAll(QuorumUtil.java:151)
	at org.apache.zookeeper.test.FollowerResyncConcurrencyTest.followerResyncCrashTest(FollowerResyncConcurrencyTest.java:200)
	at org.apache.zookeeper.test.FollowerResyncConcurrencyTest.testResyncByTxnlogThenDiffAfterFollowerCrashes(FollowerResyncConcurrencyTest.java:191)
	at org.apache.zookeeper.JUnit4ZKTestRunner$LoggedInvokeMethod.evaluate(JUnit4ZKTestRunner.java:79)


FAILED:  org.apache.zookeeper.test.FollowerResyncConcurrencyTest.testLaggingFollowerResyncsUnderNewEpoch

Error Message:
Waiting for server up

Stack Trace:
junit.framework.AssertionFailedError: Waiting for server up
	at org.apache.zookeeper.test.FollowerResyncConcurrencyTest.testLaggingFollowerResyncsUnderNewEpoch(FollowerResyncConcurrencyTest.java:104)
	at org.apache.zookeeper.JUnit4ZKTestRunner$LoggedInvokeMethod.evaluate(JUnit4ZKTestRunner.java:79)


FAILED:  org.apache.zookeeper.test.FollowerResyncConcurrencyTest.testResyncByDiffAfterFollowerCrashes

Error Message:
waiting for server up

Stack Trace:
junit.framework.AssertionFailedError: waiting for server up
	at org.apache.zookeeper.test.QuorumUtil.startAll(QuorumUtil.java:151)
	at org.apache.zookeeper.test.FollowerResyncConcurrencyTest.testResyncByDiffAfterFollowerCrashes(FollowerResyncConcurrencyTest.java:395)
	at org.apache.zookeeper.JUnit4ZKTestRunner$LoggedInvokeMethod.evaluate(JUnit4ZKTestRunner.java:79)


FAILED:  org.apache.zookeeper.test.FollowerResyncConcurrencyTest.testFollowerSendsLastZxid

Error Message:
waiting for server up

Stack Trace:
junit.framework.AssertionFailedError: waiting for server up
	at org.apache.zookeeper.test.QuorumUtil.startAll(QuorumUtil.java:151)
	at org.apache.zookeeper.test.FollowerResyncConcurrencyTest.testFollowerSendsLastZxid(FollowerResyncConcurrencyTest.java:672)
	at org.apache.zookeeper.JUnit4ZKTestRunner$LoggedInvokeMethod.evaluate(JUnit4ZKTestRunner.java:79)


FAILED:  org.apache.zookeeper.test.FollowerResyncConcurrencyTest.testResyncBySnapThenDiffAfterFollowerCrashes

Error Message:
waiting for server up

Stack Trace:
junit.framework.AssertionFailedError: waiting for server up
	at org.apache.zookeeper.test.QuorumUtil.startAll(QuorumUtil.java:151)
	at org.apache.zookeeper.test.FollowerResyncConcurrencyTest.followerResyncCrashTest(FollowerResyncConcurrencyTest.java:200)
	at org.apache.zookeeper.test.FollowerResyncConcurrencyTest.testResyncBySnapThenDiffAfterFollowerCrashes(FollowerResyncConcurrencyTest.java:176)
	at org.apache.zookeeper.JUnit4ZKTestRunner$LoggedInvokeMethod.evaluate(JUnit4ZKTestRunner.java:79)


FAILED:  org.apache.zookeeper.test.FollowerResyncConcurrencyTest.testFollowerWatcherResync

Error Message:
waiting for server up

Stack Trace:
junit.framework.AssertionFailedError: waiting for server up
	at org.apache.zookeeper.test.QuorumUtil.startAll(QuorumUtil.java:151)
	at org.apache.zookeeper.test.FollowerResyncConcurrencyTest.testFollowerWatcherResync(FollowerResyncConcurrencyTest.java:714)
	at org.apache.zookeeper.JUnit4ZKTestRunner$LoggedInvokeMethod.evaluate(JUnit4ZKTestRunner.java:79)


FAILED:  org.apache.zookeeper.test.FourLetterWordsQuorumTest.testFourLetterWords

Error Message:
waiting for server up

Stack Trace:
junit.framework.AssertionFailedError: waiting for server up
	at org.apache.zookeeper.test.QuorumBase.startServers(QuorumBase.java:223)
	at org.apache.zookeeper.test.QuorumBase.setUp(QuorumBase.java:120)
	at org.apache.zookeeper.test.QuorumBase.setUp(QuorumBase.java:78)


FAILED:  org.apache.zookeeper.test.FourLetterWordsQuorumTest.testNull

Error Message:
waiting for server up

Stack Trace:
junit.framework.AssertionFailedError: waiting for server up
	at org.apache.zookeeper.test.QuorumBase.startServers(QuorumBase.java:223)
	at org.apache.zookeeper.test.QuorumBase.setUp(QuorumBase.java:120)
	at org.apache.zookeeper.test.QuorumBase.setUp(QuorumBase.java:78)


FAILED:  org.apache.zookeeper.test.FourLetterWordsTest.testFourLetterWords

Error Message:
test timed out after 30000 milliseconds

Stack Trace:
org.junit.runners.model.TestTimedOutException: test timed out after 30000 milliseconds
	at java.lang.Thread.sleep(Native Method)
	at org.apache.zookeeper.test.ClientBase.waitForServerUp(ClientBase.java:257)
	at org.apache.zookeeper.test.ClientBase.startServerInstance(ClientBase.java:379)
	at org.apache.zookeeper.test.ClientBase.startServer(ClientBase.java:488)
	at org.apache.zookeeper.test.ClientBase.startServer(ClientBase.java:484)
	at org.apache.zookeeper.test.ClientBase.setUp(ClientBase.java:475)
	at java.util.concurrent.FutureTask.run(FutureTask.java:262)
	at java.lang.Thread.run(Thread.java:745)


FAILED:  org.apache.zookeeper.test.FourLetterWordsTest.testSetTraceMask

Error Message:
test timed out after 30000 milliseconds

Stack Trace:
org.junit.runners.model.TestTimedOutException: test timed out after 30000 milliseconds
	at java.lang.Thread.sleep(Native Method)
	at org.apache.zookeeper.test.ClientBase.waitForServerUp(ClientBase.java:257)
	at org.apache.zookeeper.test.ClientBase.startServerInstance(ClientBase.java:379)
	at org.apache.zookeeper.test.ClientBase.startServer(ClientBase.java:488)
	at org.apache.zookeeper.test.ClientBase.startServer(ClientBase.java:484)
	at org.apache.zookeeper.test.ClientBase.setUp(ClientBase.java:475)
	at java.util.concurrent.FutureTask.run(FutureTask.java:262)
	at java.lang.Thread.run(Thread.java:745)


FAILED:  org.apache.zookeeper.test.FourLetterWordsTest.testValidateConsOutput

Error Message:
test timed out after 30000 milliseconds

Stack Trace:
org.junit.runners.model.TestTimedOutException: test timed out after 30000 milliseconds
	at java.lang.Thread.sleep(Native Method)
	at org.apache.zookeeper.test.ClientBase.waitForServerUp(ClientBase.java:257)
	at org.apache.zookeeper.test.ClientBase.startServerInstance(ClientBase.java:379)
	at org.apache.zookeeper.test.ClientBase.startServer(ClientBase.java:488)
	at org.apache.zookeeper.test.ClientBase.startServer(ClientBase.java:484)
	at org.apache.zookeeper.test.ClientBase.setUp(ClientBase.java:475)
	at java.util.concurrent.FutureTask.run(FutureTask.java:262)
	at java.lang.Thread.run(Thread.java:745)


FAILED:  org.apache.zookeeper.test.FourLetterWordsTest.testValidateSocketTimeout

Error Message:
test timed out after 30000 milliseconds

Stack Trace:
org.junit.runners.model.TestTimedOutException: test timed out after 30000 milliseconds
	at java.lang.Thread.sleep(Native Method)
	at org.apache.zookeeper.test.ClientBase.waitForServerUp(ClientBase.java:257)
	at org.apache.zookeeper.test.ClientBase.startServerInstance(ClientBase.java:379)
	at org.apache.zookeeper.test.ClientBase.startServer(ClientBase.java:488)
	at org.apache.zookeeper.test.ClientBase.startServer(ClientBase.java:484)
	at org.apache.zookeeper.test.ClientBase.setUp(ClientBase.java:475)
	at java.util.concurrent.FutureTask.run(FutureTask.java:262)
	at java.lang.Thread.run(Thread.java:745)


FAILED:  org.apache.zookeeper.test.FourLetterWordsTest.testValidateStatOutput

Error Message:
test timed out after 30000 milliseconds

Stack Trace:
org.junit.runners.model.TestTimedOutException: test timed out after 30000 milliseconds
	at java.lang.Thread.sleep(Native Method)
	at org.apache.zookeeper.test.ClientBase.waitForServerUp(ClientBase.java:257)
	at org.apache.zookeeper.test.ClientBase.startServerInstance(ClientBase.java:379)
	at org.apache.zookeeper.test.ClientBase.startServer(ClientBase.java:488)
	at org.apache.zookeeper.test.ClientBase.startServer(ClientBase.java:484)
	at org.apache.zookeeper.test.ClientBase.setUp(ClientBase.java:475)
	at java.util.concurrent.FutureTask.run(FutureTask.java:262)
	at java.lang.Thread.run(Thread.java:745)


FAILED:  org.apache.zookeeper.test.FourLetterWordsWhiteListTest.testISROEnabledWhenReadOnlyModeEnabled

Error Message:
waiting for server up

Stack Trace:
junit.framework.AssertionFailedError: waiting for server up
	at org.apache.zookeeper.test.ClientBase.startServerInstance(ClientBase.java:379)
	at org.apache.zookeeper.test.ClientBase.startServer(ClientBase.java:488)
	at org.apache.zookeeper.test.ClientBase.startServer(ClientBase.java:484)
	at org.apache.zookeeper.test.ClientBase.setUp(ClientBase.java:475)


FAILED:  org.apache.zookeeper.test.FourLetterWordsWhiteListTest.testFourLetterWordsEnableSomeCommands

Error Message:
waiting for server up

Stack Trace:
junit.framework.AssertionFailedError: waiting for server up
	at org.apache.zookeeper.test.ClientBase.startServerInstance(ClientBase.java:379)
	at org.apache.zookeeper.test.ClientBase.startServer(ClientBase.java:488)
	at org.apache.zookeeper.test.ClientBase.startServer(ClientBase.java:484)
	at org.apache.zookeeper.test.ClientBase.setUp(ClientBase.java:475)


FAILED:  org.apache.zookeeper.test.FourLetterWordsWhiteListTest.testFourLetterWordsEnableAllCommandsThroughAsterisk

Error Message:
waiting for server up

Stack Trace:
junit.framework.AssertionFailedError: waiting for server up
	at org.apache.zookeeper.test.ClientBase.startServerInstance(ClientBase.java:379)
	at org.apache.zookeeper.test.ClientBase.startServer(ClientBase.java:488)
	at org.apache.zookeeper.test.ClientBase.startServer(ClientBase.java:484)
	at org.apache.zookeeper.test.ClientBase.setUp(ClientBase.java:475)


FAILED:  org.apache.zookeeper.test.FourLetterWordsWhiteListTest.testFourLetterWordsEnableAllCommandsThroughExplicitList

Error Message:
waiting for server up

Stack Trace:
junit.framework.AssertionFailedError: waiting for server up
	at org.apache.zookeeper.test.ClientBase.startServerInstance(ClientBase.java:379)
	at org.apache.zookeeper.test.ClientBase.startServer(ClientBase.java:488)
	at org.apache.zookeeper.test.ClientBase.startServer(ClientBase.java:484)
	at org.apache.zookeeper.test.ClientBase.setUp(ClientBase.java:475)


FAILED:  org.apache.zookeeper.test.FourLetterWordsWhiteListTest.testFourLetterWordsAllDisabledByDefault

Error Message:
waiting for server up

Stack Trace:
junit.framework.AssertionFailedError: waiting for server up
	at org.apache.zookeeper.test.ClientBase.startServerInstance(ClientBase.java:379)
	at org.apache.zookeeper.test.ClientBase.startServer(ClientBase.java:488)
	at org.apache.zookeeper.test.ClientBase.startServer(ClientBase.java:484)
	at org.apache.zookeeper.test.ClientBase.setUp(ClientBase.java:475)


FAILED:  org.apache.zookeeper.test.FourLetterWordsWhiteListTest.testFourLetterWordsInvalidConfiguration

Error Message:
waiting for server up

Stack Trace:
junit.framework.AssertionFailedError: waiting for server up
	at org.apache.zookeeper.test.ClientBase.startServerInstance(ClientBase.java:379)
	at org.apache.zookeeper.test.ClientBase.startServer(ClientBase.java:488)
	at org.apache.zookeeper.test.ClientBase.startServer(ClientBase.java:484)
	at org.apache.zookeeper.test.ClientBase.setUp(ClientBase.java:475)


FAILED:  org.apache.zookeeper.test.GetChildren2Test.testChildren

Error Message:
null

Stack Trace:
java.lang.NullPointerException
	at org.apache.zookeeper.test.GetChildren2Test.tearDown(GetChildren2Test.java:48)


FAILED:  org.apache.zookeeper.test.GetChildren2Test.testChild

Error Message:
null

Stack Trace:
java.lang.NullPointerException
	at org.apache.zookeeper.test.GetChildren2Test.tearDown(GetChildren2Test.java:48)


FAILED:  org.apache.zookeeper.test.GetProposalFromTxnTest.testGetProposalFromTxn

Error Message:
waiting for server being up 

Stack Trace:
junit.framework.AssertionFailedError: waiting for server being up 
	at org.apache.zookeeper.test.GetProposalFromTxnTest.testGetProposalFromTxn(GetProposalFromTxnTest.java:69)
	at org.apache.zookeeper.JUnit4ZKTestRunner$LoggedInvokeMethod.evaluate(JUnit4ZKTestRunner.java:79)


FAILED:  org.apache.zookeeper.test.HierarchicalQuorumTest.testHierarchicalQuorum

Error Message:
waiting for server up

Stack Trace:
junit.framework.AssertionFailedError: waiting for server up
	at org.apache.zookeeper.test.HierarchicalQuorumTest.startServers(HierarchicalQuorumTest.java:233)
	at org.apache.zookeeper.test.HierarchicalQuorumTest.startServers(HierarchicalQuorumTest.java:135)
	at org.apache.zookeeper.test.HierarchicalQuorumTest.setUp(HierarchicalQuorumTest.java:121)


FAILED:  org.apache.zookeeper.test.InvalidSnapshotTest.testSnapshot

Error Message:
waiting for server being up

Stack Trace:
junit.framework.AssertionFailedError: waiting for server being up
	at org.apache.zookeeper.test.InvalidSnapshotTest.testSnapshot(InvalidSnapshotTest.java:92)
	at org.apache.zookeeper.JUnit4ZKTestRunner$LoggedInvokeMethod.evaluate(JUnit4ZKTestRunner.java:79)


FAILED:  org.apache.zookeeper.test.KeyAuthClientTest.testAuth

Error Message:
waiting for server up

Stack Trace:
junit.framework.AssertionFailedError: waiting for server up
	at org.apache.zookeeper.test.ClientBase.startServerInstance(ClientBase.java:379)
	at org.apache.zookeeper.test.ClientBase.startServer(ClientBase.java:488)
	at org.apache.zookeeper.test.ClientBase.startServer(ClientBase.java:484)
	at org.apache.zookeeper.test.ClientBase.setUp(ClientBase.java:475)


FAILED:  org.apache.zookeeper.test.LeaderSessionTrackerTest.testExpiredSessionWithLocalSession

Error Message:
waiting for server up

Stack Trace:
junit.framework.AssertionFailedError: waiting for server up
	at org.apache.zookeeper.test.QuorumUtil.startAll(QuorumUtil.java:151)
	at org.apache.zookeeper.test.LeaderSessionTrackerTest.testCreateEphemeral(LeaderSessionTrackerTest.java:88)
	at org.apache.zookeeper.test.LeaderSessionTrackerTest.testExpiredSessionWithLocalSession(LeaderSessionTrackerTest.java:68)
	at org.apache.zookeeper.JUnit4ZKTestRunner$LoggedInvokeMethod.evaluate(JUnit4ZKTestRunner.java:79)


FAILED:  org.apache.zookeeper.test.LeaderSessionTrackerTest.testExpiredSessionWithoutLocalSession

Error Message:
waiting for server up

Stack Trace:
junit.framework.AssertionFailedError: waiting for server up
	at org.apache.zookeeper.test.QuorumUtil.startAll(QuorumUtil.java:151)
	at org.apache.zookeeper.test.LeaderSessionTrackerTest.testCreateEphemeral(LeaderSessionTrackerTest.java:88)
	at org.apache.zookeeper.test.LeaderSessionTrackerTest.testExpiredSessionWithoutLocalSession(LeaderSessionTrackerTest.java:73)
	at org.apache.zookeeper.JUnit4ZKTestRunner$LoggedInvokeMethod.evaluate(JUnit4ZKTestRunner.java:79)


FAILED:  org.apache.zookeeper.test.LeaderSessionTrackerTest.testCreatePersistent

Error Message:
waiting for server up

Stack Trace:
junit.framework.AssertionFailedError: waiting for server up
	at org.apache.zookeeper.test.QuorumUtil.startAll(QuorumUtil.java:151)
	at org.apache.zookeeper.test.LeaderSessionTrackerTest.testCreatePersistent(LeaderSessionTrackerTest.java:129)
	at org.apache.zookeeper.JUnit4ZKTestRunner$LoggedInvokeMethod.evaluate(JUnit4ZKTestRunner.java:79)


FAILED:  org.apache.zookeeper.test.LoadFromLogTest.testReloadSnapshotWithMissingParent

Error Message:
waiting for server being up 

Stack Trace:
junit.framework.AssertionFailedError: waiting for server being up 
	at org.apache.zookeeper.test.LoadFromLogTest.testReloadSnapshotWithMissingParent(LoadFromLogTest.java:520)
	at org.apache.zookeeper.JUnit4ZKTestRunner$LoggedInvokeMethod.evaluate(JUnit4ZKTestRunner.java:79)


FAILED:  org.apache.zookeeper.test.LoadFromLogTest.testRestoreWithTransactionErrors

Error Message:
waiting for server being up 

Stack Trace:
junit.framework.AssertionFailedError: waiting for server being up 
	at org.apache.zookeeper.test.LoadFromLogTest.testRestoreWithTransactionErrors(LoadFromLogTest.java:425)
	at org.apache.zookeeper.JUnit4ZKTestRunner$LoggedInvokeMethod.evaluate(JUnit4ZKTestRunner.java:79)


FAILED:  org.apache.zookeeper.test.LoadFromLogTest.testLoad

Error Message:
waiting for server being up 

Stack Trace:
junit.framework.AssertionFailedError: waiting for server being up 
	at org.apache.zookeeper.test.LoadFromLogTest.testLoad(LoadFromLogTest.java:87)
	at org.apache.zookeeper.JUnit4ZKTestRunner$LoggedInvokeMethod.evaluate(JUnit4ZKTestRunner.java:79)


FAILED:  org.apache.zookeeper.test.LoadFromLogTest.testDatadirAutocreate

Error Message:
waiting for server being up 

Stack Trace:
junit.framework.AssertionFailedError: waiting for server being up 
	at org.apache.zookeeper.test.LoadFromLogTest.testDatadirAutocreate(LoadFromLogTest.java:478)
	at org.apache.zookeeper.JUnit4ZKTestRunner$LoggedInvokeMethod.evaluate(JUnit4ZKTestRunner.java:79)


FAILED:  org.apache.zookeeper.test.LoadFromLogTest.testRestore

Error Message:
waiting for server being up 

Stack Trace:
junit.framework.AssertionFailedError: waiting for server being up 
	at org.apache.zookeeper.test.LoadFromLogTest.testRestore(LoadFromLogTest.java:344)
	at org.apache.zookeeper.JUnit4ZKTestRunner$LoggedInvokeMethod.evaluate(JUnit4ZKTestRunner.java:79)


FAILED:  org.apache.zookeeper.test.LoadFromLogTest.testLoadFailure

Error Message:
waiting for server being up 

Stack Trace:
junit.framework.AssertionFailedError: waiting for server being up 
	at org.apache.zookeeper.test.LoadFromLogTest.testLoadFailure(LoadFromLogTest.java:149)
	at org.apache.zookeeper.JUnit4ZKTestRunner$LoggedInvokeMethod.evaluate(JUnit4ZKTestRunner.java:79)


FAILED:  org.apache.zookeeper.test.LocalSessionRequestTest.testLocalSessionsOnLeader

Error Message:
waiting for server up

Stack Trace:
junit.framework.AssertionFailedError: waiting for server up
	at org.apache.zookeeper.test.QuorumBase.startServers(QuorumBase.java:223)
	at org.apache.zookeeper.test.QuorumBase.setUp(QuorumBase.java:120)
	at org.apache.zookeeper.test.QuorumBase.setUp(QuorumBase.java:78)
	at org.apache.zookeeper.test.LocalSessionRequestTest.setUp(LocalSessionRequestTest.java:53)


FAILED:  org.apache.zookeeper.test.LocalSessionRequestTest.testLocalSessionsOnFollower

Error Message:
waiting for server up

Stack Trace:
junit.framework.AssertionFailedError: waiting for server up
	at org.apache.zookeeper.test.QuorumBase.startServers(QuorumBase.java:223)
	at org.apache.zookeeper.test.QuorumBase.setUp(QuorumBase.java:120)
	at org.apache.zookeeper.test.QuorumBase.setUp(QuorumBase.java:78)
	at org.apache.zookeeper.test.LocalSessionRequestTest.setUp(LocalSessionRequestTest.java:53)


FAILED:  org.apache.zookeeper.test.LocalSessionsOnlyTest.testLocalSessionsOnLeader

Error Message:
waiting for server up

Stack Trace:
junit.framework.AssertionFailedError: waiting for server up
	at org.apache.zookeeper.test.QuorumBase.startServers(QuorumBase.java:223)
	at org.apache.zookeeper.test.QuorumBase.setUp(QuorumBase.java:120)
	at org.apache.zookeeper.test.QuorumBase.setUp(QuorumBase.java:78)
	at org.apache.zookeeper.test.LocalSessionsOnlyTest.setUp(LocalSessionsOnlyTest.java:55)


FAILED:  org.apache.zookeeper.test.LocalSessionsOnlyTest.testLocalSessionsOnFollower

Error Message:
waiting for server up

Stack Trace:
junit.framework.AssertionFailedError: waiting for server up
	at org.apache.zookeeper.test.QuorumBase.startServers(QuorumBase.java:223)
	at org.apache.zookeeper.test.QuorumBase.setUp(QuorumBase.java:120)
	at org.apache.zookeeper.test.QuorumBase.setUp(QuorumBase.java:78)
	at org.apache.zookeeper.test.LocalSessionsOnlyTest.setUp(LocalSessionsOnlyTest.java:55)


FAILED:  org.apache.zookeeper.test.MaxCnxnsTest.testMaxCnxns

Error Message:
waiting for server up

Stack Trace:
junit.framework.AssertionFailedError: waiting for server up
	at org.apache.zookeeper.test.ClientBase.startServerInstance(ClientBase.java:379)
	at org.apache.zookeeper.test.ClientBase.startServer(ClientBase.java:488)
	at org.apache.zookeeper.test.ClientBase.startServer(ClientBase.java:484)
	at org.apache.zookeeper.test.ClientBase.setUp(ClientBase.java:475)
	at org.apache.zookeeper.test.MaxCnxnsTest.setUp(MaxCnxnsTest.java:40)


FAILED:  org.apache.zookeeper.test.MultiAsyncTransactionTest.testSequentialNodeCreateInAsyncMulti

Error Message:
waiting for server up

Stack Trace:
junit.framework.AssertionFailedError: waiting for server up
	at org.apache.zookeeper.test.ClientBase.startServerInstance(ClientBase.java:379)
	at org.apache.zookeeper.test.ClientBase.startServer(ClientBase.java:488)
	at org.apache.zookeeper.test.ClientBase.startServer(ClientBase.java:484)
	at org.apache.zookeeper.test.ClientBase.setUp(ClientBase.java:475)
	at org.apache.zookeeper.test.MultiAsyncTransactionTest.setUp(MultiAsyncTransactionTest.java:46)


FAILED:  org.apache.zookeeper.test.MultiTransactionTest.testNoWatchesTriggeredForFailedMultiRequest[1]

Error Message:
Timeout occurred. Please note the time in the report does not reflect the time until the timeout.

Stack Trace:
junit.framework.AssertionFailedError: Timeout occurred. Please note the time in the report does not reflect the time until the timeout.
	at java.lang.Thread.run(Thread.java:745)


FAILED:  org.apache.zookeeper.test.NullDataTest.testNullData

Error Message:
waiting for server up

Stack Trace:
junit.framework.AssertionFailedError: waiting for server up
	at org.apache.zookeeper.test.ClientBase.startServerInstance(ClientBase.java:379)
	at org.apache.zookeeper.test.ClientBase.startServer(ClientBase.java:488)
	at org.apache.zookeeper.test.ClientBase.startServer(ClientBase.java:484)
	at org.apache.zookeeper.test.ClientBase.setUp(ClientBase.java:475)
	at org.apache.zookeeper.test.NullDataTest.setUp(NullDataTest.java:43)


FAILED:  org.apache.zookeeper.test.ObserverHierarchicalQuorumTest.testHierarchicalQuorum

Error Message:
waiting for server up

Stack Trace:
junit.framework.AssertionFailedError: waiting for server up
	at org.apache.zookeeper.test.HierarchicalQuorumTest.startServers(HierarchicalQuorumTest.java:233)
	at org.apache.zookeeper.test.ObserverHierarchicalQuorumTest.startServers(ObserverHierarchicalQuorumTest.java:28)
	at org.apache.zookeeper.test.HierarchicalQuorumTest.setUp(HierarchicalQuorumTest.java:121)


FAILED:  org.apache.zookeeper.test.ObserverLETest.testLEWithObserver

Error Message:
waiting for server up

Stack Trace:
junit.framework.AssertionFailedError: waiting for server up
	at org.apache.zookeeper.test.QuorumBase.startServers(QuorumBase.java:223)
	at org.apache.zookeeper.test.QuorumBase.setUp(QuorumBase.java:120)
	at org.apache.zookeeper.test.ObserverLETest.establishThreeParticipantOneObserverEnsemble(ObserverLETest.java:37)


FAILED:  org.apache.zookeeper.test.ObserverQuorumHammerTest.testHammerBasic

Error Message:
waiting for server up

Stack Trace:
junit.framework.AssertionFailedError: waiting for server up
	at org.apache.zookeeper.test.QuorumBase.startServers(QuorumBase.java:223)
	at org.apache.zookeeper.test.QuorumBase.setUp(QuorumBase.java:120)
	at org.apache.zookeeper.test.ObserverQuorumHammerTest.setUp(ObserverQuorumHammerTest.java:30)


FAILED:  org.apache.zookeeper.test.QuorumHammerTest.testHammerBasic

Error Message:
waiting for server up

Stack Trace:
junit.framework.AssertionFailedError: waiting for server up
	at org.apache.zookeeper.test.QuorumBase.startServers(QuorumBase.java:223)
	at org.apache.zookeeper.test.QuorumBase.setUp(QuorumBase.java:120)
	at org.apache.zookeeper.test.QuorumBase.setUp(QuorumBase.java:78)
	at org.apache.zookeeper.test.QuorumHammerTest.setUp(QuorumHammerTest.java:36)


FAILED:  org.apache.zookeeper.test.QuorumMajorityTest.testMajQuorums

Error Message:
waiting for server up

Stack Trace:
junit.framework.AssertionFailedError: waiting for server up
	at org.apache.zookeeper.test.QuorumBase.startServers(QuorumBase.java:223)
	at org.apache.zookeeper.test.QuorumBase.setUp(QuorumBase.java:120)
	at org.apache.zookeeper.test.QuorumBase.setUp(QuorumBase.java:78)


FAILED:  org.apache.zookeeper.test.QuorumMajorityTest.testNull

Error Message:
waiting for server up

Stack Trace:
junit.framework.AssertionFailedError: waiting for server up
	at org.apache.zookeeper.test.QuorumBase.startServers(QuorumBase.java:223)
	at org.apache.zookeeper.test.QuorumBase.setUp(QuorumBase.java:120)
	at org.apache.zookeeper.test.QuorumBase.setUp(QuorumBase.java:78)


FAILED:  org.apache.zookeeper.test.QuorumQuotaTest.testQuotaWithQuorum

Error Message:
waiting for server up

Stack Trace:
junit.framework.AssertionFailedError: waiting for server up
	at org.apache.zookeeper.test.QuorumBase.startServers(QuorumBase.java:223)
	at org.apache.zookeeper.test.QuorumBase.setUp(QuorumBase.java:120)
	at org.apache.zookeeper.test.QuorumBase.setUp(QuorumBase.java:78)


FAILED:  org.apache.zookeeper.test.QuorumQuotaTest.testNull

Error Message:
waiting for server up

Stack Trace:
junit.framework.AssertionFailedError: waiting for server up
	at org.apache.zookeeper.test.QuorumBase.startServers(QuorumBase.java:223)
	at org.apache.zookeeper.test.QuorumBase.setUp(QuorumBase.java:120)
	at org.apache.zookeeper.test.QuorumBase.setUp(QuorumBase.java:78)


FAILED:  org.apache.zookeeper.test.QuorumTest.testLeaderShutdown

Error Message:
waiting for server up

Stack Trace:
junit.framework.AssertionFailedError: waiting for server up
	at org.apache.zookeeper.test.QuorumBase.startServers(QuorumBase.java:223)
	at org.apache.zookeeper.test.QuorumBase.setUp(QuorumBase.java:120)
	at org.apache.zookeeper.test.QuorumBase.setUp(QuorumBase.java:78)
	at org.apache.zookeeper.test.QuorumTest.setUp(QuorumTest.java:60)


FAILED:  org.apache.zookeeper.test.QuorumTest.testACLs

Error Message:
waiting for server up

Stack Trace:
junit.framework.AssertionFailedError: waiting for server up
	at org.apache.zookeeper.test.QuorumBase.startServers(QuorumBase.java:223)
	at org.apache.zookeeper.test.QuorumBase.setUp(QuorumBase.java:120)
	at org.apache.zookeeper.test.QuorumBase.setUp(QuorumBase.java:78)
	at org.apache.zookeeper.test.QuorumTest.setUp(QuorumTest.java:60)


FAILED:  org.apache.zookeeper.test.QuorumTest.testPing

Error Message:
waiting for server up

Stack Trace:
junit.framework.AssertionFailedError: waiting for server up
	at org.apache.zookeeper.test.QuorumBase.startServers(QuorumBase.java:223)
	at org.apache.zookeeper.test.QuorumBase.setUp(QuorumBase.java:120)
	at org.apache.zookeeper.test.QuorumBase.setUp(QuorumBase.java:78)
	at org.apache.zookeeper.test.QuorumTest.setUp(QuorumTest.java:60)


FAILED:  org.apache.zookeeper.test.QuorumTest.testNoLogBeforeLeaderEstablishment

Error Message:
waiting for server up

Stack Trace:
junit.framework.AssertionFailedError: waiting for server up
	at org.apache.zookeeper.test.QuorumBase.startServers(QuorumBase.java:223)
	at org.apache.zookeeper.test.QuorumBase.setUp(QuorumBase.java:120)
	at org.apache.zookeeper.test.QuorumBase.setUp(QuorumBase.java:78)
	at org.apache.zookeeper.test.QuorumTest.setUp(QuorumTest.java:60)


FAILED:  org.apache.zookeeper.test.QuorumTest.testClientwithoutWatcherObj

Error Message:
waiting for server up

Stack Trace:
junit.framework.AssertionFailedError: waiting for server up
	at org.apache.zookeeper.test.QuorumBase.startServers(QuorumBase.java:223)
	at org.apache.zookeeper.test.QuorumBase.setUp(QuorumBase.java:120)
	at org.apache.zookeeper.test.QuorumBase.setUp(QuorumBase.java:78)
	at org.apache.zookeeper.test.QuorumTest.setUp(QuorumTest.java:60)


FAILED:  org.apache.zookeeper.test.QuorumTest.testGetView

Error Message:
waiting for server up

Stack Trace:
junit.framework.AssertionFailedError: waiting for server up
	at org.apache.zookeeper.test.QuorumBase.startServers(QuorumBase.java:223)
	at org.apache.zookeeper.test.QuorumBase.setUp(QuorumBase.java:120)
	at org.apache.zookeeper.test.QuorumBase.setUp(QuorumBase.java:78)
	at org.apache.zookeeper.test.QuorumTest.setUp(QuorumTest.java:60)


FAILED:  org.apache.zookeeper.test.QuorumTest.testSequentialNodeNames

Error Message:
waiting for server up

Stack Trace:
junit.framework.AssertionFailedError: waiting for server up
	at org.apache.zookeeper.test.QuorumBase.startServers(QuorumBase.java:223)
	at org.apache.zookeeper.test.QuorumBase.setUp(QuorumBase.java:120)
	at org.apache.zookeeper.test.QuorumBase.setUp(QuorumBase.java:78)
	at org.apache.zookeeper.test.QuorumTest.setUp(QuorumTest.java:60)


FAILED:  org.apache.zookeeper.test.QuorumTest.testViewContains

Error Message:
waiting for server up

Stack Trace:
junit.framework.AssertionFailedError: waiting for server up
	at org.apache.zookeeper.test.QuorumBase.startServers(QuorumBase.java:223)
	at org.apache.zookeeper.test.QuorumBase.setUp(QuorumBase.java:120)
	at org.apache.zookeeper.test.QuorumBase.setUp(QuorumBase.java:78)
	at org.apache.zookeeper.test.QuorumTest.setUp(QuorumTest.java:60)


FAILED:  org.apache.zookeeper.test.QuorumTest.testSessionMoved

Error Message:
waiting for server up

Stack Trace:
junit.framework.AssertionFailedError: waiting for server up
	at org.apache.zookeeper.test.QuorumBase.startServers(QuorumBase.java:223)
	at org.apache.zookeeper.test.QuorumBase.setUp(QuorumBase.java:120)
	at org.apache.zookeeper.test.QuorumBase.setUp(QuorumBase.java:78)
	at org.apache.zookeeper.test.QuorumTest.setUp(QuorumTest.java:60)


FAILED:  org.apache.zookeeper.test.QuorumTest.testClientWithWatcherObj

Error Message:
waiting for server up

Stack Trace:
junit.framework.AssertionFailedError: waiting for server up
	at org.apache.zookeeper.test.QuorumBase.startServers(QuorumBase.java:223)
	at org.apache.zookeeper.test.QuorumBase.setUp(QuorumBase.java:120)
	at org.apache.zookeeper.test.QuorumBase.setUp(QuorumBase.java:78)
	at org.apache.zookeeper.test.QuorumTest.setUp(QuorumTest.java:60)


FAILED:  org.apache.zookeeper.test.QuorumTest.testMultiToFollower

Error Message:
waiting for server up

Stack Trace:
junit.framework.AssertionFailedError: waiting for server up
	at org.apache.zookeeper.test.QuorumBase.startServers(QuorumBase.java:223)
	at org.apache.zookeeper.test.QuorumBase.setUp(QuorumBase.java:120)
	at org.apache.zookeeper.test.QuorumBase.setUp(QuorumBase.java:78)
	at org.apache.zookeeper.test.QuorumTest.setUp(QuorumTest.java:60)


FAILED:  org.apache.zookeeper.test.QuorumTest.testDeleteWithChildren

Error Message:
waiting for server up

Stack Trace:
junit.framework.AssertionFailedError: waiting for server up
	at org.apache.zookeeper.test.QuorumBase.startServers(QuorumBase.java:223)
	at org.apache.zookeeper.test.QuorumBase.setUp(QuorumBase.java:120)
	at org.apache.zookeeper.test.QuorumBase.setUp(QuorumBase.java:78)
	at org.apache.zookeeper.test.QuorumTest.setUp(QuorumTest.java:60)


FAILED:  org.apache.zookeeper.test.QuorumTest.testMultipleWatcherObjs

Error Message:
waiting for server up

Stack Trace:
junit.framework.AssertionFailedError: waiting for server up
	at org.apache.zookeeper.test.QuorumBase.startServers(QuorumBase.java:223)
	at org.apache.zookeeper.test.QuorumBase.setUp(QuorumBase.java:120)
	at org.apache.zookeeper.test.QuorumBase.setUp(QuorumBase.java:78)
	at org.apache.zookeeper.test.QuorumTest.setUp(QuorumTest.java:60)


FAILED:  org.apache.zookeeper.test.QuorumTest.testFollowersStartAfterLeader

Error Message:
waiting for server up

Stack Trace:
junit.framework.AssertionFailedError: waiting for server up
	at org.apache.zookeeper.test.QuorumBase.startServers(QuorumBase.java:223)
	at org.apache.zookeeper.test.QuorumBase.setUp(QuorumBase.java:120)
	at org.apache.zookeeper.test.QuorumBase.setUp(QuorumBase.java:78)
	at org.apache.zookeeper.test.QuorumTest.setUp(QuorumTest.java:60)


FAILED:  org.apache.zookeeper.test.QuorumUtilTest.validateAllMXBeanAreUnregistered

Error Message:
waiting for server up

Stack Trace:
junit.framework.AssertionFailedError: waiting for server up
	at org.apache.zookeeper.test.QuorumUtil.startAll(QuorumUtil.java:151)
	at org.apache.zookeeper.test.QuorumUtilTest.validateAllMXBeanAreUnregistered(QuorumUtilTest.java:53)
	at org.apache.zookeeper.JUnit4ZKTestRunner$LoggedInvokeMethod.evaluate(JUnit4ZKTestRunner.java:79)


FAILED:  org.apache.zookeeper.test.QuorumZxidSyncTest.testBehindLeader

Error Message:
waiting for server up

Stack Trace:
junit.framework.AssertionFailedError: waiting for server up
	at org.apache.zookeeper.test.QuorumBase.startServers(QuorumBase.java:223)
	at org.apache.zookeeper.test.QuorumBase.setUp(QuorumBase.java:120)
	at org.apache.zookeeper.test.QuorumBase.setUp(QuorumBase.java:78)
	at org.apache.zookeeper.test.QuorumZxidSyncTest.setUp(QuorumZxidSyncTest.java:40)


FAILED:  org.apache.zookeeper.test.QuorumZxidSyncTest.testLateLogs

Error Message:
waiting for server up

Stack Trace:
junit.framework.AssertionFailedError: waiting for server up
	at org.apache.zookeeper.test.QuorumBase.startServers(QuorumBase.java:223)
	at org.apache.zookeeper.test.QuorumBase.setUp(QuorumBase.java:120)
	at org.apache.zookeeper.test.QuorumBase.setUp(QuorumBase.java:78)
	at org.apache.zookeeper.test.QuorumZxidSyncTest.setUp(QuorumZxidSyncTest.java:40)


FAILED:  org.apache.zookeeper.test.ReadOnlyModeTest.testSessionEstablishment

Error Message:
Waiting for server up

Stack Trace:
junit.framework.AssertionFailedError: Waiting for server up
	at org.apache.zookeeper.test.QuorumUtil.startQuorum(QuorumUtil.java:196)
	at org.apache.zookeeper.test.ReadOnlyModeTest.setUp(ReadOnlyModeTest.java:58)


FAILED:  org.apache.zookeeper.test.ReadOnlyModeTest.testSeekForRwServer

Error Message:
Waiting for server up

Stack Trace:
junit.framework.AssertionFailedError: Waiting for server up
	at org.apache.zookeeper.test.QuorumUtil.startQuorum(QuorumUtil.java:196)
	at org.apache.zookeeper.test.ReadOnlyModeTest.setUp(ReadOnlyModeTest.java:58)


FAILED:  org.apache.zookeeper.test.ReadOnlyModeTest.testReadOnlyClient

Error Message:
Waiting for server up

Stack Trace:
junit.framework.AssertionFailedError: Waiting for server up
	at org.apache.zookeeper.test.QuorumUtil.startQuorum(QuorumUtil.java:196)
	at org.apache.zookeeper.test.ReadOnlyModeTest.setUp(ReadOnlyModeTest.java:58)


FAILED:  org.apache.zookeeper.test.ReadOnlyModeTest.testConnectionEvents

Error Message:
Waiting for server up

Stack Trace:
junit.framework.AssertionFailedError: Waiting for server up
	at org.apache.zookeeper.test.QuorumUtil.startQuorum(QuorumUtil.java:196)
	at org.apache.zookeeper.test.ReadOnlyModeTest.setUp(ReadOnlyModeTest.java:58)


FAILED:  org.apache.zookeeper.test.ReadOnlyModeTest.testMultiTransaction

Error Message:
Waiting for server up

Stack Trace:
junit.framework.AssertionFailedError: Waiting for server up
	at org.apache.zookeeper.test.QuorumUtil.startQuorum(QuorumUtil.java:196)
	at org.apache.zookeeper.test.ReadOnlyModeTest.setUp(ReadOnlyModeTest.java:58)


FAILED:  org.apache.zookeeper.test.ReconfigExceptionTest.testReconfigFailWithAuthWithNoACL

Error Message:
waiting for server up

Stack Trace:
junit.framework.AssertionFailedError: waiting for server up
	at org.apache.zookeeper.test.QuorumUtil.startAll(QuorumUtil.java:151)
	at org.apache.zookeeper.test.ReconfigExceptionTest.setup(ReconfigExceptionTest.java:67)


FAILED:  org.apache.zookeeper.test.ReconfigExceptionTest.testReconfigEnabledWithAuthAndWrongACL

Error Message:
waiting for server up

Stack Trace:
junit.framework.AssertionFailedError: waiting for server up
	at org.apache.zookeeper.test.QuorumUtil.startAll(QuorumUtil.java:151)
	at org.apache.zookeeper.test.ReconfigExceptionTest.setup(ReconfigExceptionTest.java:67)


FAILED:  org.apache.zookeeper.test.ReconfigExceptionTest.testReconfigDisabledByDefault

Error Message:
waiting for server up

Stack Trace:
junit.framework.AssertionFailedError: waiting for server up
	at org.apache.zookeeper.test.QuorumUtil.startAll(QuorumUtil.java:151)
	at org.apache.zookeeper.test.ReconfigExceptionTest.setup(ReconfigExceptionTest.java:67)


FAILED:  org.apache.zookeeper.test.ReconfigExceptionTest.testReconfigEnabledWithAuthAndACL

Error Message:
waiting for server up

Stack Trace:
junit.framework.AssertionFailedError: waiting for server up
	at org.apache.zookeeper.test.QuorumUtil.startAll(QuorumUtil.java:151)
	at org.apache.zookeeper.test.ReconfigExceptionTest.setup(ReconfigExceptionTest.java:67)


FAILED:  org.apache.zookeeper.test.ReconfigExceptionTest.testReconfigFailWithoutAuth

Error Message:
waiting for server up

Stack Trace:
junit.framework.AssertionFailedError: waiting for server up
	at org.apache.zookeeper.test.QuorumUtil.startAll(QuorumUtil.java:151)
	at org.apache.zookeeper.test.ReconfigExceptionTest.setup(ReconfigExceptionTest.java:67)


FAILED:  org.apache.zookeeper.test.ReconfigExceptionTest.testReconfigEnabledWithSuperUser

Error Message:
waiting for server up

Stack Trace:
junit.framework.AssertionFailedError: waiting for server up
	at org.apache.zookeeper.test.QuorumUtil.startAll(QuorumUtil.java:151)
	at org.apache.zookeeper.test.ReconfigExceptionTest.setup(ReconfigExceptionTest.java:67)


FAILED:  org.apache.zookeeper.test.ReconfigMisconfigTest.testReconfigFailWithoutSuperuserPasswordConfiguredOnServer

Error Message:
waiting for server up

Stack Trace:
junit.framework.AssertionFailedError: waiting for server up
	at org.apache.zookeeper.test.QuorumUtil.startAll(QuorumUtil.java:151)
	at org.apache.zookeeper.test.ReconfigMisconfigTest.setup(ReconfigMisconfigTest.java:53)


FAILED:  org.apache.zookeeper.test.ReconfigTest.testQuorumSystemChange

Error Message:
waiting for server up

Stack Trace:
junit.framework.AssertionFailedError: waiting for server up
	at org.apache.zookeeper.test.QuorumUtil.startAll(QuorumUtil.java:151)
	at org.apache.zookeeper.test.ReconfigTest.testQuorumSystemChange(ReconfigTest.java:819)
	at org.apache.zookeeper.JUnit4ZKTestRunner$LoggedInvokeMethod.evaluate(JUnit4ZKTestRunner.java:79)


FAILED:  org.apache.zookeeper.test.ReconfigTest.testPortChange

Error Message:
waiting for server up

Stack Trace:
junit.framework.AssertionFailedError: waiting for server up
	at org.apache.zookeeper.test.QuorumUtil.startAll(QuorumUtil.java:151)
	at org.apache.zookeeper.test.ReconfigTest.testPortChange(ReconfigTest.java:591)
	at org.apache.zookeeper.JUnit4ZKTestRunner$LoggedInvokeMethod.evaluate(JUnit4ZKTestRunner.java:79)


FAILED:  org.apache.zookeeper.test.ReconfigTest.testPortChangeToBlockedPortLeader

Error Message:
waiting for server up

Stack Trace:
junit.framework.AssertionFailedError: waiting for server up
	at org.apache.zookeeper.test.QuorumUtil.startAll(QuorumUtil.java:151)
	at org.apache.zookeeper.test.ReconfigTest.testPortChangeToBlockedPort(ReconfigTest.java:725)
	at org.apache.zookeeper.test.ReconfigTest.testPortChangeToBlockedPortLeader(ReconfigTest.java:719)
	at org.apache.zookeeper.JUnit4ZKTestRunner$LoggedInvokeMethod.evaluate(JUnit4ZKTestRunner.java:79)


FAILED:  org.apache.zookeeper.test.ReconfigTest.testInitialConfigHasPositiveVersion

Error Message:
waiting for server up

Stack Trace:
junit.framework.AssertionFailedError: waiting for server up
	at org.apache.zookeeper.test.QuorumUtil.startAll(QuorumUtil.java:151)
	at org.apache.zookeeper.test.ReconfigTest.testInitialConfigHasPositiveVersion(ReconfigTest.java:896)
	at org.apache.zookeeper.JUnit4ZKTestRunner$LoggedInvokeMethod.evaluate(JUnit4ZKTestRunner.java:79)


FAILED:  org.apache.zookeeper.test.ReconfigTest.testRemoveAddOne

Error Message:
waiting for server up

Stack Trace:
junit.framework.AssertionFailedError: waiting for server up
	at org.apache.zookeeper.test.QuorumUtil.startAll(QuorumUtil.java:151)
	at org.apache.zookeeper.test.ReconfigTest.testRemoveAddOne(ReconfigTest.java:252)
	at org.apache.zookeeper.JUnit4ZKTestRunner$LoggedInvokeMethod.evaluate(JUnit4ZKTestRunner.java:79)


FAILED:  org.apache.zookeeper.test.ReconfigTest.testRemoveAddTwo

Error Message:
waiting for server up

Stack Trace:
junit.framework.AssertionFailedError: waiting for server up
	at org.apache.zookeeper.test.QuorumUtil.startAll(QuorumUtil.java:151)
	at org.apache.zookeeper.test.ReconfigTest.testRemoveAddTwo(ReconfigTest.java:334)
	at org.apache.zookeeper.JUnit4ZKTestRunner$LoggedInvokeMethod.evaluate(JUnit4ZKTestRunner.java:79)


FAILED:  org.apache.zookeeper.test.ReconfigTest.testPortChangeToBlockedPortFollower

Error Message:
waiting for server up

Stack Trace:
junit.framework.AssertionFailedError: waiting for server up
	at org.apache.zookeeper.test.QuorumUtil.startAll(QuorumUtil.java:151)
	at org.apache.zookeeper.test.ReconfigTest.testPortChangeToBlockedPort(ReconfigTest.java:725)
	at org.apache.zookeeper.test.ReconfigTest.testPortChangeToBlockedPortFollower(ReconfigTest.java:715)
	at org.apache.zookeeper.JUnit4ZKTestRunner$LoggedInvokeMethod.evaluate(JUnit4ZKTestRunner.java:79)


FAILED:  org.apache.zookeeper.test.ReconfigTest.testJMXBeanAfterRemoveAddOne

Error Message:
waiting for server up

Stack Trace:
junit.framework.AssertionFailedError: waiting for server up
	at org.apache.zookeeper.test.QuorumUtil.startAll(QuorumUtil.java:151)
	at org.apache.zookeeper.test.ReconfigTest.testJMXBeanAfterRemoveAddOne(ReconfigTest.java:915)
	at org.apache.zookeeper.JUnit4ZKTestRunner$LoggedInvokeMethod.evaluate(JUnit4ZKTestRunner.java:79)


FAILED:  org.apache.zookeeper.test.ReconfigTest.testRoleChange

Error Message:
waiting for server up

Stack Trace:
junit.framework.AssertionFailedError: waiting for server up
	at org.apache.zookeeper.test.QuorumUtil.startAll(QuorumUtil.java:151)
	at org.apache.zookeeper.test.ReconfigTest.testRoleChange(ReconfigTest.java:514)
	at org.apache.zookeeper.JUnit4ZKTestRunner$LoggedInvokeMethod.evaluate(JUnit4ZKTestRunner.java:79)


FAILED:  org.apache.zookeeper.test.ReconfigTest.testBulkReconfig

Error Message:
waiting for server up

Stack Trace:
junit.framework.AssertionFailedError: waiting for server up
	at org.apache.zookeeper.test.QuorumUtil.startAll(QuorumUtil.java:151)
	at org.apache.zookeeper.test.ReconfigTest.testBulkReconfig(ReconfigTest.java:434)
	at org.apache.zookeeper.JUnit4ZKTestRunner$LoggedInvokeMethod.evaluate(JUnit4ZKTestRunner.java:79)


FAILED:  org.apache.zookeeper.test.ReconfigTest.testJMXBeanAfterRoleChange

Error Message:
waiting for server up

Stack Trace:
junit.framework.AssertionFailedError: waiting for server up
	at org.apache.zookeeper.test.QuorumUtil.startAll(QuorumUtil.java:151)
	at org.apache.zookeeper.test.ReconfigTest.testJMXBeanAfterRoleChange(ReconfigTest.java:994)
	at org.apache.zookeeper.JUnit4ZKTestRunner$LoggedInvokeMethod.evaluate(JUnit4ZKTestRunner.java:79)


FAILED:  org.apache.zookeeper.test.ReconfigTest.testRemoveOneAsynchronous

Error Message:
waiting for server up

Stack Trace:
junit.framework.AssertionFailedError: waiting for server up
	at org.apache.zookeeper.test.QuorumUtil.startAll(QuorumUtil.java:151)
	at org.apache.zookeeper.test.ReconfigTest.testRemoveOneAsynchronous(ReconfigTest.java:473)
	at org.apache.zookeeper.JUnit4ZKTestRunner$LoggedInvokeMethod.evaluate(JUnit4ZKTestRunner.java:79)


FAILED:  org.apache.zookeeper.test.RecoveryTest.testRecovery

Error Message:
waiting for server up

Stack Trace:
junit.framework.AssertionFailedError: waiting for server up
	at org.apache.zookeeper.test.RecoveryTest.testRecovery(RecoveryTest.java:79)
	at org.apache.zookeeper.JUnit4ZKTestRunner$LoggedInvokeMethod.evaluate(JUnit4ZKTestRunner.java:79)


FAILED:  org.apache.zookeeper.test.RepeatStartupTest.testFail

Error Message:
waiting for server up

Stack Trace:
junit.framework.AssertionFailedError: waiting for server up
	at org.apache.zookeeper.test.QuorumBase.startServers(QuorumBase.java:223)
	at org.apache.zookeeper.test.QuorumBase.setUp(QuorumBase.java:120)
	at org.apache.zookeeper.test.QuorumBase.setUp(QuorumBase.java:78)
	at org.apache.zookeeper.test.RepeatStartupTest.testFail(RepeatStartupTest.java:40)
	at org.apache.zookeeper.JUnit4ZKTestRunner$LoggedInvokeMethod.evaluate(JUnit4ZKTestRunner.java:79)


FAILED:  org.apache.zookeeper.test.RestoreCommittedLogTest.testRestoreCommittedLog

Error Message:
waiting for server being up 

Stack Trace:
junit.framework.AssertionFailedError: waiting for server being up 
	at org.apache.zookeeper.test.RestoreCommittedLogTest.testRestoreCommittedLog(RestoreCommittedLogTest.java:58)
	at org.apache.zookeeper.JUnit4ZKTestRunner$LoggedInvokeMethod.evaluate(JUnit4ZKTestRunner.java:79)


FAILED:  org.apache.zookeeper.test.SaslAuthDesignatedClientTest.testReadAccessUser

Error Message:
waiting for server up

Stack Trace:
junit.framework.AssertionFailedError: waiting for server up
	at org.apache.zookeeper.test.ClientBase.startServerInstance(ClientBase.java:379)
	at org.apache.zookeeper.test.ClientBase.startServer(ClientBase.java:488)
	at org.apache.zookeeper.test.ClientBase.startServer(ClientBase.java:484)
	at org.apache.zookeeper.test.ClientBase.setUp(ClientBase.java:475)


FAILED:  org.apache.zookeeper.test.SaslAuthDesignatedClientTest.testAuth

Error Message:
waiting for server up

Stack Trace:
junit.framework.AssertionFailedError: waiting for server up
	at org.apache.zookeeper.test.ClientBase.startServerInstance(ClientBase.java:379)
	at org.apache.zookeeper.test.ClientBase.startServer(ClientBase.java:488)
	at org.apache.zookeeper.test.ClientBase.startServer(ClientBase.java:484)
	at org.apache.zookeeper.test.ClientBase.setUp(ClientBase.java:475)


FAILED:  org.apache.zookeeper.test.SaslAuthDesignatedClientTest.testSaslConfig

Error Message:
waiting for server up

Stack Trace:
junit.framework.AssertionFailedError: waiting for server up
	at org.apache.zookeeper.test.ClientBase.startServerInstance(ClientBase.java:379)
	at org.apache.zookeeper.test.ClientBase.startServer(ClientBase.java:488)
	at org.apache.zookeeper.test.ClientBase.startServer(ClientBase.java:484)
	at org.apache.zookeeper.test.ClientBase.setUp(ClientBase.java:475)


FAILED:  org.apache.zookeeper.test.SaslAuthDesignatedServerTest.testAuth

Error Message:
waiting for server up

Stack Trace:
junit.framework.AssertionFailedError: waiting for server up
	at org.apache.zookeeper.test.ClientBase.startServerInstance(ClientBase.java:379)
	at org.apache.zookeeper.test.ClientBase.startServer(ClientBase.java:488)
	at org.apache.zookeeper.test.ClientBase.startServer(ClientBase.java:484)
	at org.apache.zookeeper.test.ClientBase.setUp(ClientBase.java:475)


FAILED:  org.apache.zookeeper.test.SaslAuthFailDesignatedClientTest.testAuth

Error Message:
waiting for server up

Stack Trace:
junit.framework.AssertionFailedError: waiting for server up
	at org.apache.zookeeper.test.ClientBase.startServerInstance(ClientBase.java:379)
	at org.apache.zookeeper.test.ClientBase.startServer(ClientBase.java:488)
	at org.apache.zookeeper.test.ClientBase.startServer(ClientBase.java:484)
	at org.apache.zookeeper.test.ClientBase.setUp(ClientBase.java:475)


FAILED:  org.apache.zookeeper.test.SaslAuthFailNotifyTest.testBadSaslAuthNotifiesWatch

Error Message:
waiting for server up

Stack Trace:
junit.framework.AssertionFailedError: waiting for server up
	at org.apache.zookeeper.test.ClientBase.startServerInstance(ClientBase.java:379)
	at org.apache.zookeeper.test.ClientBase.startServer(ClientBase.java:488)
	at org.apache.zookeeper.test.ClientBase.startServer(ClientBase.java:484)
	at org.apache.zookeeper.test.ClientBase.setUp(ClientBase.java:475)


FAILED:  org.apache.zookeeper.test.SaslAuthFailTest.testAuthFail

Error Message:
waiting for server up

Stack Trace:
junit.framework.AssertionFailedError: waiting for server up
	at org.apache.zookeeper.test.ClientBase.startServerInstance(ClientBase.java:379)
	at org.apache.zookeeper.test.ClientBase.startServer(ClientBase.java:488)
	at org.apache.zookeeper.test.ClientBase.startServer(ClientBase.java:484)
	at org.apache.zookeeper.test.ClientBase.setUp(ClientBase.java:475)


FAILED:  org.apache.zookeeper.test.SaslAuthMissingClientConfigTest.testAuth

Error Message:
waiting for server up

Stack Trace:
junit.framework.AssertionFailedError: waiting for server up
	at org.apache.zookeeper.test.ClientBase.startServerInstance(ClientBase.java:379)
	at org.apache.zookeeper.test.ClientBase.startServer(ClientBase.java:488)
	at org.apache.zookeeper.test.ClientBase.startServer(ClientBase.java:484)
	at org.apache.zookeeper.test.ClientBase.setUp(ClientBase.java:475)


FAILED:  org.apache.zookeeper.test.SaslAuthTest.testAuth

Error Message:
waiting for server up

Stack Trace:
junit.framework.AssertionFailedError: waiting for server up
	at org.apache.zookeeper.test.ClientBase.startServerInstance(ClientBase.java:379)
	at org.apache.zookeeper.test.ClientBase.startServer(ClientBase.java:488)
	at org.apache.zookeeper.test.ClientBase.startServer(ClientBase.java:484)
	at org.apache.zookeeper.test.ClientBase.setUp(ClientBase.java:475)


FAILED:  org.apache.zookeeper.test.SaslAuthTest.testInvalidSaslIds

Error Message:
waiting for server up

Stack Trace:
junit.framework.AssertionFailedError: waiting for server up
	at org.apache.zookeeper.test.ClientBase.startServerInstance(ClientBase.java:379)
	at org.apache.zookeeper.test.ClientBase.startServer(ClientBase.java:488)
	at org.apache.zookeeper.test.ClientBase.startServer(ClientBase.java:484)
	at org.apache.zookeeper.test.ClientBase.setUp(ClientBase.java:475)


FAILED:  org.apache.zookeeper.test.SaslAuthTest.testValidSaslIds

Error Message:
waiting for server up

Stack Trace:
junit.framework.AssertionFailedError: waiting for server up
	at org.apache.zookeeper.test.ClientBase.startServerInstance(ClientBase.java:379)
	at org.apache.zookeeper.test.ClientBase.startServer(ClientBase.java:488)
	at org.apache.zookeeper.test.ClientBase.startServer(ClientBase.java:484)
	at org.apache.zookeeper.test.ClientBase.setUp(ClientBase.java:475)


FAILED:  org.apache.zookeeper.test.ServerCnxnTest.testServerCnxnExpiry

Error Message:
waiting for server up

Stack Trace:
junit.framework.AssertionFailedError: waiting for server up
	at org.apache.zookeeper.test.ClientBase.startServerInstance(ClientBase.java:379)
	at org.apache.zookeeper.test.ClientBase.startServer(ClientBase.java:488)
	at org.apache.zookeeper.test.ClientBase.startServer(ClientBase.java:484)
	at org.apache.zookeeper.test.ClientBase.setUp(ClientBase.java:475)
	at org.apache.zookeeper.test.ServerCnxnTest.setUp(ServerCnxnTest.java:47)


FAILED:  org.apache.zookeeper.test.SessionInvalidationTest.testCreateAfterCloseShouldFail

Error Message:
waiting for server up

Stack Trace:
junit.framework.AssertionFailedError: waiting for server up
	at org.apache.zookeeper.test.ClientBase.startServerInstance(ClientBase.java:379)
	at org.apache.zookeeper.test.ClientBase.startServer(ClientBase.java:488)
	at org.apache.zookeeper.test.ClientBase.startServer(ClientBase.java:484)
	at org.apache.zookeeper.test.ClientBase.setUp(ClientBase.java:475)


FAILED:  org.apache.zookeeper.test.SessionTest.testSessionTimeout

Error Message:
waiting for server up

Stack Trace:
junit.framework.AssertionFailedError: waiting for server up
	at org.apache.zookeeper.test.SessionTest.setUp(SessionTest.java:80)


FAILED:  org.apache.zookeeper.test.SessionTest.testMinMaxSessionTimeout

Error Message:
waiting for server up

Stack Trace:
junit.framework.AssertionFailedError: waiting for server up
	at org.apache.zookeeper.test.SessionTest.setUp(SessionTest.java:80)


FAILED:  org.apache.zookeeper.test.SessionTest.testSessionMove

Error Message:
waiting for server up

Stack Trace:
junit.framework.AssertionFailedError: waiting for server up
	at org.apache.zookeeper.test.SessionTest.setUp(SessionTest.java:80)


FAILED:  org.apache.zookeeper.test.SessionTest.testSessionTimeoutAccess

Error Message:
waiting for server up

Stack Trace:
junit.framework.AssertionFailedError: waiting for server up
	at org.apache.zookeeper.test.SessionTest.setUp(SessionTest.java:80)


FAILED:  org.apache.zookeeper.test.SessionTest.testSession

Error Message:
waiting for server up

Stack Trace:
junit.framework.AssertionFailedError: waiting for server up
	at org.apache.zookeeper.test.SessionTest.setUp(SessionTest.java:80)


FAILED:  org.apache.zookeeper.test.SessionTest.testSessionStateNoDupStateReporting

Error Message:
waiting for server up

Stack Trace:
junit.framework.AssertionFailedError: waiting for server up
	at org.apache.zookeeper.test.SessionTest.setUp(SessionTest.java:80)


FAILED:  org.apache.zookeeper.test.SessionUpgradeTest.testLocalSessionsWithoutEphemeralOnFollower

Error Message:
waiting for server up

Stack Trace:
junit.framework.AssertionFailedError: waiting for server up
	at org.apache.zookeeper.test.QuorumBase.startServers(QuorumBase.java:223)
	at org.apache.zookeeper.test.QuorumBase.setUp(QuorumBase.java:120)
	at org.apache.zookeeper.test.QuorumBase.setUp(QuorumBase.java:78)
	at org.apache.zookeeper.test.SessionUpgradeTest.setUp(SessionUpgradeTest.java:52)


FAILED:  org.apache.zookeeper.test.SessionUpgradeTest.testLocalSessionsWithoutEphemeralOnLeader

Error Message:
waiting for server up

Stack Trace:
junit.framework.AssertionFailedError: waiting for server up
	at org.apache.zookeeper.test.QuorumBase.startServers(QuorumBase.java:223)
	at org.apache.zookeeper.test.QuorumBase.setUp(QuorumBase.java:120)
	at org.apache.zookeeper.test.QuorumBase.setUp(QuorumBase.java:78)
	at org.apache.zookeeper.test.SessionUpgradeTest.setUp(SessionUpgradeTest.java:52)


FAILED:  org.apache.zookeeper.test.SessionUpgradeTest.testUpgradeWithEphemeralOnLeader

Error Message:
waiting for server up

Stack Trace:
junit.framework.AssertionFailedError: waiting for server up
	at org.apache.zookeeper.test.QuorumBase.startServers(QuorumBase.java:223)
	at org.apache.zookeeper.test.QuorumBase.setUp(QuorumBase.java:120)
	at org.apache.zookeeper.test.QuorumBase.setUp(QuorumBase.java:78)
	at org.apache.zookeeper.test.SessionUpgradeTest.setUp(SessionUpgradeTest.java:52)


FAILED:  org.apache.zookeeper.test.SessionUpgradeTest.testUpgradeWithEphemeralOnFollower

Error Message:
waiting for server up

Stack Trace:
junit.framework.AssertionFailedError: waiting for server up
	at org.apache.zookeeper.test.QuorumBase.startServers(QuorumBase.java:223)
	at org.apache.zookeeper.test.QuorumBase.setUp(QuorumBase.java:120)
	at org.apache.zookeeper.test.QuorumBase.setUp(QuorumBase.java:78)
	at org.apache.zookeeper.test.SessionUpgradeTest.setUp(SessionUpgradeTest.java:52)


FAILED:  org.apache.zookeeper.test.StatTest.testChildren

Error Message:
null

Stack Trace:
java.lang.NullPointerException
	at org.apache.zookeeper.test.StatTest.tearDown(StatTest.java:45)


FAILED:  org.apache.zookeeper.test.StatTest.testBasic

Error Message:
null

Stack Trace:
java.lang.NullPointerException
	at org.apache.zookeeper.test.StatTest.tearDown(StatTest.java:45)


FAILED:  org.apache.zookeeper.test.StatTest.testChild

Error Message:
null

Stack Trace:
java.lang.NullPointerException
	at org.apache.zookeeper.test.StatTest.tearDown(StatTest.java:45)


FAILED:  org.apache.zookeeper.test.StatTest.testDataSizeChange

Error Message:
null

Stack Trace:
java.lang.NullPointerException
	at org.apache.zookeeper.test.StatTest.tearDown(StatTest.java:45)


FAILED:  org.apache.zookeeper.test.SyncCallTest.testSync

Error Message:
waiting for server up

Stack Trace:
junit.framework.AssertionFailedError: waiting for server up
	at org.apache.zookeeper.test.ClientBase.startServerInstance(ClientBase.java:379)
	at org.apache.zookeeper.test.ClientBase.startServer(ClientBase.java:488)
	at org.apache.zookeeper.test.ClientBase.startServer(ClientBase.java:484)
	at org.apache.zookeeper.test.ClientBase.setUp(ClientBase.java:475)


FAILED:  org.apache.zookeeper.test.TruncateTest.testTruncate

Error Message:
waiting for server up

Stack Trace:
junit.framework.AssertionFailedError: waiting for server up
	at org.apache.zookeeper.test.ClientBase.startServerInstance(ClientBase.java:379)
	at org.apache.zookeeper.test.TruncateTest.testTruncate(TruncateTest.java:154)
	at org.apache.zookeeper.JUnit4ZKTestRunner$LoggedInvokeMethod.evaluate(JUnit4ZKTestRunner.java:79)


FAILED:  org.apache.zookeeper.test.WatchEventWhenAutoResetTest.testNodeChildrenChanged

Error Message:
waiting for server up

Stack Trace:
junit.framework.AssertionFailedError: waiting for server up
	at org.apache.zookeeper.test.QuorumUtil.startAll(QuorumUtil.java:151)
	at org.apache.zookeeper.test.WatchEventWhenAutoResetTest.testNodeChildrenChanged(WatchEventWhenAutoResetTest.java:197)
	at org.apache.zookeeper.JUnit4ZKTestRunner$LoggedInvokeMethod.evaluate(JUnit4ZKTestRunner.java:79)


FAILED:  org.apache.zookeeper.test.WatchEventWhenAutoResetTest.testNodeDataChanged

Error Message:
waiting for server up

Stack Trace:
junit.framework.AssertionFailedError: waiting for server up
	at org.apache.zookeeper.test.QuorumUtil.startAll(QuorumUtil.java:151)
	at org.apache.zookeeper.test.WatchEventWhenAutoResetTest.testNodeDataChanged(WatchEventWhenAutoResetTest.java:100)
	at org.apache.zookeeper.JUnit4ZKTestRunner$LoggedInvokeMethod.evaluate(JUnit4ZKTestRunner.java:79)


FAILED:  org.apache.zookeeper.test.WatchEventWhenAutoResetTest.testNodeCreated

Error Message:
waiting for server up

Stack Trace:
junit.framework.AssertionFailedError: waiting for server up
	at org.apache.zookeeper.test.QuorumUtil.startAll(QuorumUtil.java:151)
	at org.apache.zookeeper.test.WatchEventWhenAutoResetTest.testNodeCreated(WatchEventWhenAutoResetTest.java:134)
	at org.apache.zookeeper.JUnit4ZKTestRunner$LoggedInvokeMethod.evaluate(JUnit4ZKTestRunner.java:79)


FAILED:  org.apache.zookeeper.test.WatchEventWhenAutoResetTest.testNodeDeleted

Error Message:
waiting for server up

Stack Trace:
junit.framework.AssertionFailedError: waiting for server up
	at org.apache.zookeeper.test.QuorumUtil.startAll(QuorumUtil.java:151)
	at org.apache.zookeeper.test.WatchEventWhenAutoResetTest.testNodeDeleted(WatchEventWhenAutoResetTest.java:156)
	at org.apache.zookeeper.JUnit4ZKTestRunner$LoggedInvokeMethod.evaluate(JUnit4ZKTestRunner.java:79)


FAILED:  org.apache.zookeeper.test.WatcherFuncTest.testGetDataSync

Error Message:
null

Stack Trace:
java.lang.NullPointerException
	at org.apache.zookeeper.test.WatcherFuncTest.tearDown(WatcherFuncTest.java:104)


FAILED:  org.apache.zookeeper.test.WatcherFuncTest.testExistsSync

Error Message:
null

Stack Trace:
java.lang.NullPointerException
	at org.apache.zookeeper.test.WatcherFuncTest.tearDown(WatcherFuncTest.java:104)


FAILED:  org.apache.zookeeper.test.WatcherFuncTest.testGetDataSyncWObj

Error Message:
null

Stack Trace:
java.lang.NullPointerException
	at org.apache.zookeeper.test.WatcherFuncTest.tearDown(WatcherFuncTest.java:104)


FAILED:  org.apache.zookeeper.test.WatcherFuncTest.testGetChildrenSyncWObj

Error Message:
null

Stack Trace:
java.lang.NullPointerException
	at org.apache.zookeeper.test.WatcherFuncTest.tearDown(WatcherFuncTest.java:104)


FAILED:  org.apache.zookeeper.test.WatcherFuncTest.testGetChildrenSync

Error Message:
null

Stack Trace:
java.lang.NullPointerException
	at org.apache.zookeeper.test.WatcherFuncTest.tearDown(WatcherFuncTest.java:104)


FAILED:  org.apache.zookeeper.test.WatcherFuncTest.testExistsSyncWObj

Error Message:
null

Stack Trace:
java.lang.NullPointerException
	at org.apache.zookeeper.test.WatcherFuncTest.tearDown(WatcherFuncTest.java:104)


FAILED:  org.apache.zookeeper.test.WatcherTest.testWatchAutoResetWithPending

Error Message:
waiting for server up

Stack Trace:
junit.framework.AssertionFailedError: waiting for server up
	at org.apache.zookeeper.test.ClientBase.startServerInstance(ClientBase.java:379)
	at org.apache.zookeeper.test.ClientBase.startServer(ClientBase.java:488)
	at org.apache.zookeeper.test.ClientBase.startServer(ClientBase.java:484)
	at org.apache.zookeeper.test.ClientBase.setUp(ClientBase.java:475)
	at org.apache.zookeeper.test.WatcherTest.setUp(WatcherTest.java:76)


FAILED:  org.apache.zookeeper.test.WatcherTest.testWatcherCorrectness

Error Message:
waiting for server up

Stack Trace:
junit.framework.AssertionFailedError: waiting for server up
	at org.apache.zookeeper.test.ClientBase.startServerInstance(ClientBase.java:379)
	at org.apache.zookeeper.test.ClientBase.startServer(ClientBase.java:488)
	at org.apache.zookeeper.test.ClientBase.startServer(ClientBase.java:484)
	at org.apache.zookeeper.test.ClientBase.setUp(ClientBase.java:475)
	at org.apache.zookeeper.test.WatcherTest.setUp(WatcherTest.java:76)


FAILED:  org.apache.zookeeper.test.WatcherTest.testWatcherAutoResetDisabledWithLocal

Error Message:
waiting for server up

Stack Trace:
junit.framework.AssertionFailedError: waiting for server up
	at org.apache.zookeeper.test.ClientBase.startServerInstance(ClientBase.java:379)
	at org.apache.zookeeper.test.ClientBase.startServer(ClientBase.java:488)
	at org.apache.zookeeper.test.ClientBase.startServer(ClientBase.java:484)
	at org.apache.zookeeper.test.ClientBase.setUp(ClientBase.java:475)
	at org.apache.zookeeper.test.WatcherTest.setUp(WatcherTest.java:76)


FAILED:  org.apache.zookeeper.test.WatcherTest.testWatcherAutoResetWithGlobal

Error Message:
waiting for server up

Stack Trace:
junit.framework.AssertionFailedError: waiting for server up
	at org.apache.zookeeper.test.ClientBase.startServerInstance(ClientBase.java:379)
	at org.apache.zookeeper.test.ClientBase.startServer(ClientBase.java:488)
	at org.apache.zookeeper.test.ClientBase.startServer(ClientBase.java:484)
	at org.apache.zookeeper.test.ClientBase.setUp(ClientBase.java:475)
	at org.apache.zookeeper.test.WatcherTest.setUp(WatcherTest.java:76)


FAILED:  org.apache.zookeeper.test.WatcherTest.testWatcherCount

Error Message:
waiting for server up

Stack Trace:
junit.framework.AssertionFailedError: waiting for server up
	at org.apache.zookeeper.test.ClientBase.startServerInstance(ClientBase.java:379)
	at org.apache.zookeeper.test.ClientBase.startServer(ClientBase.java:488)
	at org.apache.zookeeper.test.ClientBase.startServer(ClientBase.java:484)
	at org.apache.zookeeper.test.ClientBase.setUp(ClientBase.java:475)
	at org.apache.zookeeper.test.WatcherTest.setUp(WatcherTest.java:76)


FAILED:  org.apache.zookeeper.test.WatcherTest.testWatcherAutoResetDisabledWithGlobal

Error Message:
waiting for server up

Stack Trace:
junit.framework.AssertionFailedError: waiting for server up
	at org.apache.zookeeper.test.ClientBase.startServerInstance(ClientBase.java:379)
	at org.apache.zookeeper.test.ClientBase.startServer(ClientBase.java:488)
	at org.apache.zookeeper.test.ClientBase.startServer(ClientBase.java:484)
	at org.apache.zookeeper.test.ClientBase.setUp(ClientBase.java:475)
	at org.apache.zookeeper.test.WatcherTest.setUp(WatcherTest.java:76)


FAILED:  org.apache.zookeeper.test.WatcherTest.testWatcherAutoResetWithLocal

Error Message:
waiting for server up

Stack Trace:
junit.framework.AssertionFailedError: waiting for server up
	at org.apache.zookeeper.test.ClientBase.startServerInstance(ClientBase.java:379)
	at org.apache.zookeeper.test.ClientBase.startServer(ClientBase.java:488)
	at org.apache.zookeeper.test.ClientBase.startServer(ClientBase.java:484)
	at org.apache.zookeeper.test.ClientBase.setUp(ClientBase.java:475)
	at org.apache.zookeeper.test.WatcherTest.setUp(WatcherTest.java:76)


FAILED:  org.apache.zookeeper.test.ZkDatabaseCorruptionTest.testCorruption

Error Message:
waiting for server up

Stack Trace:
junit.framework.AssertionFailedError: waiting for server up
	at org.apache.zookeeper.test.QuorumBase.startServers(QuorumBase.java:223)
	at org.apache.zookeeper.test.QuorumBase.setUp(QuorumBase.java:120)
	at org.apache.zookeeper.test.QuorumBase.setUp(QuorumBase.java:78)
	at org.apache.zookeeper.test.ZkDatabaseCorruptionTest.setUp(ZkDatabaseCorruptionTest.java:51)


FAILED:  org.apache.zookeeper.test.ZooKeeperQuotaTest.testQuota

Error Message:
waiting for server up

Stack Trace:
junit.framework.AssertionFailedError: waiting for server up
	at org.apache.zookeeper.test.ClientBase.startServerInstance(ClientBase.java:379)
	at org.apache.zookeeper.test.ClientBase.startServer(ClientBase.java:488)
	at org.apache.zookeeper.test.ClientBase.startServer(ClientBase.java:484)
	at org.apache.zookeeper.test.ClientBase.setUp(ClientBase.java:475)



Mime
  • Unnamed multipart/mixed (inline, None, 0 bytes)
View raw message