zookeeper-dev mailing list archives

Site index · List index
Message view « Date » · « Thread »
Top « Date » · « Thread »
From Apache Jenkins Server <jenk...@builds.apache.org>
Subject ZooKeeper_branch35_openjdk7 - Build # 444 - Still Failing
Date Thu, 09 Mar 2017 03:09:44 GMT
See https://builds.apache.org/job/ZooKeeper_branch35_openjdk7/444/

###################################################################################
########################## LAST 60 LINES OF THE CONSOLE ###########################
[...truncated 54.79 MB...]
    [junit] 2017-03-09 03:08:56,511 [myid:127.0.0.1:14044] - INFO  [main-SendThread(127.0.0.1:14044):ClientCnxn$SendThread@1113]
- Opening socket connection to server 127.0.0.1/127.0.0.1:14044. Will not attempt to authenticate
using SASL (unknown error)
    [junit] 2017-03-09 03:08:56,511 [myid:127.0.0.1:14044] - WARN  [main-SendThread(127.0.0.1:14044):ClientCnxn$SendThread@1235]
- Session 0x301cfba6cb50000 for server 127.0.0.1/127.0.0.1:14044, unexpected error, closing
socket connection and attempting reconnect
    [junit] java.net.ConnectException: Connection refused
    [junit] 	at sun.nio.ch.SocketChannelImpl.checkConnect(Native Method)
    [junit] 	at sun.nio.ch.SocketChannelImpl.finishConnect(SocketChannelImpl.java:739)
    [junit] 	at org.apache.zookeeper.ClientCnxnSocketNIO.doTransport(ClientCnxnSocketNIO.java:357)
    [junit] 	at org.apache.zookeeper.ClientCnxn$SendThread.run(ClientCnxn.java:1214)
    [junit] 2017-03-09 03:08:56,750 [myid:127.0.0.1:13915] - INFO  [main-SendThread(127.0.0.1:13915):ClientCnxn$SendThread@1113]
- Opening socket connection to server 127.0.0.1/127.0.0.1:13915. Will not attempt to authenticate
using SASL (unknown error)
    [junit] 2017-03-09 03:08:56,751 [myid:127.0.0.1:13915] - WARN  [main-SendThread(127.0.0.1:13915):ClientCnxn$SendThread@1235]
- Session 0x101cfb4e0bc0000 for server 127.0.0.1/127.0.0.1:13915, unexpected error, closing
socket connection and attempting reconnect
    [junit] java.net.ConnectException: Connection refused
    [junit] 	at sun.nio.ch.SocketChannelImpl.checkConnect(Native Method)
    [junit] 	at sun.nio.ch.SocketChannelImpl.finishConnect(SocketChannelImpl.java:739)
    [junit] 	at org.apache.zookeeper.ClientCnxnSocketNIO.doTransport(ClientCnxnSocketNIO.java:357)
    [junit] 	at org.apache.zookeeper.ClientCnxn$SendThread.run(ClientCnxn.java:1214)
    [junit] 2017-03-09 03:08:56,910 [myid:127.0.0.1:14038] - INFO  [main-SendThread(127.0.0.1:14038):ClientCnxn$SendThread@1113]
- Opening socket connection to server 127.0.0.1/127.0.0.1:14038. Will not attempt to authenticate
using SASL (unknown error)
    [junit] 2017-03-09 03:08:56,910 [myid:127.0.0.1:14038] - WARN  [main-SendThread(127.0.0.1:14038):ClientCnxn$SendThread@1235]
- Session 0x101cfba6cb30000 for server 127.0.0.1/127.0.0.1:14038, unexpected error, closing
socket connection and attempting reconnect
    [junit] java.net.ConnectException: Connection refused
    [junit] 	at sun.nio.ch.SocketChannelImpl.checkConnect(Native Method)
    [junit] 	at sun.nio.ch.SocketChannelImpl.finishConnect(SocketChannelImpl.java:739)
    [junit] 	at org.apache.zookeeper.ClientCnxnSocketNIO.doTransport(ClientCnxnSocketNIO.java:357)
    [junit] 	at org.apache.zookeeper.ClientCnxn$SendThread.run(ClientCnxn.java:1214)
    [junit] 2017-03-09 03:08:57,014 [myid:] - INFO  [ProcessThread(sid:0 cport:14161)::PrepRequestProcessor@655]
- Processed session termination for sessionid: 0x101cfbda3fa0000
    [junit] 2017-03-09 03:08:57,016 [myid:] - INFO  [main:ZooKeeper@1324] - Session: 0x101cfbda3fa0000
closed
    [junit] 2017-03-09 03:08:57,016 [myid:] - INFO  [main-EventThread:ClientCnxn$EventThread@513]
- EventThread shut down for session: 0x101cfbda3fa0000
    [junit] 2017-03-09 03:08:57,016 [myid:] - INFO  [SyncThread:0:MBeanRegistry@128] - Unregister
MBean [org.apache.ZooKeeperService:name0=StandaloneServer_port14161,name1=Connections,name2=127.0.0.1,name3=0x101cfbda3fa0000]
    [junit] 2017-03-09 03:08:57,016 [myid:] - INFO  [main:JUnit4ZKTestRunner$LoggedInvokeMethod@82]
- Memory used 207252
    [junit] 2017-03-09 03:08:57,017 [myid:] - INFO  [main:JUnit4ZKTestRunner$LoggedInvokeMethod@87]
- Number of threads 1643
    [junit] 2017-03-09 03:08:57,017 [myid:] - INFO  [main:JUnit4ZKTestRunner$LoggedInvokeMethod@102]
- FINISHED TEST METHOD testWatcherAutoResetWithLocal
    [junit] 2017-03-09 03:08:57,017 [myid:] - INFO  [main:ClientBase@543] - tearDown starting
    [junit] 2017-03-09 03:08:57,017 [myid:] - INFO  [main:ClientBase@513] - STOPPING server
    [junit] 2017-03-09 03:08:57,017 [myid:] - INFO  [main:NettyServerCnxnFactory@464] - shutdown
called 0.0.0.0/0.0.0.0:14161
    [junit] 2017-03-09 03:08:57,024 [myid:] - INFO  [main:ZooKeeperServer@541] - shutting
down
    [junit] 2017-03-09 03:08:57,024 [myid:] - ERROR [main:ZooKeeperServer@505] - ZKShutdownHandler
is not registered, so ZooKeeper server won't take any action on ERROR or SHUTDOWN server state
changes
    [junit] 2017-03-09 03:08:57,024 [myid:] - INFO  [main:SessionTrackerImpl@232] - Shutting
down
    [junit] 2017-03-09 03:08:57,024 [myid:] - INFO  [main:PrepRequestProcessor@973] - Shutting
down
    [junit] 2017-03-09 03:08:57,025 [myid:] - INFO  [main:SyncRequestProcessor@191] - Shutting
down
    [junit] 2017-03-09 03:08:57,025 [myid:] - INFO  [SyncThread:0:SyncRequestProcessor@169]
- SyncRequestProcessor exited!
    [junit] 2017-03-09 03:08:57,025 [myid:] - INFO  [ProcessThread(sid:0 cport:14161)::PrepRequestProcessor@154]
- PrepRequestProcessor exited loop!
    [junit] 2017-03-09 03:08:57,025 [myid:] - INFO  [main:FinalRequestProcessor@479] - shutdown
of request processor complete
    [junit] 2017-03-09 03:08:57,029 [myid:] - INFO  [main:MBeanRegistry@128] - Unregister
MBean [org.apache.ZooKeeperService:name0=StandaloneServer_port14161,name1=InMemoryDataTree]
    [junit] 2017-03-09 03:08:57,030 [myid:] - INFO  [main:MBeanRegistry@128] - Unregister
MBean [org.apache.ZooKeeperService:name0=StandaloneServer_port14161]
    [junit] 2017-03-09 03:08:57,054 [myid:] - INFO  [main:FourLetterWordMain@85] - connecting
to 127.0.0.1 14161
    [junit] 2017-03-09 03:08:57,054 [myid:] - INFO  [main:JMXEnv@146] - ensureOnly:[]
    [junit] 2017-03-09 03:08:57,061 [myid:] - INFO  [main:ClientBase@568] - fdcount after
test is: 4840 at start it was 4840
    [junit] 2017-03-09 03:08:57,061 [myid:] - INFO  [main:ZKTestCase$1@68] - SUCCEEDED testWatcherAutoResetWithLocal
    [junit] 2017-03-09 03:08:57,061 [myid:] - INFO  [main:ZKTestCase$1@63] - FINISHED testWatcherAutoResetWithLocal
    [junit] Tests run: 103, Failures: 0, Errors: 0, Skipped: 0, Time elapsed: 581.444 sec,
Thread: 2, Class: org.apache.zookeeper.test.NioNettySuiteTest

fail.build.on.test.failure:

BUILD FAILED
/home/jenkins/jenkins-slave/workspace/ZooKeeper_branch35_openjdk7/build.xml:1212: The following
error occurred while executing this line:
/home/jenkins/jenkins-slave/workspace/ZooKeeper_branch35_openjdk7/build.xml:1216: Tests failed!

Total time: 15 minutes 21 seconds
Build step 'Invoke Ant' marked build as failure
Recording test results
Email was triggered for: Failure - Any
Sending email for trigger: Failure - Any



###################################################################################
############################## FAILED TESTS (if any) ##############################
8 tests failed.
FAILED:  org.apache.zookeeper.test.LETest.testLE

Error Message:
Threads didn't join

Stack Trace:
junit.framework.AssertionFailedError: Threads didn't join
	at org.apache.zookeeper.test.LETest.testLE(LETest.java:123)
	at org.apache.zookeeper.JUnit4ZKTestRunner$LoggedInvokeMethod.evaluate(JUnit4ZKTestRunner.java:79)


FAILED:  org.apache.zookeeper.test.WatcherTest.testWatchAutoResetWithPending

Error Message:
Unexpected bean exists! expected:<0> but was:<1>

Stack Trace:
junit.framework.AssertionFailedError: Unexpected bean exists! expected:<0> but was:<1>
	at org.apache.zookeeper.test.ClientBase.verifyUnexpectedBeans(ClientBase.java:498)
	at org.apache.zookeeper.test.ClientBase.startServer(ClientBase.java:477)
	at org.apache.zookeeper.test.ClientBase.setUp(ClientBase.java:460)
	at org.apache.zookeeper.test.WatcherTest.setUp(WatcherTest.java:76)


FAILED:  org.apache.zookeeper.test.WatcherTest.testWatcherCorrectness

Error Message:
Unexpected bean exists! expected:<0> but was:<1>

Stack Trace:
junit.framework.AssertionFailedError: Unexpected bean exists! expected:<0> but was:<1>
	at org.apache.zookeeper.test.ClientBase.verifyUnexpectedBeans(ClientBase.java:498)
	at org.apache.zookeeper.test.ClientBase.startServer(ClientBase.java:477)
	at org.apache.zookeeper.test.ClientBase.setUp(ClientBase.java:460)
	at org.apache.zookeeper.test.WatcherTest.setUp(WatcherTest.java:76)


FAILED:  org.apache.zookeeper.test.WatcherTest.testWatcherAutoResetDisabledWithLocal

Error Message:
Unexpected bean exists! expected:<0> but was:<1>

Stack Trace:
junit.framework.AssertionFailedError: Unexpected bean exists! expected:<0> but was:<1>
	at org.apache.zookeeper.test.ClientBase.verifyUnexpectedBeans(ClientBase.java:498)
	at org.apache.zookeeper.test.ClientBase.startServer(ClientBase.java:477)
	at org.apache.zookeeper.test.ClientBase.setUp(ClientBase.java:460)
	at org.apache.zookeeper.test.WatcherTest.setUp(WatcherTest.java:76)


FAILED:  org.apache.zookeeper.test.WatcherTest.testWatcherAutoResetWithGlobal

Error Message:
Unexpected bean exists! expected:<0> but was:<1>

Stack Trace:
junit.framework.AssertionFailedError: Unexpected bean exists! expected:<0> but was:<1>
	at org.apache.zookeeper.test.ClientBase.verifyUnexpectedBeans(ClientBase.java:498)
	at org.apache.zookeeper.test.ClientBase.startServer(ClientBase.java:477)
	at org.apache.zookeeper.test.ClientBase.setUp(ClientBase.java:460)
	at org.apache.zookeeper.test.WatcherTest.setUp(WatcherTest.java:76)


FAILED:  org.apache.zookeeper.test.WatcherTest.testWatcherCount

Error Message:
Unexpected bean exists! expected:<0> but was:<1>

Stack Trace:
junit.framework.AssertionFailedError: Unexpected bean exists! expected:<0> but was:<1>
	at org.apache.zookeeper.test.ClientBase.verifyUnexpectedBeans(ClientBase.java:498)
	at org.apache.zookeeper.test.ClientBase.startServer(ClientBase.java:477)
	at org.apache.zookeeper.test.ClientBase.setUp(ClientBase.java:460)
	at org.apache.zookeeper.test.WatcherTest.setUp(WatcherTest.java:76)


FAILED:  org.apache.zookeeper.test.WatcherTest.testWatcherAutoResetDisabledWithGlobal

Error Message:
Unexpected bean exists! expected:<0> but was:<1>

Stack Trace:
junit.framework.AssertionFailedError: Unexpected bean exists! expected:<0> but was:<1>
	at org.apache.zookeeper.test.ClientBase.verifyUnexpectedBeans(ClientBase.java:498)
	at org.apache.zookeeper.test.ClientBase.startServer(ClientBase.java:477)
	at org.apache.zookeeper.test.ClientBase.setUp(ClientBase.java:460)
	at org.apache.zookeeper.test.WatcherTest.setUp(WatcherTest.java:76)


FAILED:  org.apache.zookeeper.test.WatcherTest.testWatcherAutoResetWithLocal

Error Message:
Unexpected bean exists! expected:<0> but was:<1>

Stack Trace:
junit.framework.AssertionFailedError: Unexpected bean exists! expected:<0> but was:<1>
	at org.apache.zookeeper.test.ClientBase.verifyUnexpectedBeans(ClientBase.java:498)
	at org.apache.zookeeper.test.ClientBase.startServer(ClientBase.java:477)
	at org.apache.zookeeper.test.ClientBase.setUp(ClientBase.java:460)
	at org.apache.zookeeper.test.WatcherTest.setUp(WatcherTest.java:76)



Mime
  • Unnamed multipart/mixed (inline, None, 0 bytes)
View raw message