zookeeper-dev mailing list archives

Site index · List index
Message view « Date » · « Thread »
Top « Date » · « Thread »
From Apache Jenkins Server <jenk...@builds.apache.org>
Subject ZooKeeper_branch35_openjdk7 - Build # 461 - Still Failing
Date Sun, 19 Mar 2017 10:13:41 GMT
See https://builds.apache.org/job/ZooKeeper_branch35_openjdk7/461/

###################################################################################
########################## LAST 60 LINES OF THE CONSOLE ###########################
[...truncated 60.59 MB...]
    [junit] 2017-03-19 10:11:03,626 [myid:127.0.0.1:19307] - INFO  [main-SendThread(127.0.0.1:19307):ClientCnxn$SendThread@1229]
- Client session timed out, have not heard from server in 30030ms for sessionid 0x0, closing
socket connection and attempting reconnect
    [junit] 2017-03-19 10:11:04,883 [myid:127.0.0.1:19307] - INFO  [main-SendThread(127.0.0.1:19307):ClientCnxn$SendThread@1113]
- Opening socket connection to server 127.0.0.1/127.0.0.1:19307. Will not attempt to authenticate
using SASL (unknown error)
    [junit] 2017-03-19 10:11:04,883 [myid:127.0.0.1:19307] - INFO  [main-SendThread(127.0.0.1:19307):ClientCnxn$SendThread@948]
- Socket connection established, initiating session, client: /127.0.0.1:38267, server: 127.0.0.1/127.0.0.1:19307
    [junit] 2017-03-19 10:11:04,884 [myid:2] - INFO  [NIOServerCxnFactory.AcceptThread:localhost/127.0.0.1:19307:NIOServerCnxnFactory$AcceptThread@296]
- Accepted socket connection from /127.0.0.1:38267
    [junit] 2017-03-19 10:11:25,214 [myid:127.0.0.1:19307] - WARN  [main-SendThread(127.0.0.1:19307):ClientCnxn$SendThread@1181]
- Client session timed out, have not heard from server in 30030ms for sessionid 0x2005429e0e40000
    [junit] 2017-03-19 10:11:25,214 [myid:127.0.0.1:19307] - INFO  [main-SendThread(127.0.0.1:19307):ClientCnxn$SendThread@1229]
- Client session timed out, have not heard from server in 30030ms for sessionid 0x2005429e0e40000,
closing socket connection and attempting reconnect
    [junit] 2017-03-19 10:11:27,055 [myid:127.0.0.1:19307] - INFO  [main-SendThread(127.0.0.1:19307):ClientCnxn$SendThread@1113]
- Opening socket connection to server 127.0.0.1/127.0.0.1:19307. Will not attempt to authenticate
using SASL (unknown error)
    [junit] 2017-03-19 10:11:27,056 [myid:127.0.0.1:19307] - INFO  [main-SendThread(127.0.0.1:19307):ClientCnxn$SendThread@948]
- Socket connection established, initiating session, client: /127.0.0.1:38274, server: 127.0.0.1/127.0.0.1:19307
    [junit] 2017-03-19 10:11:27,056 [myid:2] - INFO  [NIOServerCxnFactory.AcceptThread:localhost/127.0.0.1:19307:NIOServerCnxnFactory$AcceptThread@296]
- Accepted socket connection from /127.0.0.1:38274
    [junit] 2017-03-19 10:11:34,911 [myid:127.0.0.1:19307] - WARN  [main-SendThread(127.0.0.1:19307):ClientCnxn$SendThread@1181]
- Client session timed out, have not heard from server in 30027ms for sessionid 0x0
    [junit] 2017-03-19 10:11:34,911 [myid:127.0.0.1:19307] - INFO  [main-SendThread(127.0.0.1:19307):ClientCnxn$SendThread@1229]
- Client session timed out, have not heard from server in 30027ms for sessionid 0x0, closing
socket connection and attempting reconnect
    [junit] 2017-03-19 10:11:36,987 [myid:127.0.0.1:19307] - INFO  [main-SendThread(127.0.0.1:19307):ClientCnxn$SendThread@1113]
- Opening socket connection to server 127.0.0.1/127.0.0.1:19307. Will not attempt to authenticate
using SASL (unknown error)
    [junit] 2017-03-19 10:11:36,988 [myid:127.0.0.1:19307] - INFO  [main-SendThread(127.0.0.1:19307):ClientCnxn$SendThread@948]
- Socket connection established, initiating session, client: /127.0.0.1:38280, server: 127.0.0.1/127.0.0.1:19307
    [junit] 2017-03-19 10:11:36,988 [myid:2] - INFO  [NIOServerCxnFactory.AcceptThread:localhost/127.0.0.1:19307:NIOServerCnxnFactory$AcceptThread@296]
- Accepted socket connection from /127.0.0.1:38280
    [junit] 2017-03-19 10:11:57,082 [myid:127.0.0.1:19307] - WARN  [main-SendThread(127.0.0.1:19307):ClientCnxn$SendThread@1181]
- Client session timed out, have not heard from server in 30027ms for sessionid 0x2005429e0e40000
    [junit] 2017-03-19 10:11:57,082 [myid:127.0.0.1:19307] - INFO  [main-SendThread(127.0.0.1:19307):ClientCnxn$SendThread@1229]
- Client session timed out, have not heard from server in 30027ms for sessionid 0x2005429e0e40000,
closing socket connection and attempting reconnect
    [junit] 2017-03-19 10:11:59,011 [myid:127.0.0.1:19307] - INFO  [main-SendThread(127.0.0.1:19307):ClientCnxn$SendThread@1113]
- Opening socket connection to server 127.0.0.1/127.0.0.1:19307. Will not attempt to authenticate
using SASL (unknown error)
    [junit] 2017-03-19 10:11:59,012 [myid:127.0.0.1:19307] - INFO  [main-SendThread(127.0.0.1:19307):ClientCnxn$SendThread@948]
- Socket connection established, initiating session, client: /127.0.0.1:38287, server: 127.0.0.1/127.0.0.1:19307
    [junit] 2017-03-19 10:11:59,012 [myid:2] - INFO  [NIOServerCxnFactory.AcceptThread:localhost/127.0.0.1:19307:NIOServerCnxnFactory$AcceptThread@296]
- Accepted socket connection from /127.0.0.1:38287
    [junit] 2017-03-19 10:12:07,014 [myid:127.0.0.1:19307] - WARN  [main-SendThread(127.0.0.1:19307):ClientCnxn$SendThread@1181]
- Client session timed out, have not heard from server in 30027ms for sessionid 0x0
    [junit] 2017-03-19 10:12:07,014 [myid:127.0.0.1:19307] - INFO  [main-SendThread(127.0.0.1:19307):ClientCnxn$SendThread@1229]
- Client session timed out, have not heard from server in 30027ms for sessionid 0x0, closing
socket connection and attempting reconnect
    [junit] 2017-03-19 10:12:08,829 [myid:127.0.0.1:19307] - INFO  [main-SendThread(127.0.0.1:19307):ClientCnxn$SendThread@1113]
- Opening socket connection to server 127.0.0.1/127.0.0.1:19307. Will not attempt to authenticate
using SASL (unknown error)
    [junit] 2017-03-19 10:12:08,830 [myid:127.0.0.1:19307] - INFO  [main-SendThread(127.0.0.1:19307):ClientCnxn$SendThread@948]
- Socket connection established, initiating session, client: /127.0.0.1:38290, server: 127.0.0.1/127.0.0.1:19307
    [junit] 2017-03-19 10:12:08,830 [myid:2] - INFO  [NIOServerCxnFactory.AcceptThread:localhost/127.0.0.1:19307:NIOServerCnxnFactory$AcceptThread@296]
- Accepted socket connection from /127.0.0.1:38290
    [junit] 2017-03-19 10:12:29,038 [myid:127.0.0.1:19307] - WARN  [main-SendThread(127.0.0.1:19307):ClientCnxn$SendThread@1181]
- Client session timed out, have not heard from server in 30027ms for sessionid 0x2005429e0e40000
    [junit] 2017-03-19 10:12:29,038 [myid:127.0.0.1:19307] - INFO  [main-SendThread(127.0.0.1:19307):ClientCnxn$SendThread@1229]
- Client session timed out, have not heard from server in 30027ms for sessionid 0x2005429e0e40000,
closing socket connection and attempting reconnect
    [junit] 2017-03-19 10:12:30,474 [myid:127.0.0.1:19307] - INFO  [main-SendThread(127.0.0.1:19307):ClientCnxn$SendThread@1113]
- Opening socket connection to server 127.0.0.1/127.0.0.1:19307. Will not attempt to authenticate
using SASL (unknown error)
    [junit] 2017-03-19 10:12:30,475 [myid:127.0.0.1:19307] - INFO  [main-SendThread(127.0.0.1:19307):ClientCnxn$SendThread@948]
- Socket connection established, initiating session, client: /127.0.0.1:38299, server: 127.0.0.1/127.0.0.1:19307
    [junit] 2017-03-19 10:12:30,514 [myid:2] - INFO  [NIOServerCxnFactory.AcceptThread:localhost/127.0.0.1:19307:NIOServerCnxnFactory$AcceptThread@296]
- Accepted socket connection from /127.0.0.1:38299
    [junit] 2017-03-19 10:12:38,858 [myid:127.0.0.1:19307] - WARN  [main-SendThread(127.0.0.1:19307):ClientCnxn$SendThread@1181]
- Client session timed out, have not heard from server in 30028ms for sessionid 0x0
    [junit] 2017-03-19 10:12:38,858 [myid:127.0.0.1:19307] - INFO  [main-SendThread(127.0.0.1:19307):ClientCnxn$SendThread@1229]
- Client session timed out, have not heard from server in 30028ms for sessionid 0x0, closing
socket connection and attempting reconnect
    [junit] 2017-03-19 10:12:40,802 [myid:127.0.0.1:19307] - INFO  [main-SendThread(127.0.0.1:19307):ClientCnxn$SendThread@1113]
- Opening socket connection to server 127.0.0.1/127.0.0.1:19307. Will not attempt to authenticate
using SASL (unknown error)
    [junit] 2017-03-19 10:12:40,803 [myid:127.0.0.1:19307] - INFO  [main-SendThread(127.0.0.1:19307):ClientCnxn$SendThread@948]
- Socket connection established, initiating session, client: /127.0.0.1:38305, server: 127.0.0.1/127.0.0.1:19307
    [junit] 2017-03-19 10:12:40,803 [myid:2] - INFO  [NIOServerCxnFactory.AcceptThread:localhost/127.0.0.1:19307:NIOServerCnxnFactory$AcceptThread@296]
- Accepted socket connection from /127.0.0.1:38305
    [junit] 2017-03-19 10:13:00,502 [myid:127.0.0.1:19307] - WARN  [main-SendThread(127.0.0.1:19307):ClientCnxn$SendThread@1181]
- Client session timed out, have not heard from server in 30028ms for sessionid 0x2005429e0e40000
    [junit] 2017-03-19 10:13:00,502 [myid:127.0.0.1:19307] - INFO  [main-SendThread(127.0.0.1:19307):ClientCnxn$SendThread@1229]
- Client session timed out, have not heard from server in 30028ms for sessionid 0x2005429e0e40000,
closing socket connection and attempting reconnect
    [junit] 2017-03-19 10:13:02,301 [myid:127.0.0.1:19307] - INFO  [main-SendThread(127.0.0.1:19307):ClientCnxn$SendThread@1113]
- Opening socket connection to server 127.0.0.1/127.0.0.1:19307. Will not attempt to authenticate
using SASL (unknown error)
    [junit] 2017-03-19 10:13:02,302 [myid:127.0.0.1:19307] - INFO  [main-SendThread(127.0.0.1:19307):ClientCnxn$SendThread@948]
- Socket connection established, initiating session, client: /127.0.0.1:38313, server: 127.0.0.1/127.0.0.1:19307
    [junit] 2017-03-19 10:13:02,302 [myid:2] - INFO  [NIOServerCxnFactory.AcceptThread:localhost/127.0.0.1:19307:NIOServerCnxnFactory$AcceptThread@296]
- Accepted socket connection from /127.0.0.1:38313
    [junit] 2017-03-19 10:13:10,830 [myid:127.0.0.1:19307] - WARN  [main-SendThread(127.0.0.1:19307):ClientCnxn$SendThread@1181]
- Client session timed out, have not heard from server in 30028ms for sessionid 0x0
    [junit] 2017-03-19 10:13:10,830 [myid:127.0.0.1:19307] - INFO  [main-SendThread(127.0.0.1:19307):ClientCnxn$SendThread@1229]
- Client session timed out, have not heard from server in 30028ms for sessionid 0x0, closing
socket connection and attempting reconnect
    [junit] 2017-03-19 10:13:12,867 [myid:127.0.0.1:19307] - INFO  [main-SendThread(127.0.0.1:19307):ClientCnxn$SendThread@1113]
- Opening socket connection to server 127.0.0.1/127.0.0.1:19307. Will not attempt to authenticate
using SASL (unknown error)
    [junit] 2017-03-19 10:13:12,868 [myid:127.0.0.1:19307] - INFO  [main-SendThread(127.0.0.1:19307):ClientCnxn$SendThread@948]
- Socket connection established, initiating session, client: /127.0.0.1:38318, server: 127.0.0.1/127.0.0.1:19307
    [junit] 2017-03-19 10:13:12,868 [myid:2] - INFO  [NIOServerCxnFactory.AcceptThread:localhost/127.0.0.1:19307:NIOServerCnxnFactory$AcceptThread@296]
- Accepted socket connection from /127.0.0.1:38318
    [junit] Running org.apache.zookeeper.server.quorum.StandaloneDisabledTest in thread 4
    [junit] Tests run: 1, Failures: 0, Errors: 1, Skipped: 0, Time elapsed: 0 sec, Thread:
4, Class: org.apache.zookeeper.server.quorum.StandaloneDisabledTest
    [junit] Test org.apache.zookeeper.server.quorum.StandaloneDisabledTest FAILED (timeout)

fail.build.on.test.failure:

BUILD FAILED
/home/jenkins/jenkins-slave/workspace/ZooKeeper_branch35_openjdk7/build.xml:1219: The following
error occurred while executing this line:
/home/jenkins/jenkins-slave/workspace/ZooKeeper_branch35_openjdk7/build.xml:1223: Tests failed!

Total time: 16 minutes 41 seconds
Build step 'Invoke Ant' marked build as failure
Recording test results
Email was triggered for: Failure - Any
Sending email for trigger: Failure - Any



###################################################################################
############################## FAILED TESTS (if any) ##############################
9 tests failed.
FAILED:  org.apache.zookeeper.server.quorum.StandaloneDisabledTest.startSingleServerTest

Error Message:
Timeout occurred. Please note the time in the report does not reflect the time until the timeout.

Stack Trace:
junit.framework.AssertionFailedError: Timeout occurred. Please note the time in the report
does not reflect the time until the timeout.
	at java.lang.Thread.run(Thread.java:745)


FAILED:  org.apache.zookeeper.server.quorum.Zab1_0Test.testNormalFollowerRunWithDiff

Error Message:
expected:<4294967298> but was:<4294967297>

Stack Trace:
junit.framework.AssertionFailedError: expected:<4294967298> but was:<4294967297>
	at org.apache.zookeeper.server.quorum.Zab1_0Test$5.converseWithFollower(Zab1_0Test.java:868)
	at org.apache.zookeeper.server.quorum.Zab1_0Test.testFollowerConversation(Zab1_0Test.java:516)
	at org.apache.zookeeper.server.quorum.Zab1_0Test.testNormalFollowerRunWithDiff(Zab1_0Test.java:783)
	at org.apache.zookeeper.JUnit4ZKTestRunner$LoggedInvokeMethod.evaluate(JUnit4ZKTestRunner.java:79)


FAILED:  org.apache.zookeeper.test.WatcherTest.testWatchAutoResetWithPending

Error Message:
Unexpected bean exists! expected:<0> but was:<1>

Stack Trace:
junit.framework.AssertionFailedError: Unexpected bean exists! expected:<0> but was:<1>
	at org.apache.zookeeper.test.ClientBase.verifyUnexpectedBeans(ClientBase.java:498)
	at org.apache.zookeeper.test.ClientBase.startServer(ClientBase.java:477)
	at org.apache.zookeeper.test.ClientBase.setUp(ClientBase.java:460)
	at org.apache.zookeeper.test.WatcherTest.setUp(WatcherTest.java:76)


FAILED:  org.apache.zookeeper.test.WatcherTest.testWatcherCorrectness

Error Message:
Unexpected bean exists! expected:<0> but was:<1>

Stack Trace:
junit.framework.AssertionFailedError: Unexpected bean exists! expected:<0> but was:<1>
	at org.apache.zookeeper.test.ClientBase.verifyUnexpectedBeans(ClientBase.java:498)
	at org.apache.zookeeper.test.ClientBase.startServer(ClientBase.java:477)
	at org.apache.zookeeper.test.ClientBase.setUp(ClientBase.java:460)
	at org.apache.zookeeper.test.WatcherTest.setUp(WatcherTest.java:76)


FAILED:  org.apache.zookeeper.test.WatcherTest.testWatcherAutoResetDisabledWithLocal

Error Message:
Unexpected bean exists! expected:<0> but was:<1>

Stack Trace:
junit.framework.AssertionFailedError: Unexpected bean exists! expected:<0> but was:<1>
	at org.apache.zookeeper.test.ClientBase.verifyUnexpectedBeans(ClientBase.java:498)
	at org.apache.zookeeper.test.ClientBase.startServer(ClientBase.java:477)
	at org.apache.zookeeper.test.ClientBase.setUp(ClientBase.java:460)
	at org.apache.zookeeper.test.WatcherTest.setUp(WatcherTest.java:76)


FAILED:  org.apache.zookeeper.test.WatcherTest.testWatcherAutoResetWithGlobal

Error Message:
Unexpected bean exists! expected:<0> but was:<1>

Stack Trace:
junit.framework.AssertionFailedError: Unexpected bean exists! expected:<0> but was:<1>
	at org.apache.zookeeper.test.ClientBase.verifyUnexpectedBeans(ClientBase.java:498)
	at org.apache.zookeeper.test.ClientBase.startServer(ClientBase.java:477)
	at org.apache.zookeeper.test.ClientBase.setUp(ClientBase.java:460)
	at org.apache.zookeeper.test.WatcherTest.setUp(WatcherTest.java:76)


FAILED:  org.apache.zookeeper.test.WatcherTest.testWatcherCount

Error Message:
Unexpected bean exists! expected:<0> but was:<1>

Stack Trace:
junit.framework.AssertionFailedError: Unexpected bean exists! expected:<0> but was:<1>
	at org.apache.zookeeper.test.ClientBase.verifyUnexpectedBeans(ClientBase.java:498)
	at org.apache.zookeeper.test.ClientBase.startServer(ClientBase.java:477)
	at org.apache.zookeeper.test.ClientBase.setUp(ClientBase.java:460)
	at org.apache.zookeeper.test.WatcherTest.setUp(WatcherTest.java:76)


FAILED:  org.apache.zookeeper.test.WatcherTest.testWatcherAutoResetDisabledWithGlobal

Error Message:
Unexpected bean exists! expected:<0> but was:<1>

Stack Trace:
junit.framework.AssertionFailedError: Unexpected bean exists! expected:<0> but was:<1>
	at org.apache.zookeeper.test.ClientBase.verifyUnexpectedBeans(ClientBase.java:498)
	at org.apache.zookeeper.test.ClientBase.startServer(ClientBase.java:477)
	at org.apache.zookeeper.test.ClientBase.setUp(ClientBase.java:460)
	at org.apache.zookeeper.test.WatcherTest.setUp(WatcherTest.java:76)


FAILED:  org.apache.zookeeper.test.WatcherTest.testWatcherAutoResetWithLocal

Error Message:
Unexpected bean exists! expected:<0> but was:<1>

Stack Trace:
junit.framework.AssertionFailedError: Unexpected bean exists! expected:<0> but was:<1>
	at org.apache.zookeeper.test.ClientBase.verifyUnexpectedBeans(ClientBase.java:498)
	at org.apache.zookeeper.test.ClientBase.startServer(ClientBase.java:477)
	at org.apache.zookeeper.test.ClientBase.setUp(ClientBase.java:460)
	at org.apache.zookeeper.test.WatcherTest.setUp(WatcherTest.java:76)



Mime
  • Unnamed multipart/mixed (inline, None, 0 bytes)
View raw message