zookeeper-dev mailing list archives

Site index · List index
Message view « Date » · « Thread »
Top « Date » · « Thread »
From Apache Jenkins Server <jenk...@builds.apache.org>
Subject Failed: ZOOKEEPER- PreCommit Build #469
Date Wed, 22 Mar 2017 01:52:20 GMT
Build: https://builds.apache.org/job/PreCommit-ZOOKEEPER-github-pr-build/469/

###################################################################################
########################## LAST 60 LINES OF THE CONSOLE ###########################
[...truncated 2.04 KB...]
	at hudson.remoting.RemoteInvocationHandler$RPCRequest.call(RemoteInvocationHandler.java:828)
	at hudson.remoting.UserRequest.perform(UserRequest.java:153)
	at hudson.remoting.UserRequest.perform(UserRequest.java:50)
	at hudson.remoting.Request$2.run(Request.java:336)
	at hudson.remoting.InterceptingExecutorService$1.call(InterceptingExecutorService.java:68)
	at java.util.concurrent.FutureTask.run(FutureTask.java:262)
	at java.util.concurrent.ThreadPoolExecutor.runWorker(ThreadPoolExecutor.java:1145)
	at java.util.concurrent.ThreadPoolExecutor$Worker.run(ThreadPoolExecutor.java:615)
	at java.lang.Thread.run(Thread.java:745)
	at ......remote call to H7(Native Method)
	at hudson.remoting.Channel.attachCallSiteStackTrace(Channel.java:1537)
	at hudson.remoting.UserResponse.retrieve(UserRequest.java:253)
	at hudson.remoting.Channel.call(Channel.java:822)
	at hudson.remoting.RemoteInvocationHandler.invoke(RemoteInvocationHandler.java:256)
	at com.sun.proxy.$Proxy96.checkoutBranch(Unknown Source)
	at org.jenkinsci.plugins.gitclient.RemoteGitImpl.checkoutBranch(RemoteGitImpl.java:324)
	at com.cloudbees.jenkins.plugins.git.vmerge.BuildChooserImpl.getCandidateRevisions(BuildChooserImpl.java:78)
	at hudson.plugins.git.GitSCM.determineRevisionToBuild(GitSCM.java:995)
	at hudson.plugins.git.GitSCM.checkout(GitSCM.java:1102)
	at hudson.scm.SCM.checkout(SCM.java:495)
	at hudson.model.AbstractProject.checkout(AbstractProject.java:1278)
	at hudson.model.AbstractBuild$AbstractBuildExecution.defaultCheckout(AbstractBuild.java:604)
	at jenkins.scm.SCMCheckoutStrategy.checkout(SCMCheckoutStrategy.java:86)
	at hudson.model.AbstractBuild$AbstractBuildExecution.run(AbstractBuild.java:529)
	at hudson.model.Run.execute(Run.java:1728)
	at hudson.model.FreeStyleBuild.run(FreeStyleBuild.java:43)
	at hudson.model.ResourceController.execute(ResourceController.java:98)
	at hudson.model.Executor.run(Executor.java:404)
Caused by: hudson.plugins.git.GitException: Command "git checkout -f origin/trunk" returned
status code 1:
stdout: 
stderr: error: pathspec 'origin/trunk' did not match any file(s) known to git.

	at org.jenkinsci.plugins.gitclient.CliGitAPIImpl.launchCommandIn(CliGitAPIImpl.java:1793)
	at org.jenkinsci.plugins.gitclient.CliGitAPIImpl.access$800(CliGitAPIImpl.java:64)
	at org.jenkinsci.plugins.gitclient.CliGitAPIImpl$9.execute(CliGitAPIImpl.java:2060)
	at org.jenkinsci.plugins.gitclient.AbstractGitAPIImpl.checkoutBranch(AbstractGitAPIImpl.java:81)
	at org.jenkinsci.plugins.gitclient.CliGitAPIImpl.checkoutBranch(CliGitAPIImpl.java:64)
	at sun.reflect.NativeMethodAccessorImpl.invoke0(Native Method)
	at sun.reflect.NativeMethodAccessorImpl.invoke(NativeMethodAccessorImpl.java:57)
	at sun.reflect.DelegatingMethodAccessorImpl.invoke(DelegatingMethodAccessorImpl.java:43)
	at java.lang.reflect.Method.invoke(Method.java:606)
	at hudson.remoting.RemoteInvocationHandler$RPCRequest.perform(RemoteInvocationHandler.java:894)
	at hudson.remoting.RemoteInvocationHandler$RPCRequest.call(RemoteInvocationHandler.java:869)
	at hudson.remoting.RemoteInvocationHandler$RPCRequest.call(RemoteInvocationHandler.java:828)
	at hudson.remoting.UserRequest.perform(UserRequest.java:153)
	at hudson.remoting.UserRequest.perform(UserRequest.java:50)
	at hudson.remoting.Request$2.run(Request.java:336)
	at hudson.remoting.InterceptingExecutorService$1.call(InterceptingExecutorService.java:68)
	at java.util.concurrent.FutureTask.run(FutureTask.java:262)
	at java.util.concurrent.ThreadPoolExecutor.runWorker(ThreadPoolExecutor.java:1145)
	at java.util.concurrent.ThreadPoolExecutor$Worker.run(ThreadPoolExecutor.java:615)
	at java.lang.Thread.run(Thread.java:745)
Archiving artifacts
Recording test results
ERROR: Step ?Publish JUnit test result report? failed: No test report files were found. Configuration
error?
[description-setter] Could not determine description.
Putting comment on the pull request
Email was triggered for: Failure - Any
Sending email for trigger: Failure - Any



###################################################################################
############################## FAILED TESTS (if any) ##############################
No tests ran.
Mime
  • Unnamed multipart/mixed (inline, None, 0 bytes)
View raw message