zookeeper-dev mailing list archives

Site index · List index
Message view « Date » · « Thread »
Top « Date » · « Thread »
From Apache Jenkins Server <jenk...@builds.apache.org>
Subject ZooKeeper_branch35_openjdk7 - Build # 441 - Still Failing
Date Tue, 07 Mar 2017 10:12:42 GMT
See https://builds.apache.org/job/ZooKeeper_branch35_openjdk7/441/

###################################################################################
########################## LAST 60 LINES OF THE CONSOLE ###########################
[...truncated 57.61 MB...]
    [junit] 2017-03-07 10:11:43,213 [myid:] - INFO  [SyncThread:0:MBeanRegistry@128] - Unregister
MBean [org.apache.ZooKeeperService:name0=StandaloneServer_port27623,name1=Connections,name2=127.0.0.1,name3=0x1001669a5e20000]
    [junit] 2017-03-07 10:11:43,314 [myid:] - INFO  [main:ZooKeeper@1324] - Session: 0x1001669a5e20000
closed
    [junit] 2017-03-07 10:11:43,314 [myid:] - INFO  [main-EventThread:ClientCnxn$EventThread@513]
- EventThread shut down for session: 0x1001669a5e20000
    [junit] 2017-03-07 10:11:43,314 [myid:] - INFO  [main:JUnit4ZKTestRunner$LoggedInvokeMethod@82]
- Memory used 59836
    [junit] 2017-03-07 10:11:43,315 [myid:] - INFO  [main:JUnit4ZKTestRunner$LoggedInvokeMethod@87]
- Number of threads 478
    [junit] 2017-03-07 10:11:43,315 [myid:] - INFO  [main:JUnit4ZKTestRunner$LoggedInvokeMethod@102]
- FINISHED TEST METHOD testWatcherAutoResetWithLocal
    [junit] 2017-03-07 10:11:43,315 [myid:] - INFO  [main:ClientBase@543] - tearDown starting
    [junit] 2017-03-07 10:11:43,315 [myid:] - INFO  [main:ClientBase@513] - STOPPING server
    [junit] 2017-03-07 10:11:43,315 [myid:] - INFO  [main:NettyServerCnxnFactory@464] - shutdown
called 0.0.0.0/0.0.0.0:27623
    [junit] 2017-03-07 10:11:43,316 [myid:] - INFO  [main:ZooKeeperServer@541] - shutting
down
    [junit] 2017-03-07 10:11:43,316 [myid:] - ERROR [main:ZooKeeperServer@505] - ZKShutdownHandler
is not registered, so ZooKeeper server won't take any action on ERROR or SHUTDOWN server state
changes
    [junit] 2017-03-07 10:11:43,316 [myid:] - INFO  [main:SessionTrackerImpl@232] - Shutting
down
    [junit] 2017-03-07 10:11:43,316 [myid:] - INFO  [main:PrepRequestProcessor@973] - Shutting
down
    [junit] 2017-03-07 10:11:43,316 [myid:] - INFO  [main:SyncRequestProcessor@191] - Shutting
down
    [junit] 2017-03-07 10:11:43,316 [myid:] - INFO  [ProcessThread(sid:0 cport:27623)::PrepRequestProcessor@154]
- PrepRequestProcessor exited loop!
    [junit] 2017-03-07 10:11:43,316 [myid:] - INFO  [SyncThread:0:SyncRequestProcessor@169]
- SyncRequestProcessor exited!
    [junit] 2017-03-07 10:11:43,316 [myid:] - INFO  [main:FinalRequestProcessor@479] - shutdown
of request processor complete
    [junit] 2017-03-07 10:11:43,316 [myid:] - INFO  [main:MBeanRegistry@128] - Unregister
MBean [org.apache.ZooKeeperService:name0=StandaloneServer_port27623,name1=InMemoryDataTree]
    [junit] 2017-03-07 10:11:43,318 [myid:] - INFO  [main:MBeanRegistry@128] - Unregister
MBean [org.apache.ZooKeeperService:name0=StandaloneServer_port27623]
    [junit] 2017-03-07 10:11:43,318 [myid:] - INFO  [main:FourLetterWordMain@85] - connecting
to 127.0.0.1 27623
    [junit] 2017-03-07 10:11:43,318 [myid:] - INFO  [main:JMXEnv@146] - ensureOnly:[]
    [junit] 2017-03-07 10:11:43,322 [myid:] - INFO  [main:ClientBase@568] - fdcount after
test is: 1400 at start it was 1400
    [junit] 2017-03-07 10:11:43,322 [myid:] - INFO  [main:ZKTestCase$1@68] - SUCCEEDED testWatcherAutoResetWithLocal
    [junit] 2017-03-07 10:11:43,322 [myid:] - INFO  [main:ZKTestCase$1@63] - FINISHED testWatcherAutoResetWithLocal
    [junit] Tests run: 103, Failures: 1, Errors: 0, Skipped: 0, Time elapsed: 508.677 sec,
Thread: 7, Class: org.apache.zookeeper.test.NioNettySuiteTest
    [junit] 2017-03-07 10:11:43,391 [myid:127.0.0.1:27485] - INFO  [main-SendThread(127.0.0.1:27485):ClientCnxn$SendThread@1113]
- Opening socket connection to server 127.0.0.1/127.0.0.1:27485. Will not attempt to authenticate
using SASL (unknown error)
    [junit] 2017-03-07 10:11:43,392 [myid:127.0.0.1:27485] - WARN  [main-SendThread(127.0.0.1:27485):ClientCnxn$SendThread@1235]
- Session 0x100166496530002 for server 127.0.0.1/127.0.0.1:27485, unexpected error, closing
socket connection and attempting reconnect
    [junit] java.net.ConnectException: Connection refused
    [junit] 	at sun.nio.ch.SocketChannelImpl.checkConnect(Native Method)
    [junit] 	at sun.nio.ch.SocketChannelImpl.finishConnect(SocketChannelImpl.java:739)
    [junit] 	at org.apache.zookeeper.ClientCnxnSocketNIO.doTransport(ClientCnxnSocketNIO.java:357)
    [junit] 	at org.apache.zookeeper.ClientCnxn$SendThread.run(ClientCnxn.java:1214)
    [junit] 2017-03-07 10:11:43,642 [myid:127.0.0.1:27479] - INFO  [main-SendThread(127.0.0.1:27479):ClientCnxn$SendThread@1113]
- Opening socket connection to server 127.0.0.1/127.0.0.1:27479. Will not attempt to authenticate
using SASL (unknown error)
    [junit] 2017-03-07 10:11:43,643 [myid:127.0.0.1:27479] - WARN  [main-SendThread(127.0.0.1:27479):ClientCnxn$SendThread@1235]
- Session 0x200166496540000 for server 127.0.0.1/127.0.0.1:27479, unexpected error, closing
socket connection and attempting reconnect
    [junit] java.net.ConnectException: Connection refused
    [junit] 	at sun.nio.ch.SocketChannelImpl.checkConnect(Native Method)
    [junit] 	at sun.nio.ch.SocketChannelImpl.finishConnect(SocketChannelImpl.java:739)
    [junit] 	at org.apache.zookeeper.ClientCnxnSocketNIO.doTransport(ClientCnxnSocketNIO.java:357)
    [junit] 	at org.apache.zookeeper.ClientCnxn$SendThread.run(ClientCnxn.java:1214)
    [junit] 2017-03-07 10:11:43,670 [myid:127.0.0.1:27506] - INFO  [main-SendThread(127.0.0.1:27506):ClientCnxn$SendThread@1113]
- Opening socket connection to server 127.0.0.1/127.0.0.1:27506. Will not attempt to authenticate
using SASL (unknown error)
    [junit] 2017-03-07 10:11:43,671 [myid:127.0.0.1:27506] - WARN  [main-SendThread(127.0.0.1:27506):ClientCnxn$SendThread@1235]
- Session 0x300166646f00000 for server 127.0.0.1/127.0.0.1:27506, unexpected error, closing
socket connection and attempting reconnect
    [junit] java.net.ConnectException: Connection refused
    [junit] 	at sun.nio.ch.SocketChannelImpl.checkConnect(Native Method)
    [junit] 	at sun.nio.ch.SocketChannelImpl.finishConnect(SocketChannelImpl.java:739)
    [junit] 	at org.apache.zookeeper.ClientCnxnSocketNIO.doTransport(ClientCnxnSocketNIO.java:357)
    [junit] 	at org.apache.zookeeper.ClientCnxn$SendThread.run(ClientCnxn.java:1214)
    [junit] Test org.apache.zookeeper.test.NioNettySuiteTest FAILED

fail.build.on.test.failure:

BUILD FAILED
/home/jenkins/jenkins-slave/workspace/ZooKeeper_branch35_openjdk7/build.xml:1211: The following
error occurred while executing this line:
/home/jenkins/jenkins-slave/workspace/ZooKeeper_branch35_openjdk7/build.xml:1215: Tests failed!

Total time: 13 minutes 34 seconds
Build step 'Invoke Ant' marked build as failure
Recording test results
Email was triggered for: Failure - Any
Sending email for trigger: Failure - Any



###################################################################################
############################## FAILED TESTS (if any) ##############################
1 tests failed.
FAILED:  org.apache.zookeeper.test.ReconfigTest.testPortChange

Error Message:
null

Stack Trace:
junit.framework.AssertionFailedError
	at org.apache.zookeeper.test.ReconfigTest.testPortChange(ReconfigTest.java:681)
	at org.apache.zookeeper.JUnit4ZKTestRunner$LoggedInvokeMethod.evaluate(JUnit4ZKTestRunner.java:79)



Mime
  • Unnamed multipart/mixed (inline, None, 0 bytes)
View raw message