zookeeper-dev mailing list archives

Site index · List index
Message view « Date » · « Thread »
Top « Date » · « Thread »
From Apache Jenkins Server <jenk...@builds.apache.org>
Subject ZooKeeper-trunk - Build # 3334 - Still Failing
Date Mon, 27 Mar 2017 18:47:30 GMT
See https://builds.apache.org/job/ZooKeeper-trunk/3334/

###################################################################################
########################## LAST 60 LINES OF THE CONSOLE ###########################
[...truncated 62.20 MB...]
    [junit] 2017-03-27 18:46:44,176 [myid:] - INFO  [main:JUnit4ZKTestRunner$LoggedInvokeMethod@102]
- FINISHED TEST METHOD testManyChildWatchersAutoReset
    [junit] 2017-03-27 18:46:44,176 [myid:] - INFO  [main:ClientBase@558] - tearDown starting
    [junit] 2017-03-27 18:46:44,177 [myid:] - INFO  [ProcessThread(sid:0 cport:16611)::PrepRequestProcessor@617]
- Processed session termination for sessionid: 0x104a48b01c30000
    [junit] 2017-03-27 18:46:44,218 [myid:] - INFO  [main:ZooKeeper@1324] - Session: 0x104a48b01c30000
closed
    [junit] 2017-03-27 18:46:44,218 [myid:] - INFO  [main-EventThread:ClientCnxn$EventThread@513]
- EventThread shut down for session: 0x104a48b01c30000
    [junit] 2017-03-27 18:46:44,218 [myid:] - INFO  [NIOWorkerThread-25:MBeanRegistry@128]
- Unregister MBean [org.apache.ZooKeeperService:name0=StandaloneServer_port16611,name1=Connections,name2=127.0.0.1,name3=0x104a48b01c30000]
    [junit] 2017-03-27 18:46:44,219 [myid:] - INFO  [ProcessThread(sid:0 cport:16611)::PrepRequestProcessor@617]
- Processed session termination for sessionid: 0x104a48b01c30001
    [junit] 2017-03-27 18:46:44,219 [myid:] - INFO  [NIOWorkerThread-25:NIOServerCnxn@627]
- Closed socket connection for client /127.0.0.1:51863 which had sessionid 0x104a48b01c30000
    [junit] 2017-03-27 18:46:44,260 [myid:] - INFO  [NIOWorkerThread-19:MBeanRegistry@128]
- Unregister MBean [org.apache.ZooKeeperService:name0=StandaloneServer_port16611,name1=Connections,name2=127.0.0.1,name3=0x104a48b01c30001]
    [junit] 2017-03-27 18:46:44,261 [myid:] - INFO  [NIOWorkerThread-19:NIOServerCnxn@627]
- Closed socket connection for client /127.0.0.1:51884 which had sessionid 0x104a48b01c30001
    [junit] 2017-03-27 18:46:44,261 [myid:] - INFO  [main:ZooKeeper@1324] - Session: 0x104a48b01c30001
closed
    [junit] 2017-03-27 18:46:44,261 [myid:] - INFO  [main:ClientBase@528] - STOPPING server
    [junit] 2017-03-27 18:46:44,261 [myid:] - INFO  [main-EventThread:ClientCnxn$EventThread@513]
- EventThread shut down for session: 0x104a48b01c30001
    [junit] 2017-03-27 18:46:44,262 [myid:] - INFO  [NIOServerCxnFactory.AcceptThread:0.0.0.0/0.0.0.0:16611:NIOServerCnxnFactory$AcceptThread@219]
- accept thread exitted run method
    [junit] 2017-03-27 18:46:44,263 [myid:] - INFO  [ConnnectionExpirer:NIOServerCnxnFactory$ConnectionExpirerThread@583]
- ConnnectionExpirerThread interrupted
    [junit] 2017-03-27 18:46:44,269 [myid:] - INFO  [NIOServerCxnFactory.SelectorThread-0:NIOServerCnxnFactory$SelectorThread@420]
- selector thread exitted run method
    [junit] 2017-03-27 18:46:44,270 [myid:] - INFO  [NIOServerCxnFactory.SelectorThread-1:NIOServerCnxnFactory$SelectorThread@420]
- selector thread exitted run method
    [junit] 2017-03-27 18:46:44,270 [myid:] - INFO  [main:ZooKeeperServer@542] - shutting
down
    [junit] 2017-03-27 18:46:44,270 [myid:] - ERROR [main:ZooKeeperServer@506] - ZKShutdownHandler
is not registered, so ZooKeeper server won't take any action on ERROR or SHUTDOWN server state
changes
    [junit] 2017-03-27 18:46:44,270 [myid:] - INFO  [main:SessionTrackerImpl@232] - Shutting
down
    [junit] 2017-03-27 18:46:44,270 [myid:] - INFO  [main:PrepRequestProcessor@1008] - Shutting
down
    [junit] 2017-03-27 18:46:44,270 [myid:] - INFO  [main:SyncRequestProcessor@191] - Shutting
down
    [junit] 2017-03-27 18:46:44,270 [myid:] - INFO  [ProcessThread(sid:0 cport:16611)::PrepRequestProcessor@157]
- PrepRequestProcessor exited loop!
    [junit] 2017-03-27 18:46:44,270 [myid:] - INFO  [SyncThread:0:SyncRequestProcessor@169]
- SyncRequestProcessor exited!
    [junit] 2017-03-27 18:46:44,271 [myid:] - INFO  [main:FinalRequestProcessor@481] - shutdown
of request processor complete
    [junit] 2017-03-27 18:46:44,271 [myid:] - INFO  [main:MBeanRegistry@128] - Unregister
MBean [org.apache.ZooKeeperService:name0=StandaloneServer_port16611,name1=InMemoryDataTree]
    [junit] 2017-03-27 18:46:44,271 [myid:] - INFO  [main:MBeanRegistry@128] - Unregister
MBean [org.apache.ZooKeeperService:name0=StandaloneServer_port16611]
    [junit] 2017-03-27 18:46:44,272 [myid:] - INFO  [main:FourLetterWordMain@85] - connecting
to 127.0.0.1 16611
    [junit] 2017-03-27 18:46:44,272 [myid:] - INFO  [main:JMXEnv@146] - ensureOnly:[]
    [junit] 2017-03-27 18:46:44,295 [myid:] - INFO  [main:ClientBase@583] - fdcount after
test is: 53 at start it was 53
    [junit] 2017-03-27 18:46:44,295 [myid:] - INFO  [main:ZKTestCase$1@68] - SUCCEEDED testManyChildWatchersAutoReset
    [junit] 2017-03-27 18:46:44,295 [myid:] - INFO  [main:ZKTestCase$1@63] - FINISHED testManyChildWatchersAutoReset
    [junit] Tests run: 4, Failures: 0, Errors: 0, Skipped: 0, Time elapsed: 757.365 sec, Thread:
3, Class: org.apache.zookeeper.test.DisconnectedWatcherTest

fail.build.on.test.failure:

BUILD FAILED
/home/jenkins/jenkins-slave/workspace/ZooKeeper-trunk/build.xml:1338: The following error
occurred while executing this line:
/home/jenkins/jenkins-slave/workspace/ZooKeeper-trunk/build.xml:1219: The following error
occurred while executing this line:
/home/jenkins/jenkins-slave/workspace/ZooKeeper-trunk/build.xml:1223: Tests failed!

Total time: 16 minutes 30 seconds
Build step 'Execute shell' marked build as failure
[FINDBUGS] Skipping publisher since build result is FAILURE
[WARNINGS] Skipping publisher since build result is FAILURE
Archiving artifacts
Setting JDK_1_7_LATEST__HOME=/home/jenkins/tools/java/latest1.7
Recording fingerprints
Setting JDK_1_7_LATEST__HOME=/home/jenkins/tools/java/latest1.7
[JIRA] Updating issue ZOOKEEPER-2737
Recording test results
Setting JDK_1_7_LATEST__HOME=/home/jenkins/tools/java/latest1.7
Publishing Javadoc
Setting JDK_1_7_LATEST__HOME=/home/jenkins/tools/java/latest1.7
Setting JDK_1_7_LATEST__HOME=/home/jenkins/tools/java/latest1.7
Email was triggered for: Failure - Any
Sending email for trigger: Failure - Any
Setting JDK_1_7_LATEST__HOME=/home/jenkins/tools/java/latest1.7
Setting JDK_1_7_LATEST__HOME=/home/jenkins/tools/java/latest1.7



###################################################################################
############################## FAILED TESTS (if any) ##############################
2 tests failed.
FAILED:  org.apache.zookeeper.server.quorum.Zab1_0Test.testNormalFollowerRunWithDiff

Error Message:
expected:<4294967298> but was:<4294967297>

Stack Trace:
junit.framework.AssertionFailedError: expected:<4294967298> but was:<4294967297>
	at org.apache.zookeeper.server.quorum.Zab1_0Test$5.converseWithFollower(Zab1_0Test.java:869)
	at org.apache.zookeeper.server.quorum.Zab1_0Test.testFollowerConversation(Zab1_0Test.java:517)
	at org.apache.zookeeper.server.quorum.Zab1_0Test.testNormalFollowerRunWithDiff(Zab1_0Test.java:784)
	at org.apache.zookeeper.JUnit4ZKTestRunner$LoggedInvokeMethod.evaluate(JUnit4ZKTestRunner.java:79)


FAILED:  org.apache.zookeeper.test.WatchEventWhenAutoResetTest.testNodeDataChanged

Error Message:
expected:<NodeDataChanged> but was:<NodeDeleted>

Stack Trace:
junit.framework.AssertionFailedError: expected:<NodeDataChanged> but was:<NodeDeleted>
	at org.apache.zookeeper.test.WatchEventWhenAutoResetTest$EventsWatcher.assertEvent(WatchEventWhenAutoResetTest.java:67)
	at org.apache.zookeeper.test.WatchEventWhenAutoResetTest.testNodeDataChanged(WatchEventWhenAutoResetTest.java:126)
	at org.apache.zookeeper.JUnit4ZKTestRunner$LoggedInvokeMethod.evaluate(JUnit4ZKTestRunner.java:79)



Mime
  • Unnamed multipart/mixed (inline, None, 0 bytes)
View raw message